hbase-builds mailing list archives

Site index · List index
Message view « Date » · « Thread »
Top « Date » · « Thread »
From Apache Jenkins Server <jenk...@builds.apache.org>
Subject Build failed in Jenkins: HBase-0.98-on-Hadoop-1.1 #928
Date Sun, 03 May 2015 15:39:28 GMT
See <https://builds.apache.org/job/HBase-0.98-on-Hadoop-1.1/928/changes>

Changes:

[larsh] HBASE-13333 Renew Scanner Lease without advancing the RegionScanner.

------------------------------------------
[...truncated 1799 lines...]
	at org.apache.hadoop.hbase.regionserver.wal.HLogFactory.createHLog(HLogFactory.java:47)
	at org.apache.hadoop.hbase.regionserver.HRegion.createHRegion(HRegion.java:4510)
	at org.apache.hadoop.hbase.regionserver.HRegion.createHRegion(HRegion.java:4477)
	at org.apache.hadoop.hbase.regionserver.HRegion.createHRegion(HRegion.java:4450)
	at org.apache.hadoop.hbase.regionserver.HRegion.createHRegion(HRegion.java:4528)
	at org.apache.hadoop.hbase.regionserver.HRegion.createHRegion(HRegion.java:4408)
	at org.apache.hadoop.hbase.HBaseTestingUtility.createTestRegion(HBaseTestingUtility.java:3439)
	at org.apache.hadoop.hbase.io.hfile.TestCacheOnWrite.testNotCachingDataBlocksDuringCompactionInternals(TestCacheOnWrite.java:429)
	at org.apache.hadoop.hbase.io.hfile.TestCacheOnWrite.testNotCachingDataBlocksDuringCompaction(TestCacheOnWrite.java:486)

testNotCachingDataBlocksDuringCompaction[105](org.apache.hadoop.hbase.io.hfile.TestCacheOnWrite)
 Time elapsed: 0.096 sec  <<< ERROR!
java.lang.OutOfMemoryError: unable to create new native thread
	at java.lang.Thread.start0(Native Method)
	at java.lang.Thread.start(Thread.java:693)
	at org.apache.hadoop.hbase.util.HasThread.start(HasThread.java:85)
	at org.apache.hadoop.hbase.regionserver.wal.FSHLog.<init>(FSHLog.java:436)
	at org.apache.hadoop.hbase.regionserver.wal.FSHLog.<init>(FSHLog.java:296)
	at org.apache.hadoop.hbase.regionserver.wal.HLogFactory.createHLog(HLogFactory.java:47)
	at org.apache.hadoop.hbase.regionserver.HRegion.createHRegion(HRegion.java:4510)
	at org.apache.hadoop.hbase.regionserver.HRegion.createHRegion(HRegion.java:4477)
	at org.apache.hadoop.hbase.regionserver.HRegion.createHRegion(HRegion.java:4450)
	at org.apache.hadoop.hbase.regionserver.HRegion.createHRegion(HRegion.java:4528)
	at org.apache.hadoop.hbase.regionserver.HRegion.createHRegion(HRegion.java:4408)
	at org.apache.hadoop.hbase.HBaseTestingUtility.createTestRegion(HBaseTestingUtility.java:3439)
	at org.apache.hadoop.hbase.io.hfile.TestCacheOnWrite.testNotCachingDataBlocksDuringCompactionInternals(TestCacheOnWrite.java:429)
	at org.apache.hadoop.hbase.io.hfile.TestCacheOnWrite.testNotCachingDataBlocksDuringCompaction(TestCacheOnWrite.java:485)

testNotCachingDataBlocksDuringCompaction[106](org.apache.hadoop.hbase.io.hfile.TestCacheOnWrite)
 Time elapsed: 0.095 sec  <<< ERROR!
java.lang.OutOfMemoryError: unable to create new native thread
	at java.lang.Thread.start0(Native Method)
	at java.lang.Thread.start(Thread.java:693)
	at org.apache.hadoop.hbase.util.HasThread.start(HasThread.java:85)
	at org.apache.hadoop.hbase.regionserver.wal.FSHLog.<init>(FSHLog.java:436)
	at org.apache.hadoop.hbase.regionserver.wal.FSHLog.<init>(FSHLog.java:296)
	at org.apache.hadoop.hbase.regionserver.wal.HLogFactory.createHLog(HLogFactory.java:47)
	at org.apache.hadoop.hbase.regionserver.HRegion.createHRegion(HRegion.java:4510)
	at org.apache.hadoop.hbase.regionserver.HRegion.createHRegion(HRegion.java:4477)
	at org.apache.hadoop.hbase.regionserver.HRegion.createHRegion(HRegion.java:4450)
	at org.apache.hadoop.hbase.regionserver.HRegion.createHRegion(HRegion.java:4528)
	at org.apache.hadoop.hbase.regionserver.HRegion.createHRegion(HRegion.java:4408)
	at org.apache.hadoop.hbase.HBaseTestingUtility.createTestRegion(HBaseTestingUtility.java:3439)
	at org.apache.hadoop.hbase.io.hfile.TestCacheOnWrite.testNotCachingDataBlocksDuringCompactionInternals(TestCacheOnWrite.java:429)
	at org.apache.hadoop.hbase.io.hfile.TestCacheOnWrite.testNotCachingDataBlocksDuringCompaction(TestCacheOnWrite.java:485)

testNotCachingDataBlocksDuringCompaction[107](org.apache.hadoop.hbase.io.hfile.TestCacheOnWrite)
 Time elapsed: 0.097 sec  <<< ERROR!
java.lang.OutOfMemoryError: unable to create new native thread
	at java.lang.Thread.start0(Native Method)
	at java.lang.Thread.start(Thread.java:693)
	at org.apache.hadoop.hbase.util.HasThread.start(HasThread.java:85)
	at org.apache.hadoop.hbase.regionserver.wal.FSHLog.<init>(FSHLog.java:436)
	at org.apache.hadoop.hbase.regionserver.wal.FSHLog.<init>(FSHLog.java:296)
	at org.apache.hadoop.hbase.regionserver.wal.HLogFactory.createHLog(HLogFactory.java:47)
	at org.apache.hadoop.hbase.regionserver.HRegion.createHRegion(HRegion.java:4510)
	at org.apache.hadoop.hbase.regionserver.HRegion.createHRegion(HRegion.java:4477)
	at org.apache.hadoop.hbase.regionserver.HRegion.createHRegion(HRegion.java:4450)
	at org.apache.hadoop.hbase.regionserver.HRegion.createHRegion(HRegion.java:4528)
	at org.apache.hadoop.hbase.regionserver.HRegion.createHRegion(HRegion.java:4408)
	at org.apache.hadoop.hbase.HBaseTestingUtility.createTestRegion(HBaseTestingUtility.java:3439)
	at org.apache.hadoop.hbase.io.hfile.TestCacheOnWrite.testNotCachingDataBlocksDuringCompactionInternals(TestCacheOnWrite.java:429)
	at org.apache.hadoop.hbase.io.hfile.TestCacheOnWrite.testNotCachingDataBlocksDuringCompaction(TestCacheOnWrite.java:485)

Running org.apache.hadoop.hbase.io.hfile.TestHFileBlockIndex
Tests run: 10, Failures: 0, Errors: 0, Skipped: 0, Time elapsed: 9.996 sec - in org.apache.hadoop.hbase.io.hfile.TestHFileBlockIndex
Running org.apache.hadoop.hbase.io.hfile.TestScannerSelectionUsingTTL
Tests run: 6, Failures: 0, Errors: 0, Skipped: 0, Time elapsed: 61.925 sec - in org.apache.hadoop.hbase.io.hfile.TestScannerSelectionUsingTTL
Running org.apache.hadoop.hbase.io.hfile.slab.TestSingleSizeCache
Tests run: 5, Failures: 0, Errors: 0, Skipped: 0, Time elapsed: 47.057 sec - in org.apache.hadoop.hbase.io.hfile.slab.TestSingleSizeCache
Running org.apache.hadoop.hbase.io.hfile.slab.TestSlabCache
Tests run: 7, Failures: 0, Errors: 0, Skipped: 0, Time elapsed: 13.67 sec - in org.apache.hadoop.hbase.io.hfile.slab.TestSlabCache
Running org.apache.hadoop.hbase.io.hfile.TestHFileBlock
Tests run: 28, Failures: 0, Errors: 0, Skipped: 0, Time elapsed: 97.171 sec - in org.apache.hadoop.hbase.io.hfile.TestHFileBlock
Running org.apache.hadoop.hbase.io.hfile.TestForceCacheImportantBlocks
Tests run: 4, Failures: 0, Errors: 0, Skipped: 0, Time elapsed: 44.574 sec - in org.apache.hadoop.hbase.io.hfile.TestForceCacheImportantBlocks
Running org.apache.hadoop.hbase.io.hfile.TestHFileSeek
Tests run: 1, Failures: 0, Errors: 0, Skipped: 0, Time elapsed: 3.943 sec - in org.apache.hadoop.hbase.io.hfile.TestHFileSeek
Running org.apache.hadoop.hbase.io.TestFileLink
Tests run: 3, Failures: 0, Errors: 0, Skipped: 0, Time elapsed: 12.949 sec - in org.apache.hadoop.hbase.io.TestFileLink
Running org.apache.hadoop.hbase.constraint.TestConstraint
Tests run: 5, Failures: 0, Errors: 0, Skipped: 0, Time elapsed: 11.596 sec - in org.apache.hadoop.hbase.constraint.TestConstraint
Running org.apache.hadoop.hbase.filter.TestColumnRangeFilter
Tests run: 1, Failures: 0, Errors: 0, Skipped: 0, Time elapsed: 8.552 sec - in org.apache.hadoop.hbase.filter.TestColumnRangeFilter
Running org.apache.hadoop.hbase.filter.TestFuzzyRowAndColumnRangeFilter
Tests run: 1, Failures: 0, Errors: 0, Skipped: 0, Time elapsed: 3.445 sec - in org.apache.hadoop.hbase.filter.TestFuzzyRowAndColumnRangeFilter
Running org.apache.hadoop.hbase.filter.TestFilterWithScanLimits
Tests run: 1, Failures: 0, Errors: 0, Skipped: 0, Time elapsed: 3.928 sec - in org.apache.hadoop.hbase.filter.TestFilterWithScanLimits
Running org.apache.hadoop.hbase.filter.TestFilterWrapper
Tests run: 1, Failures: 0, Errors: 0, Skipped: 0, Time elapsed: 3.452 sec - in org.apache.hadoop.hbase.filter.TestFilterWrapper
Running org.apache.hadoop.hbase.TestGlobalMemStoreSize
Tests run: 1, Failures: 0, Errors: 0, Skipped: 0, Time elapsed: 14.749 sec - in org.apache.hadoop.hbase.TestGlobalMemStoreSize
Running org.apache.hadoop.hbase.TestNamespace
Tests run: 9, Failures: 0, Errors: 0, Skipped: 1, Time elapsed: 10.321 sec - in org.apache.hadoop.hbase.TestNamespace
Running org.apache.hadoop.hbase.migration.TestUpgradeTo96
Tests run: 5, Failures: 0, Errors: 0, Skipped: 0, Time elapsed: 6.557 sec - in org.apache.hadoop.hbase.migration.TestUpgradeTo96
Running org.apache.hadoop.hbase.migration.TestNamespaceUpgrade
Tests run: 5, Failures: 0, Errors: 0, Skipped: 0, Time elapsed: 38.608 sec - in org.apache.hadoop.hbase.migration.TestNamespaceUpgrade
Running org.apache.hadoop.hbase.replication.TestReplicationSource
Tests run: 1, Failures: 0, Errors: 0, Skipped: 0, Time elapsed: 0.668 sec - in org.apache.hadoop.hbase.replication.TestReplicationSource
Running org.apache.hadoop.hbase.replication.TestReplicationWithTags
Tests run: 1, Failures: 0, Errors: 0, Skipped: 0, Time elapsed: 8.206 sec - in org.apache.hadoop.hbase.replication.TestReplicationWithTags
Running org.apache.hadoop.hbase.replication.TestPerTableCFReplication
Tests run: 2, Failures: 0, Errors: 0, Skipped: 0, Time elapsed: 36.629 sec - in org.apache.hadoop.hbase.replication.TestPerTableCFReplication
Running org.apache.hadoop.hbase.replication.TestReplicationChangingPeerRegionservers
Tests run: 1, Failures: 0, Errors: 0, Skipped: 0, Time elapsed: 11.068 sec - in org.apache.hadoop.hbase.replication.TestReplicationChangingPeerRegionservers
Running org.apache.hadoop.hbase.replication.TestReplicationSmallTests
Tests run: 10, Failures: 0, Errors: 0, Skipped: 0, Time elapsed: 52.75 sec - in org.apache.hadoop.hbase.replication.TestReplicationSmallTests
Running org.apache.hadoop.hbase.replication.TestMultiSlaveReplication
Tests run: 1, Failures: 0, Errors: 0, Skipped: 0, Time elapsed: 35.188 sec - in org.apache.hadoop.hbase.replication.TestMultiSlaveReplication
Running org.apache.hadoop.hbase.replication.TestReplicationKillSlaveRS
Tests run: 1, Failures: 0, Errors: 0, Skipped: 0, Time elapsed: 27.726 sec - in org.apache.hadoop.hbase.replication.TestReplicationKillSlaveRS
Running org.apache.hadoop.hbase.replication.TestMasterReplication
Tests run: 3, Failures: 0, Errors: 0, Skipped: 0, Time elapsed: 88.108 sec - in org.apache.hadoop.hbase.replication.TestMasterReplication
Running org.apache.hadoop.hbase.replication.regionserver.TestReplicationHLogReaderManager
Tests run: 8, Failures: 0, Errors: 0, Skipped: 0, Time elapsed: 286.053 sec - in org.apache.hadoop.hbase.replication.regionserver.TestReplicationHLogReaderManager
Running org.apache.hadoop.hbase.replication.regionserver.TestReplicationSourceManager
Tests run: 4, Failures: 0, Errors: 0, Skipped: 0, Time elapsed: 3.62 sec - in org.apache.hadoop.hbase.replication.regionserver.TestReplicationSourceManager
Running org.apache.hadoop.hbase.replication.regionserver.TestReplicationSink
Tests run: 5, Failures: 0, Errors: 0, Skipped: 0, Time elapsed: 5.105 sec - in org.apache.hadoop.hbase.replication.regionserver.TestReplicationSink
Running org.apache.hadoop.hbase.replication.TestReplicationStateZKImpl
Tests run: 6, Failures: 0, Errors: 0, Skipped: 0, Time elapsed: 0.897 sec - in org.apache.hadoop.hbase.replication.TestReplicationStateZKImpl
Running org.apache.hadoop.hbase.replication.TestReplicationEndpoint
Tests run: 3, Failures: 0, Errors: 0, Skipped: 0, Time elapsed: 6.34 sec - in org.apache.hadoop.hbase.replication.TestReplicationEndpoint
Running org.apache.hadoop.hbase.replication.TestReplicationSyncUpTool
Tests run: 1, Failures: 0, Errors: 0, Skipped: 0, Time elapsed: 56.906 sec - in org.apache.hadoop.hbase.replication.TestReplicationSyncUpTool
Running org.apache.hadoop.hbase.replication.TestReplicationTrackerZKImpl
Tests run: 5, Failures: 0, Errors: 0, Skipped: 0, Time elapsed: 0.681 sec - in org.apache.hadoop.hbase.replication.TestReplicationTrackerZKImpl
Running org.apache.hadoop.hbase.replication.TestReplicationKillMasterRS
Tests run: 1, Failures: 0, Errors: 0, Skipped: 0, Time elapsed: 28.292 sec - in org.apache.hadoop.hbase.replication.TestReplicationKillMasterRS
Running org.apache.hadoop.hbase.replication.TestReplicationKillMasterRSCompressed
Tests run: 1, Failures: 0, Errors: 0, Skipped: 0, Time elapsed: 29.256 sec - in org.apache.hadoop.hbase.replication.TestReplicationKillMasterRSCompressed
Running org.apache.hadoop.hbase.replication.TestReplicationDisableInactivePeer
Tests run: 1, Failures: 0, Errors: 0, Skipped: 0, Time elapsed: 24.084 sec - in org.apache.hadoop.hbase.replication.TestReplicationDisableInactivePeer

Results :

Failed tests: 
  TestSnapshotCloneIndependence.testOnlineSnapshotDeleteIndependent:183->runTestSnapshotDeleteIndependent:443
expected:<17576> but was:<13798>
  TestLogRolling.testLogRollOnDatanodeDeath:406 Missing datanode should've triggered a log
roll

Tests in error: 
  TestCacheOnWrite.testNotCachingDataBlocksDuringCompaction:486->testNotCachingDataBlocksDuringCompactionInternals:429
» OutOfMemory
  TestCacheOnWrite.testNotCachingDataBlocksDuringCompaction:485->testNotCachingDataBlocksDuringCompactionInternals:429
» OutOfMemory
  TestCacheOnWrite.testNotCachingDataBlocksDuringCompaction:485->testNotCachingDataBlocksDuringCompactionInternals:429
» OutOfMemory
  TestCacheOnWrite.testNotCachingDataBlocksDuringCompaction:485->testNotCachingDataBlocksDuringCompactionInternals:429
» OutOfMemory


Tests run: 2253, Failures: 2, Errors: 4, Skipped: 23

[INFO] ------------------------------------------------------------------------
[INFO] Reactor Summary:
[INFO] 
[INFO] HBase ............................................. SUCCESS [3.167s]
[INFO] HBase - Checkstyle ................................ SUCCESS [0.601s]
[INFO] HBase - Annotations ............................... SUCCESS [0.804s]
[INFO] HBase - Common .................................... SUCCESS [43.074s]
[INFO] HBase - Protocol .................................. SUCCESS [9.089s]
[INFO] HBase - Client .................................... SUCCESS [49.822s]
[INFO] HBase - Hadoop Compatibility ...................... SUCCESS [6.954s]
[INFO] HBase - Hadoop One Compatibility .................. SUCCESS [5.494s]
[INFO] HBase - Prefix Tree ............................... SUCCESS [7.950s]
[INFO] HBase - Server .................................... FAILURE [4:49:16.024s]
[INFO] HBase - Testing Util .............................. SKIPPED
[INFO] HBase - Thrift .................................... SKIPPED
[INFO] HBase - Rest ...................................... SKIPPED
[INFO] HBase - Shell ..................................... SKIPPED
[INFO] HBase - Integration Tests ......................... SKIPPED
[INFO] HBase - Examples .................................. SKIPPED
[INFO] HBase - Assembly .................................. SKIPPED
[INFO] ------------------------------------------------------------------------
[INFO] BUILD FAILURE
[INFO] ------------------------------------------------------------------------
[INFO] Total time: 4:51:23.789s
[INFO] Finished at: Sun May 03 15:37:44 UTC 2015
[INFO] Final Memory: 45M/671M
[INFO] ------------------------------------------------------------------------
[ERROR] Failed to execute goal org.apache.maven.plugins:maven-surefire-plugin:2.18:test (secondPartTestsExecution)
on project hbase-server: There was a timeout or other error in the fork -> [Help 1]
[ERROR] 
[ERROR] To see the full stack trace of the errors, re-run Maven with the -e switch.
[ERROR] Re-run Maven using the -X switch to enable full debug logging.
[ERROR] 
[ERROR] For more information about the errors and possible solutions, please read the following
articles:
[ERROR] [Help 1] http://cwiki.apache.org/confluence/display/MAVEN/MojoFailureException
[ERROR] 
[ERROR] After correcting the problems, you can resume the build with the command
[ERROR]   mvn <goals> -rf :hbase-server
Build step 'Invoke top-level Maven targets' marked build as failure
Performing Post build task...
Match found for :.* : True
Logical operation result is TRUE
Running script  :   ZOMBIE_TESTS_COUNT=`jps | grep surefirebooter | wc -l`
  if [[ $ZOMBIE_TESTS_COUNT != 0 ]] ; then
    #It seems sometimes the tests are not dying immediately. Let's give them 10s
    echo "Suspicious java process found - waiting 10s to see if there are just slow to stop"
    sleep 10
    ZOMBIE_TESTS_COUNT=`jps | grep surefirebooter | wc -l`
    if [[ $ZOMBIE_TESTS_COUNT != 0 ]] ; then
      echo "There are $ZOMBIE_TESTS_COUNT zombie tests, they should have been killed by surefire
but survived"
      echo "************ BEGIN zombies jstack extract"
      ZB_STACK=`jps | grep surefirebooter | cut -d ' ' -f 1 | xargs -n 1 jstack | grep ".test"
| grep "\.java"`
      jps | grep surefirebooter | cut -d ' ' -f 1 | xargs -n 1 jstack
      echo "************ END  zombies jstack extract"
      JIRA_COMMENT="$JIRA_COMMENT

     {color:red}-1 core zombie tests{color}.  There are ${ZOMBIE_TESTS_COUNT} zombie test(s):
${ZB_STACK}"
      BAD=1
      jps | grep surefirebooter | cut -d ' ' -f 1 | xargs kill -9
    else
      echo "We're ok: there is no zombie test, but some tests took some time to stop"
    fi
  else
    echo "We're ok: there is no zombie test"
  fi
[HBase-0.98-on-Hadoop-1.1] $ /bin/bash -xe /tmp/hudson2622388721547235900.sh
++ jps
++ grep surefirebooter
++ wc -l
+ ZOMBIE_TESTS_COUNT=1
+ [[ 1 != 0 ]]
+ echo 'Suspicious java process found - waiting 10s to see if there are just slow to stop'
Suspicious java process found - waiting 10s to see if there are just slow to stop
+ sleep 10
++ jps
++ grep surefirebooter
++ wc -l
+ ZOMBIE_TESTS_COUNT=1
+ [[ 1 != 0 ]]
+ echo 'There are 1 zombie tests, they should have been killed by surefire but survived'
There are 1 zombie tests, they should have been killed by surefire but survived
+ echo '************ BEGIN zombies jstack extract'
************ BEGIN zombies jstack extract
++ jps
++ grep surefirebooter
++ cut -d ' ' -f 1
++ xargs -n 1 jstack
++ grep .test
++ grep '\.java'
27392: Unable to open socket file: target process not responding or HotSpot VM not loaded
The -F option can be used when the target process is not responding
+ ZB_STACK=
POST BUILD TASK : FAILURE
END OF POST BUILD TASK : 0
Archiving artifacts
Sending artifact delta relative to HBase-0.98-on-Hadoop-1.1 #927
Archived 1736 artifacts
Archive block size is 32768
Received 7 blocks and 276941719 bytes
Compression is 0.1%
Took 1 min 15 sec
Recording test results
Updating HBASE-13333

Mime
View raw message