hbase-builds mailing list archives

Site index · List index
Message view « Date » · « Thread »
Top « Date » · « Thread »
From Apache Jenkins Server <jenk...@builds.apache.org>
Subject Build failed in Jenkins: HBase-1.1 #360
Date Sat, 04 Apr 2015 07:55:00 GMT
See <https://builds.apache.org/job/HBase-1.1/360/>

------------------------------------------
[...truncated 1877 lines...]
Running org.apache.hadoop.hbase.security.visibility.TestVisibilityWithCheckAuths
Tests run: 1, Failures: 0, Errors: 0, Skipped: 0, Time elapsed: 3 sec - in org.apache.hadoop.hbase.security.visibility.TestDefaultScanLabelGeneratorStack
Tests run: 2, Failures: 0, Errors: 0, Skipped: 0, Time elapsed: 3.654 sec - in org.apache.hadoop.hbase.security.visibility.TestVisibilityWithCheckAuths
Running org.apache.hadoop.hbase.security.visibility.TestVisibilityLabelsOpWithDifferentUsersNoACL
Tests run: 1, Failures: 0, Errors: 0, Skipped: 0, Time elapsed: 2.714 sec - in org.apache.hadoop.hbase.security.visibility.TestVisibilityLabelsOpWithDifferentUsersNoACL
Running org.apache.hadoop.hbase.security.visibility.TestVisibilityLabelsWithDefaultVisLabelService
Running org.apache.hadoop.hbase.security.visibility.TestVisibilityLabelsWithACL
Running org.apache.hadoop.hbase.security.visibility.TestVisibilityLablesWithGroups
Tests run: 5, Failures: 0, Errors: 0, Skipped: 0, Time elapsed: 7.209 sec - in org.apache.hadoop.hbase.security.visibility.TestVisibilityLabelsWithACL
Tests run: 1, Failures: 0, Errors: 0, Skipped: 0, Time elapsed: 3.541 sec - in org.apache.hadoop.hbase.security.visibility.TestVisibilityLablesWithGroups
Tests run: 37, Failures: 0, Errors: 0, Skipped: 0, Time elapsed: 56.119 sec - in org.apache.hadoop.hbase.security.visibility.TestVisibilityLabelsWithDeletes
Tests run: 23, Failures: 0, Errors: 0, Skipped: 0, Time elapsed: 19.318 sec - in org.apache.hadoop.hbase.security.visibility.TestVisibilityLabelsWithDefaultVisLabelService
Running org.apache.hadoop.hbase.security.visibility.TestVisibilityLabelsWithCustomVisLabService
Running org.apache.hadoop.hbase.security.access.TestAccessController2
Running org.apache.hadoop.hbase.security.access.TestAccessController
Running org.apache.hadoop.hbase.security.access.TestTablePermissions
Tests run: 19, Failures: 0, Errors: 0, Skipped: 0, Time elapsed: 15.965 sec - in org.apache.hadoop.hbase.security.visibility.TestVisibilityLabelsWithCustomVisLabService
Running org.apache.hadoop.hbase.security.access.TestAccessControlFilter
Tests run: 4, Failures: 0, Errors: 0, Skipped: 0, Time elapsed: 24.696 sec - in org.apache.hadoop.hbase.security.access.TestAccessController2
Tests run: 1, Failures: 0, Errors: 0, Skipped: 0, Time elapsed: 3.435 sec - in org.apache.hadoop.hbase.security.access.TestAccessControlFilter
Running org.apache.hadoop.hbase.security.access.TestCellACLs
Tests run: 7, Failures: 0, Errors: 0, Skipped: 0, Time elapsed: 33.15 sec - in org.apache.hadoop.hbase.security.access.TestTablePermissions
Running org.apache.hadoop.hbase.security.access.TestNamespaceCommands
Tests run: 2, Failures: 0, Errors: 0, Skipped: 0, Time elapsed: 10.356 sec - in org.apache.hadoop.hbase.security.access.TestCellACLs
Running org.apache.hadoop.hbase.security.access.TestZKPermissionsWatcher
Running org.apache.hadoop.hbase.security.access.TestScanEarlyTermination
Tests run: 7, Failures: 0, Errors: 0, Skipped: 0, Time elapsed: 12.176 sec - in org.apache.hadoop.hbase.security.access.TestNamespaceCommands
Tests run: 1, Failures: 0, Errors: 0, Skipped: 0, Time elapsed: 3.296 sec - in org.apache.hadoop.hbase.security.access.TestZKPermissionsWatcher
Running org.apache.hadoop.hbase.security.token.TestZKSecretWatcher
Tests run: 1, Failures: 0, Errors: 0, Skipped: 0, Time elapsed: 4.863 sec - in org.apache.hadoop.hbase.security.access.TestScanEarlyTermination
Running org.apache.hadoop.hbase.security.access.TestCellACLWithMultipleVersions
Tests run: 1, Failures: 0, Errors: 0, Skipped: 0, Time elapsed: 13.24 sec - in org.apache.hadoop.hbase.security.token.TestZKSecretWatcher
Running org.apache.hadoop.hbase.security.token.TestTokenAuthentication
Tests run: 3, Failures: 0, Errors: 0, Skipped: 0, Time elapsed: 0.666 sec - in org.apache.hadoop.hbase.security.token.TestTokenAuthentication
Running org.apache.hadoop.hbase.TestMetaTableAccessorNoCluster
Running org.apache.hadoop.hbase.security.token.TestGenerateDelegationToken
Tests run: 2, Failures: 0, Errors: 0, Skipped: 0, Time elapsed: 3.444 sec - in org.apache.hadoop.hbase.TestMetaTableAccessorNoCluster
Tests run: 1, Failures: 0, Errors: 0, Skipped: 0, Time elapsed: 2.469 sec - in org.apache.hadoop.hbase.security.token.TestGenerateDelegationToken
Running org.apache.hadoop.hbase.TestMetaTableLocator
Tests run: 7, Failures: 0, Errors: 0, Skipped: 0, Time elapsed: 4.027 sec - in org.apache.hadoop.hbase.TestMetaTableLocator
Running org.apache.hadoop.hbase.TestZooKeeper
Running org.apache.hadoop.hbase.TestHBaseTestingUtility
Tests run: 8, Failures: 0, Errors: 0, Skipped: 0, Time elapsed: 30.362 sec - in org.apache.hadoop.hbase.security.access.TestCellACLWithMultipleVersions
Running org.apache.hadoop.hbase.snapshot.TestSnapshotDescriptionUtils
Tests run: 2, Failures: 0, Errors: 0, Skipped: 0, Time elapsed: 0.217 sec - in org.apache.hadoop.hbase.snapshot.TestSnapshotDescriptionUtils
Running org.apache.hadoop.hbase.snapshot.TestSecureExportSnapshot
Tests run: 11, Failures: 0, Errors: 0, Skipped: 0, Time elapsed: 52.644 sec - in org.apache.hadoop.hbase.TestHBaseTestingUtility
Running org.apache.hadoop.hbase.snapshot.TestFlushSnapshotFromClient
Running org.apache.hadoop.hbase.snapshot.TestExportSnapshot
Tests run: 9, Failures: 0, Errors: 0, Skipped: 0, Time elapsed: 43.5 sec - in org.apache.hadoop.hbase.snapshot.TestFlushSnapshotFromClient
Running org.apache.hadoop.hbase.snapshot.TestRestoreFlushSnapshotFromClient
Tests run: 12, Failures: 0, Errors: 0, Skipped: 0, Time elapsed: 162.789 sec - in org.apache.hadoop.hbase.TestZooKeeper
Running org.apache.hadoop.hbase.TestInfoServers
Tests run: 3, Failures: 0, Errors: 0, Skipped: 0, Time elapsed: 2.905 sec - in org.apache.hadoop.hbase.TestInfoServers
Running org.apache.hadoop.hbase.procedure.TestZKProcedureControllers
Tests run: 5, Failures: 0, Errors: 0, Skipped: 0, Time elapsed: 62.942 sec - in org.apache.hadoop.hbase.snapshot.TestRestoreFlushSnapshotFromClient
Tests run: 4, Failures: 0, Errors: 0, Skipped: 0, Time elapsed: 1.74 sec - in org.apache.hadoop.hbase.procedure.TestZKProcedureControllers
Running org.apache.hadoop.hbase.procedure.TestZKProcedure
Tests run: 4, Failures: 0, Errors: 0, Skipped: 0, Time elapsed: 2.502 sec - in org.apache.hadoop.hbase.procedure.TestZKProcedure
Tests run: 55, Failures: 0, Errors: 0, Skipped: 0, Time elapsed: 268.99 sec - in org.apache.hadoop.hbase.security.access.TestAccessController
Running org.apache.hadoop.hbase.io.hfile.TestForceCacheImportantBlocks
Running org.apache.hadoop.hbase.io.hfile.TestCacheOnWrite
Running org.apache.hadoop.hbase.io.hfile.TestHFileBlock
Tests run: 4, Failures: 0, Errors: 0, Skipped: 0, Time elapsed: 46.163 sec - in org.apache.hadoop.hbase.io.hfile.TestForceCacheImportantBlocks
Running org.apache.hadoop.hbase.io.hfile.TestHFileBlockIndex
Tests run: 10, Failures: 0, Errors: 0, Skipped: 0, Time elapsed: 14.597 sec - in org.apache.hadoop.hbase.io.hfile.TestHFileBlockIndex
Running org.apache.hadoop.hbase.io.hfile.TestHFileSeek
Tests run: 1, Failures: 0, Errors: 0, Skipped: 0, Time elapsed: 2.646 sec - in org.apache.hadoop.hbase.io.hfile.TestHFileSeek
Running org.apache.hadoop.hbase.io.hfile.TestScannerSelectionUsingTTL
Tests run: 28, Failures: 0, Errors: 0, Skipped: 0, Time elapsed: 92.997 sec - in org.apache.hadoop.hbase.io.hfile.TestHFileBlock
Running org.apache.hadoop.hbase.io.hfile.TestCacheConfig
Tests run: 6, Failures: 0, Errors: 0, Skipped: 0, Time elapsed: 2.365 sec - in org.apache.hadoop.hbase.io.hfile.TestCacheConfig
Running org.apache.hadoop.hbase.io.encoding.TestDataBlockEncoders
Tests run: 6, Failures: 0, Errors: 0, Skipped: 0, Time elapsed: 64.135 sec - in org.apache.hadoop.hbase.io.hfile.TestScannerSelectionUsingTTL
Running org.apache.hadoop.hbase.io.encoding.TestEncodedSeekers
Tests run: 9, Failures: 0, Errors: 0, Skipped: 0, Time elapsed: 320.614 sec - in org.apache.hadoop.hbase.snapshot.TestSecureExportSnapshot
Running org.apache.hadoop.hbase.io.encoding.TestBufferedDataBlockEncoder
Tests run: 1, Failures: 0, Errors: 0, Skipped: 0, Time elapsed: 18.116 sec - in org.apache.hadoop.hbase.io.encoding.TestBufferedDataBlockEncoder
Running org.apache.hadoop.hbase.io.encoding.TestChangingEncoding
Tests run: 9, Failures: 0, Errors: 0, Skipped: 0, Time elapsed: 314.583 sec - in org.apache.hadoop.hbase.snapshot.TestExportSnapshot
Running org.apache.hadoop.hbase.io.encoding.TestLoadAndSwitchEncodeOnDisk
Tests run: 1, Failures: 0, Errors: 0, Skipped: 0, Time elapsed: 25.139 sec - in org.apache.hadoop.hbase.io.encoding.TestLoadAndSwitchEncodeOnDisk
Running org.apache.hadoop.hbase.io.TestFileLink
Tests run: 20, Failures: 0, Errors: 0, Skipped: 0, Time elapsed: 122.425 sec - in org.apache.hadoop.hbase.io.encoding.TestEncodedSeekers
Tests run: 5, Failures: 0, Errors: 0, Skipped: 0, Time elapsed: 13.955 sec - in org.apache.hadoop.hbase.io.TestFileLink
Running org.apache.hadoop.hbase.wal.TestWALFiltering
Running org.apache.hadoop.hbase.wal.TestWALFactory
Tests run: 9, Failures: 0, Errors: 0, Skipped: 0, Time elapsed: 16.207 sec - in org.apache.hadoop.hbase.wal.TestWALFactory
Running org.apache.hadoop.hbase.wal.TestWALReaderOnSecureWAL
Tests run: 2, Failures: 0, Errors: 0, Skipped: 0, Time elapsed: 1.684 sec - in org.apache.hadoop.hbase.wal.TestWALReaderOnSecureWAL
Tests run: 1, Failures: 0, Errors: 0, Skipped: 0, Time elapsed: 24.94 sec - in org.apache.hadoop.hbase.wal.TestWALFiltering
Running org.apache.hadoop.hbase.wal.TestDefaultWALProvider
Running org.apache.hadoop.hbase.wal.TestWALSplit
Tests run: 3, Failures: 0, Errors: 0, Skipped: 0, Time elapsed: 111.784 sec - in org.apache.hadoop.hbase.io.encoding.TestChangingEncoding
Running org.apache.hadoop.hbase.wal.TestSecureWAL
Tests run: 5, Failures: 0, Errors: 0, Skipped: 0, Time elapsed: 6.851 sec - in org.apache.hadoop.hbase.wal.TestDefaultWALProvider
Tests run: 1, Failures: 0, Errors: 0, Skipped: 0, Time elapsed: 1.307 sec - in org.apache.hadoop.hbase.wal.TestSecureWAL
Running org.apache.hadoop.hbase.wal.TestDefaultWALProviderWithHLogKey
Running org.apache.hadoop.hbase.wal.TestBoundedRegionGroupingProvider
Tests run: 5, Failures: 0, Errors: 0, Skipped: 0, Time elapsed: 7.221 sec - in org.apache.hadoop.hbase.wal.TestDefaultWALProviderWithHLogKey
Running org.apache.hadoop.hbase.wal.TestWALSplitCompressed
Tests run: 28, Failures: 0, Errors: 0, Skipped: 0, Time elapsed: 233.828 sec - in org.apache.hadoop.hbase.io.encoding.TestDataBlockEncoders
Tests run: 5, Failures: 0, Errors: 0, Skipped: 0, Time elapsed: 20.371 sec - in org.apache.hadoop.hbase.wal.TestBoundedRegionGroupingProvider
Running org.apache.hadoop.hbase.zookeeper.TestZKLeaderManager
Tests run: 1, Failures: 0, Errors: 0, Skipped: 0, Time elapsed: 0.138 sec - in org.apache.hadoop.hbase.zookeeper.TestZKLeaderManager
Running org.apache.hadoop.hbase.zookeeper.TestZooKeeperNodeTracker
Tests run: 3, Failures: 0, Errors: 0, Skipped: 0, Time elapsed: 1.305 sec - in org.apache.hadoop.hbase.zookeeper.TestZooKeeperNodeTracker
Running org.apache.hadoop.hbase.zookeeper.TestRecoverableZooKeeper
Tests run: 1, Failures: 0, Errors: 0, Skipped: 0, Time elapsed: 1.262 sec - in org.apache.hadoop.hbase.zookeeper.TestRecoverableZooKeeper
Running org.apache.hadoop.hbase.zookeeper.TestZKTableStateManager
Running org.apache.hadoop.hbase.zookeeper.TestZooKeeperACL
Tests run: 6, Failures: 0, Errors: 0, Skipped: 0, Time elapsed: 0.281 sec - in org.apache.hadoop.hbase.zookeeper.TestZooKeeperACL
Tests run: 1, Failures: 0, Errors: 0, Skipped: 0, Time elapsed: 0.777 sec - in org.apache.hadoop.hbase.zookeeper.TestZKTableStateManager
Running org.apache.hadoop.hbase.zookeeper.TestZKMulti
Tests run: 8, Failures: 0, Errors: 0, Skipped: 0, Time elapsed: 0.575 sec - in org.apache.hadoop.hbase.zookeeper.TestZKMulti
Running org.apache.hadoop.hbase.zookeeper.lock.TestZKInterProcessReadWriteLock
Running org.apache.hadoop.hbase.zookeeper.TestHQuorumPeer
Tests run: 4, Failures: 0, Errors: 0, Skipped: 0, Time elapsed: 1.638 sec - in org.apache.hadoop.hbase.zookeeper.TestHQuorumPeer
Running org.apache.hadoop.hbase.TestIOFencing
Tests run: 6, Failures: 0, Errors: 0, Skipped: 0, Time elapsed: 24.633 sec - in org.apache.hadoop.hbase.zookeeper.lock.TestZKInterProcessReadWriteLock
Running org.apache.hadoop.hbase.constraint.TestConstraint
Tests run: 5, Failures: 0, Errors: 0, Skipped: 0, Time elapsed: 7.839 sec - in org.apache.hadoop.hbase.constraint.TestConstraint
Running org.apache.hadoop.hbase.TestMovedRegionsCleaner
Tests run: 216, Failures: 0, Errors: 0, Skipped: 0, Time elapsed: 395.503 sec - in org.apache.hadoop.hbase.io.hfile.TestCacheOnWrite
Tests run: 1, Failures: 0, Errors: 0, Skipped: 0, Time elapsed: 9.209 sec - in org.apache.hadoop.hbase.TestMovedRegionsCleaner
Running org.apache.hadoop.hbase.backup.example.TestZooKeeperTableArchiveClient
Running org.apache.hadoop.hbase.backup.TestHFileArchiving
Tests run: 3, Failures: 0, Errors: 0, Skipped: 0, Time elapsed: 4.811 sec - in org.apache.hadoop.hbase.backup.example.TestZooKeeperTableArchiveClient
Running org.apache.hadoop.hbase.TestHColumnDescriptorDefaultVersions
Tests run: 3, Failures: 0, Errors: 0, Skipped: 0, Time elapsed: 13.682 sec - in org.apache.hadoop.hbase.TestHColumnDescriptorDefaultVersions
Running org.apache.hadoop.hbase.ipc.TestProtoBufRpc
Tests run: 1, Failures: 0, Errors: 0, Skipped: 0, Time elapsed: 2.005 sec - in org.apache.hadoop.hbase.ipc.TestProtoBufRpc
Running org.apache.hadoop.hbase.ipc.TestDelayedRpc
Tests run: 4, Failures: 0, Errors: 0, Skipped: 0, Time elapsed: 4.529 sec - in org.apache.hadoop.hbase.ipc.TestDelayedRpc
Running org.apache.hadoop.hbase.ipc.TestHBaseClient
Tests run: 1, Failures: 0, Errors: 0, Skipped: 0, Time elapsed: 0.399 sec - in org.apache.hadoop.hbase.ipc.TestHBaseClient
Tests run: 5, Failures: 0, Errors: 0, Skipped: 0, Time elapsed: 43.587 sec - in org.apache.hadoop.hbase.backup.TestHFileArchiving
Running org.apache.hadoop.hbase.TestNamespace
Tests run: 9, Failures: 0, Errors: 0, Skipped: 1, Time elapsed: 7.361 sec - in org.apache.hadoop.hbase.TestNamespace
Tests run: 31, Failures: 0, Errors: 0, Skipped: 0, Time elapsed: 206.317 sec - in org.apache.hadoop.hbase.wal.TestWALSplit
Tests run: 31, Failures: 0, Errors: 0, Skipped: 0, Time elapsed: 201.507 sec - in org.apache.hadoop.hbase.wal.TestWALSplitCompressed
Tests run: 2, Failures: 0, Errors: 0, Skipped: 0, Time elapsed: 211.792 sec - in org.apache.hadoop.hbase.TestIOFencing

Results :




Tests run: 2484, Failures: 0, Errors: 0, Skipped: 18

[INFO] ------------------------------------------------------------------------
[INFO] Reactor Summary:
[INFO] 
[INFO] HBase ............................................. SUCCESS [3.396s]
[INFO] HBase - Checkstyle ................................ SUCCESS [0.744s]
[INFO] HBase - Annotations ............................... SUCCESS [0.921s]
[INFO] HBase - Common .................................... SUCCESS [1:26.060s]
[INFO] HBase - Protocol .................................. SUCCESS [10.076s]
[INFO] HBase - Client .................................... SUCCESS [1:19.577s]
[INFO] HBase - Hadoop Compatibility ...................... SUCCESS [7.170s]
[INFO] HBase - Hadoop Two Compatibility .................. SUCCESS [6.793s]
[INFO] HBase - Prefix Tree ............................... SUCCESS [9.537s]
[INFO] HBase - Server .................................... FAILURE [1:17:45.398s]
[INFO] HBase - Testing Util .............................. SKIPPED
[INFO] HBase - Thrift .................................... SKIPPED
[INFO] HBase - Rest ...................................... SKIPPED
[INFO] HBase - Shell ..................................... SKIPPED
[INFO] HBase - Integration Tests ......................... SKIPPED
[INFO] HBase - Examples .................................. SKIPPED
[INFO] HBase - Assembly .................................. SKIPPED
[INFO] ------------------------------------------------------------------------
[INFO] BUILD FAILURE
[INFO] ------------------------------------------------------------------------
[INFO] Total time: 1:21:12.046s
[INFO] Finished at: Sat Apr 04 07:51:10 UTC 2015
[INFO] Final Memory: 92M/1782M
[INFO] ------------------------------------------------------------------------
[ERROR] Failed to execute goal org.apache.maven.plugins:maven-surefire-plugin:2.18:test (secondPartTestsExecution)
on project hbase-server: There was a timeout or other error in the fork -> [Help 1]
[ERROR] 
[ERROR] To see the full stack trace of the errors, re-run Maven with the -e switch.
[ERROR] Re-run Maven using the -X switch to enable full debug logging.
[ERROR] 
[ERROR] For more information about the errors and possible solutions, please read the following
articles:
[ERROR] [Help 1] http://cwiki.apache.org/confluence/display/MAVEN/MojoFailureException
[ERROR] 
[ERROR] After correcting the problems, you can resume the build with the command
[ERROR]   mvn <goals> -rf :hbase-server
Build step 'Invoke top-level Maven targets' marked build as failure
Performing Post build task...
Match found for :.* : True
Logical operation result is TRUE
Running script  :   ZOMBIE_TESTS_COUNT=`jps | grep surefirebooter | wc -l`
  if [[ $ZOMBIE_TESTS_COUNT != 0 ]] ; then
    #It seems sometimes the tests are not dying immediately. Let's give them 10s
    echo "Suspicious java process found - waiting 10s to see if there are just slow to stop"
    sleep 10   
    ZOMBIE_TESTS_COUNT=`jps | grep surefirebooter | wc -l`
    if [[ $ZOMBIE_TESTS_COUNT != 0 ]] ; then
      echo "There are $ZOMBIE_TESTS_COUNT zombie tests, they should have been killed by surefire
but survived"
      echo "************ BEGIN zombies jstack extract"
      ZB_STACK=`jps | grep surefirebooter | cut -d ' ' -f 1 | xargs -n 1 jstack | grep ".test"
| grep "\.java"`
      jps | grep surefirebooter | cut -d ' ' -f 1 | xargs -n 1 jstack
      echo "************ END  zombies jstack extract"
      JIRA_COMMENT="$JIRA_COMMENT

     {color:red}-1 core zombie tests{color}.  There are ${ZOMBIE_TESTS_COUNT} zombie test(s):
${ZB_STACK}"
      BAD=1
      jps | grep surefirebooter | cut -d ' ' -f 1 | xargs kill -9
    else
      echo "We're ok: there is no zombie test, but some tests took some time to stop"
    fi
  else
    echo "We're ok: there is no zombie test"
  fi
[HBase-1.1] $ /bin/bash -xe /tmp/hudson4273461218596197703.sh
++ jps
++ wc -l
++ grep surefirebooter
+ ZOMBIE_TESTS_COUNT=1
+ [[ 1 != 0 ]]
+ echo 'Suspicious java process found - waiting 10s to see if there are just slow to stop'
Suspicious java process found - waiting 10s to see if there are just slow to stop
+ sleep 10
++ jps
++ grep surefirebooter
++ wc -l
+ ZOMBIE_TESTS_COUNT=1
+ [[ 1 != 0 ]]
+ echo 'There are 1 zombie tests, they should have been killed by surefire but survived'
There are 1 zombie tests, they should have been killed by surefire but survived
+ echo '************ BEGIN zombies jstack extract'
************ BEGIN zombies jstack extract
++ jps
++ cut -d ' ' -f 1
++ xargs -n 1 jstack
++ grep .test
++ grep '\.java'
++ grep surefirebooter
+ ZB_STACK=
POST BUILD TASK : FAILURE
END OF POST BUILD TASK : 0
Archiving artifacts
Sending artifact delta relative to HBase-1.1 #358
Archived 1937 artifacts
Archive block size is 32768
Received 27 blocks and 485481848 bytes
Compression is 0.2%
Took 3 min 12 sec
Recording test results

Mime
View raw message