hbase-builds mailing list archives

Site index · List index
Message view « Date » · « Thread »
Top « Date » · « Thread »
From Apache Jenkins Server <jenk...@builds.apache.org>
Subject Build failed in Jenkins: HBase-1.1 #370
Date Tue, 07 Apr 2015 05:50:37 GMT
See <https://builds.apache.org/job/HBase-1.1/370/changes>

Changes:

[unknown] HBASE-13410 - Bug in KeyValueUtil.oswrite() for non Keyvalue cases (Ram)

------------------------------------------
[...truncated 1179 lines...]
Running org.apache.hadoop.hbase.replication.TestReplicationWALEntryFilters
Tests run: 4, Failures: 0, Errors: 0, Skipped: 0, Time elapsed: 0.774 sec - in org.apache.hadoop.hbase.replication.TestReplicationWALEntryFilters
Running org.apache.hadoop.hbase.replication.regionserver.TestReplicationThrottler
Tests run: 1, Failures: 0, Errors: 0, Skipped: 0, Time elapsed: 0.275 sec - in org.apache.hadoop.hbase.replication.regionserver.TestReplicationThrottler
Running org.apache.hadoop.hbase.replication.regionserver.TestReplicationSinkManager
Tests run: 5, Failures: 0, Errors: 0, Skipped: 0, Time elapsed: 0.996 sec - in org.apache.hadoop.hbase.replication.regionserver.TestReplicationSinkManager
Running org.apache.hadoop.hbase.security.TestUsersOperationsWithSecureHadoop
Tests run: 1, Failures: 0, Errors: 0, Skipped: 0, Time elapsed: 0.801 sec - in org.apache.hadoop.hbase.security.TestUsersOperationsWithSecureHadoop
Running org.apache.hadoop.hbase.security.TestHBaseSaslRpcClient
Tests run: 5, Failures: 0, Errors: 0, Skipped: 0, Time elapsed: 0.865 sec - in org.apache.hadoop.hbase.security.TestHBaseSaslRpcClient
Running org.apache.hadoop.hbase.security.visibility.TestExpressionExpander
Tests run: 1, Failures: 0, Errors: 0, Skipped: 0, Time elapsed: 0.355 sec - in org.apache.hadoop.hbase.security.visibility.TestExpressionExpander
Running org.apache.hadoop.hbase.security.visibility.TestExpressionParser
Tests run: 4, Failures: 0, Errors: 0, Skipped: 0, Time elapsed: 0.468 sec - in org.apache.hadoop.hbase.security.visibility.TestExpressionParser
Running org.apache.hadoop.hbase.security.TestSecureRPC
Tests run: 2, Failures: 0, Errors: 0, Skipped: 0, Time elapsed: 3.138 sec - in org.apache.hadoop.hbase.security.TestSecureRPC
Running org.apache.hadoop.hbase.security.TestUser
Tests run: 5, Failures: 0, Errors: 0, Skipped: 0, Time elapsed: 1.244 sec - in org.apache.hadoop.hbase.security.TestUser
Running org.apache.hadoop.hbase.security.token.TestAuthenticationKey
Tests run: 1, Failures: 0, Errors: 0, Skipped: 0, Time elapsed: 0.558 sec - in org.apache.hadoop.hbase.security.token.TestAuthenticationKey
Running org.apache.hadoop.hbase.TestPerformanceEvaluation
Tests run: 1, Failures: 0, Errors: 0, Skipped: 0, Time elapsed: 0.856 sec - in org.apache.hadoop.hbase.TestPerformanceEvaluation
Running org.apache.hadoop.hbase.monitoring.TestMemoryBoundedLogMessageBuffer
Tests run: 2, Failures: 0, Errors: 0, Skipped: 0, Time elapsed: 0.397 sec - in org.apache.hadoop.hbase.monitoring.TestMemoryBoundedLogMessageBuffer
Running org.apache.hadoop.hbase.monitoring.TestTaskMonitor
Tests run: 3, Failures: 0, Errors: 0, Skipped: 0, Time elapsed: 0.751 sec - in org.apache.hadoop.hbase.monitoring.TestTaskMonitor
Running org.apache.hadoop.hbase.TestCompare
Tests run: 1, Failures: 0, Errors: 0, Skipped: 0, Time elapsed: 0.773 sec - in org.apache.hadoop.hbase.TestCompare
Running org.apache.hadoop.hbase.TestSerialization
Tests run: 9, Failures: 0, Errors: 0, Skipped: 0, Time elapsed: 1.496 sec - in org.apache.hadoop.hbase.TestSerialization
Running org.apache.hadoop.hbase.snapshot.TestRestoreSnapshotHelper
Tests run: 1, Failures: 0, Errors: 0, Skipped: 0, Time elapsed: 2.204 sec - in org.apache.hadoop.hbase.snapshot.TestRestoreSnapshotHelper
Running org.apache.hadoop.hbase.procedure.TestProcedureMember
Tests run: 8, Failures: 0, Errors: 0, Skipped: 0, Time elapsed: 0.971 sec - in org.apache.hadoop.hbase.procedure.TestProcedureMember
Running org.apache.hadoop.hbase.procedure.TestProcedure
Tests run: 4, Failures: 0, Errors: 0, Skipped: 0, Time elapsed: 0.811 sec - in org.apache.hadoop.hbase.procedure.TestProcedure
Running org.apache.hadoop.hbase.procedure.TestProcedureCoordinator
Tests run: 7, Failures: 0, Errors: 0, Skipped: 0, Time elapsed: 0.789 sec - in org.apache.hadoop.hbase.procedure.TestProcedureCoordinator
Running org.apache.hadoop.hbase.procedure.TestProcedureManager
Tests run: 1, Failures: 0, Errors: 0, Skipped: 0, Time elapsed: 1.475 sec - in org.apache.hadoop.hbase.procedure.TestProcedureManager
Running org.apache.hadoop.hbase.io.TestByteBufferOutputStream
Tests run: 1, Failures: 0, Errors: 0, Skipped: 0, Time elapsed: 0.492 sec - in org.apache.hadoop.hbase.io.TestByteBufferOutputStream
Running org.apache.hadoop.hbase.io.hfile.TestChecksum
Tests run: 3, Failures: 0, Errors: 0, Skipped: 0, Time elapsed: 1.352 sec - in org.apache.hadoop.hbase.io.hfile.TestChecksum
Running org.apache.hadoop.hbase.io.hfile.bucket.TestBucketWriterThread
Tests run: 4, Failures: 0, Errors: 0, Skipped: 0, Time elapsed: 0.861 sec - in org.apache.hadoop.hbase.io.hfile.bucket.TestBucketWriterThread
Running org.apache.hadoop.hbase.io.hfile.bucket.TestFileIOEngine
Tests run: 1, Failures: 0, Errors: 0, Skipped: 0, Time elapsed: 0.386 sec - in org.apache.hadoop.hbase.io.hfile.bucket.TestFileIOEngine
Running org.apache.hadoop.hbase.io.hfile.bucket.TestBucketCache
Tests run: 8, Failures: 0, Errors: 0, Skipped: 0, Time elapsed: 15.707 sec - in org.apache.hadoop.hbase.io.hfile.bucket.TestBucketCache
Running org.apache.hadoop.hbase.io.hfile.bucket.TestByteBufferIOEngine
Tests run: 1, Failures: 0, Errors: 0, Skipped: 0, Time elapsed: 0.422 sec - in org.apache.hadoop.hbase.io.hfile.bucket.TestByteBufferIOEngine
Running org.apache.hadoop.hbase.io.hfile.TestHFileInlineToRootChunkConversion
Tests run: 1, Failures: 0, Errors: 0, Skipped: 0, Time elapsed: 0.947 sec - in org.apache.hadoop.hbase.io.hfile.TestHFileInlineToRootChunkConversion
Running org.apache.hadoop.hbase.io.hfile.TestHFileWriterV3
Tests run: 4, Failures: 0, Errors: 0, Skipped: 0, Time elapsed: 3.502 sec - in org.apache.hadoop.hbase.io.hfile.TestHFileWriterV3
Running org.apache.hadoop.hbase.io.hfile.TestHFileWriterV2
Tests run: 2, Failures: 0, Errors: 0, Skipped: 0, Time elapsed: 2.35 sec - in org.apache.hadoop.hbase.io.hfile.TestHFileWriterV2
Running org.apache.hadoop.hbase.io.hfile.TestHFileBlockCompatibility
Tests run: 16, Failures: 0, Errors: 0, Skipped: 0, Time elapsed: 2.919 sec - in org.apache.hadoop.hbase.io.hfile.TestHFileBlockCompatibility
Running org.apache.hadoop.hbase.io.hfile.TestLruCachedBlock
Tests run: 1, Failures: 0, Errors: 0, Skipped: 0, Time elapsed: 0.543 sec - in org.apache.hadoop.hbase.io.hfile.TestLruCachedBlock
Running org.apache.hadoop.hbase.io.hfile.TestFixedFileTrailer
Tests run: 4, Failures: 0, Errors: 0, Skipped: 0, Time elapsed: 1.051 sec - in org.apache.hadoop.hbase.io.hfile.TestFixedFileTrailer
Running org.apache.hadoop.hbase.io.hfile.TestHFileEncryption
Tests run: 3, Failures: 0, Errors: 0, Skipped: 0, Time elapsed: 4.57 sec - in org.apache.hadoop.hbase.io.hfile.TestHFileEncryption
Running org.apache.hadoop.hbase.io.hfile.TestReseekTo
Tests run: 1, Failures: 0, Errors: 0, Skipped: 0, Time elapsed: 1.6 sec - in org.apache.hadoop.hbase.io.hfile.TestReseekTo
Running org.apache.hadoop.hbase.io.hfile.TestCachedBlockQueue
Tests run: 2, Failures: 0, Errors: 0, Skipped: 0, Time elapsed: 0.401 sec - in org.apache.hadoop.hbase.io.hfile.TestCachedBlockQueue
Running org.apache.hadoop.hbase.io.hfile.TestHFile
Tests run: 7, Failures: 0, Errors: 0, Skipped: 0, Time elapsed: 0.966 sec - in org.apache.hadoop.hbase.io.hfile.TestHFile
Running org.apache.hadoop.hbase.io.hfile.TestLruBlockCache
Tests run: 9, Failures: 0, Errors: 0, Skipped: 0, Time elapsed: 1.152 sec - in org.apache.hadoop.hbase.io.hfile.TestLruBlockCache
Running org.apache.hadoop.hbase.io.hfile.TestLazyDataBlockDecompression
Tests run: 2, Failures: 0, Errors: 0, Skipped: 0, Time elapsed: 1.62 sec - in org.apache.hadoop.hbase.io.hfile.TestLazyDataBlockDecompression
Running org.apache.hadoop.hbase.io.hfile.TestScannerSelectionUsingKeyRange
Tests run: 3, Failures: 0, Errors: 0, Skipped: 0, Time elapsed: 2.16 sec - in org.apache.hadoop.hbase.io.hfile.TestScannerSelectionUsingKeyRange
Running org.apache.hadoop.hbase.io.hfile.TestBlockCacheReporting
Tests run: 2, Failures: 0, Errors: 0, Skipped: 0, Time elapsed: 0.903 sec - in org.apache.hadoop.hbase.io.hfile.TestBlockCacheReporting
Running org.apache.hadoop.hbase.io.hfile.TestPrefetch
Tests run: 1, Failures: 0, Errors: 0, Skipped: 0, Time elapsed: 3.177 sec - in org.apache.hadoop.hbase.io.hfile.TestPrefetch
Running org.apache.hadoop.hbase.io.hfile.TestHFileDataBlockEncoder
Tests run: 30, Failures: 0, Errors: 0, Skipped: 0, Time elapsed: 1.818 sec - in org.apache.hadoop.hbase.io.hfile.TestHFileDataBlockEncoder
Running org.apache.hadoop.hbase.io.hfile.TestSeekTo
Tests run: 4, Failures: 0, Errors: 0, Skipped: 0, Time elapsed: 0.699 sec - in org.apache.hadoop.hbase.io.hfile.TestSeekTo
Running org.apache.hadoop.hbase.io.TestHeapSize
Tests run: 3, Failures: 0, Errors: 0, Skipped: 0, Time elapsed: 0.417 sec - in org.apache.hadoop.hbase.io.TestHeapSize
Running org.apache.hadoop.hbase.io.encoding.TestPrefixTreeEncoding
Tests run: 8, Failures: 0, Errors: 0, Skipped: 0, Time elapsed: 1.45 sec - in org.apache.hadoop.hbase.io.encoding.TestPrefixTreeEncoding
Running org.apache.hadoop.hbase.io.encoding.TestPrefixTree
Tests run: 2, Failures: 0, Errors: 0, Skipped: 0, Time elapsed: 2.14 sec - in org.apache.hadoop.hbase.io.encoding.TestPrefixTree
Running org.apache.hadoop.hbase.io.encoding.TestSeekToBlockWithEncoders
Tests run: 9, Failures: 0, Errors: 0, Skipped: 0, Time elapsed: 0.878 sec - in org.apache.hadoop.hbase.io.encoding.TestSeekToBlockWithEncoders
Running org.apache.hadoop.hbase.io.TestImmutableBytesWritable
Tests run: 3, Failures: 0, Errors: 0, Skipped: 0, Time elapsed: 0.433 sec - in org.apache.hadoop.hbase.io.TestImmutableBytesWritable
Running org.apache.hadoop.hbase.io.TestHFileLink
Tests run: 2, Failures: 0, Errors: 0, Skipped: 0, Time elapsed: 0.484 sec - in org.apache.hadoop.hbase.io.TestHFileLink
Running org.apache.hadoop.hbase.io.TestReference
Tests run: 1, Failures: 0, Errors: 0, Skipped: 0, Time elapsed: 0.698 sec - in org.apache.hadoop.hbase.io.TestReference
Running org.apache.hadoop.hbase.io.TestHalfStoreFileReader
Tests run: 2, Failures: 0, Errors: 0, Skipped: 0, Time elapsed: 1.578 sec - in org.apache.hadoop.hbase.io.TestHalfStoreFileReader
Running org.apache.hadoop.hbase.wal.TestWALMethods
Tests run: 3, Failures: 0, Errors: 0, Skipped: 0, Time elapsed: 1.152 sec - in org.apache.hadoop.hbase.wal.TestWALMethods
Running org.apache.hadoop.hbase.zookeeper.TestZooKeeperMainServer
Tests run: 2, Failures: 0, Errors: 0, Skipped: 0, Time elapsed: 1.171 sec - in org.apache.hadoop.hbase.zookeeper.TestZooKeeperMainServer
Running org.apache.hadoop.hbase.zookeeper.TestZKConfig
Tests run: 1, Failures: 0, Errors: 0, Skipped: 0, Time elapsed: 0.542 sec - in org.apache.hadoop.hbase.zookeeper.TestZKConfig
Running org.apache.hadoop.hbase.TestNodeHealthCheckChore
Tests run: 4, Failures: 0, Errors: 0, Skipped: 0, Time elapsed: 10.906 sec - in org.apache.hadoop.hbase.TestNodeHealthCheckChore
Running org.apache.hadoop.hbase.executor.TestExecutorService
Tests run: 1, Failures: 0, Errors: 0, Skipped: 0, Time elapsed: 2.713 sec - in org.apache.hadoop.hbase.executor.TestExecutorService
Running org.apache.hadoop.hbase.TestServerLoad
Tests run: 3, Failures: 0, Errors: 0, Skipped: 0, Time elapsed: 0.438 sec - in org.apache.hadoop.hbase.TestServerLoad
Running org.apache.hadoop.hbase.constraint.TestConstraints
Tests run: 6, Failures: 0, Errors: 0, Skipped: 0, Time elapsed: 1.376 sec - in org.apache.hadoop.hbase.constraint.TestConstraints
Running org.apache.hadoop.hbase.protobuf.TestProtobufUtil
Tests run: 7, Failures: 0, Errors: 0, Skipped: 0, Time elapsed: 1.22 sec - in org.apache.hadoop.hbase.protobuf.TestProtobufUtil
Running org.apache.hadoop.hbase.protobuf.TestReplicationProtobuf
Tests run: 1, Failures: 0, Errors: 0, Skipped: 0, Time elapsed: 0.385 sec - in org.apache.hadoop.hbase.protobuf.TestReplicationProtobuf
Running org.apache.hadoop.hbase.ipc.TestBufferChain
Tests run: 5, Failures: 0, Errors: 0, Skipped: 0, Time elapsed: 0.86 sec - in org.apache.hadoop.hbase.ipc.TestBufferChain
Running org.apache.hadoop.hbase.ipc.TestGlobalEventLoopGroup
Tests run: 1, Failures: 0, Errors: 0, Skipped: 0, Time elapsed: 0.713 sec - in org.apache.hadoop.hbase.ipc.TestGlobalEventLoopGroup
Running org.apache.hadoop.hbase.ipc.TestRpcHandlerException
Tests run: 1, Failures: 0, Errors: 0, Skipped: 1, Time elapsed: 0 sec - in org.apache.hadoop.hbase.ipc.TestRpcHandlerException
Running org.apache.hadoop.hbase.ipc.TestCallRunner
Tests run: 1, Failures: 0, Errors: 0, Skipped: 0, Time elapsed: 0.843 sec - in org.apache.hadoop.hbase.ipc.TestCallRunner
Running org.apache.hadoop.hbase.ipc.TestAsyncIPC
Tests run: 24, Failures: 0, Errors: 0, Skipped: 0, Time elapsed: 4.17 sec - in org.apache.hadoop.hbase.ipc.TestAsyncIPC
Running org.apache.hadoop.hbase.ipc.TestSimpleRpcScheduler
Tests run: 4, Failures: 0, Errors: 0, Skipped: 0, Time elapsed: 5.928 sec - in org.apache.hadoop.hbase.ipc.TestSimpleRpcScheduler
Running org.apache.hadoop.hbase.ipc.TestRpcMetrics
Tests run: 3, Failures: 0, Errors: 0, Skipped: 0, Time elapsed: 0.593 sec - in org.apache.hadoop.hbase.ipc.TestRpcMetrics
Running org.apache.hadoop.hbase.ipc.TestIPC
Tests run: 4, Failures: 0, Errors: 0, Skipped: 0, Time elapsed: 2.536 sec - in org.apache.hadoop.hbase.ipc.TestIPC
Running org.apache.hadoop.hbase.conf.TestConfigurationManager
Tests run: 2, Failures: 0, Errors: 0, Skipped: 0, Time elapsed: 0.464 sec - in org.apache.hadoop.hbase.conf.TestConfigurationManager

Results :




Tests run: 865, Failures: 0, Errors: 0, Skipped: 5

[INFO] ------------------------------------------------------------------------
[INFO] Reactor Summary:
[INFO] 
[INFO] HBase ............................................. SUCCESS [4.017s]
[INFO] HBase - Checkstyle ................................ SUCCESS [0.735s]
[INFO] HBase - Annotations ............................... SUCCESS [1.019s]
[INFO] HBase - Common .................................... SUCCESS [1:26.297s]
[INFO] HBase - Protocol .................................. SUCCESS [10.444s]
[INFO] HBase - Client .................................... SUCCESS [1:21.964s]
[INFO] HBase - Hadoop Compatibility ...................... SUCCESS [7.283s]
[INFO] HBase - Hadoop Two Compatibility .................. SUCCESS [7.818s]
[INFO] HBase - Prefix Tree ............................... SUCCESS [9.426s]
[INFO] HBase - Server .................................... FAILURE [13:49.317s]
[INFO] HBase - Testing Util .............................. SKIPPED
[INFO] HBase - Thrift .................................... SKIPPED
[INFO] HBase - Rest ...................................... SKIPPED
[INFO] HBase - Shell ..................................... SKIPPED
[INFO] HBase - Integration Tests ......................... SKIPPED
[INFO] HBase - Examples .................................. SKIPPED
[INFO] HBase - Assembly .................................. SKIPPED
[INFO] ------------------------------------------------------------------------
[INFO] BUILD FAILURE
[INFO] ------------------------------------------------------------------------
[INFO] Total time: 17:20.436s
[INFO] Finished at: Tue Apr 07 05:48:48 UTC 2015
[INFO] Final Memory: 102M/2644M
[INFO] ------------------------------------------------------------------------
[ERROR] Failed to execute goal org.apache.maven.plugins:maven-surefire-plugin:2.18:test (default-test)
on project hbase-server: ExecutionException: java.lang.RuntimeException: The forked VM terminated
without properly saying goodbye. VM crash or System.exit called?
[ERROR] Command was /bin/sh -c cd <https://builds.apache.org/job/HBase-1.1/ws/hbase-server>
&& /home/jenkins/jenkins-slave/tools/hudson.model.JDK/jdk-1.7u51/jre/bin/java -enableassertions
-XX:MaxDirectMemorySize=1G -Xmx2800m -XX:MaxPermSize=256m -Djava.security.egd=file:/dev/./urandom
-Djava.net.preferIPv4Stack=true -Djava.awt.headless=true -jar <https://builds.apache.org/job/HBase-1.1/ws/hbase-server/target/surefire/surefirebooter3024899934318301957.jar>
<https://builds.apache.org/job/HBase-1.1/ws/hbase-server/target/surefire/surefire1954815366394838727tmp>
<https://builds.apache.org/job/HBase-1.1/ws/hbase-server/target/surefire/surefire_2658252174133775773652tmp>
[ERROR] -> [Help 1]
[ERROR] 
[ERROR] To see the full stack trace of the errors, re-run Maven with the -e switch.
[ERROR] Re-run Maven using the -X switch to enable full debug logging.
[ERROR] 
[ERROR] For more information about the errors and possible solutions, please read the following
articles:
[ERROR] [Help 1] http://cwiki.apache.org/confluence/display/MAVEN/MojoFailureException
[ERROR] 
[ERROR] After correcting the problems, you can resume the build with the command
[ERROR]   mvn <goals> -rf :hbase-server
Build step 'Invoke top-level Maven targets' marked build as failure
Performing Post build task...
Match found for :.* : True
Logical operation result is TRUE
Running script  :   ZOMBIE_TESTS_COUNT=`jps | grep surefirebooter | wc -l`
  if [[ $ZOMBIE_TESTS_COUNT != 0 ]] ; then
    #It seems sometimes the tests are not dying immediately. Let's give them 10s
    echo "Suspicious java process found - waiting 10s to see if there are just slow to stop"
    sleep 10   
    ZOMBIE_TESTS_COUNT=`jps | grep surefirebooter | wc -l`
    if [[ $ZOMBIE_TESTS_COUNT != 0 ]] ; then
      echo "There are $ZOMBIE_TESTS_COUNT zombie tests, they should have been killed by surefire
but survived"
      echo "************ BEGIN zombies jstack extract"
      ZB_STACK=`jps | grep surefirebooter | cut -d ' ' -f 1 | xargs -n 1 jstack | grep ".test"
| grep "\.java"`
      jps | grep surefirebooter | cut -d ' ' -f 1 | xargs -n 1 jstack
      echo "************ END  zombies jstack extract"
      JIRA_COMMENT="$JIRA_COMMENT

     {color:red}-1 core zombie tests{color}.  There are ${ZOMBIE_TESTS_COUNT} zombie test(s):
${ZB_STACK}"
      BAD=1
      jps | grep surefirebooter | cut -d ' ' -f 1 | xargs kill -9
    else
      echo "We're ok: there is no zombie test, but some tests took some time to stop"
    fi
  else
    echo "We're ok: there is no zombie test"
  fi
[HBase-1.1] $ /bin/bash -xe /tmp/hudson714432358711673526.sh
++ jps
++ grep surefirebooter
++ wc -l
+ ZOMBIE_TESTS_COUNT=1
+ [[ 1 != 0 ]]
+ echo 'Suspicious java process found - waiting 10s to see if there are just slow to stop'
Suspicious java process found - waiting 10s to see if there are just slow to stop
+ sleep 10
++ jps
++ grep surefirebooter
++ wc -l
+ ZOMBIE_TESTS_COUNT=1
+ [[ 1 != 0 ]]
+ echo 'There are 1 zombie tests, they should have been killed by surefire but survived'
There are 1 zombie tests, they should have been killed by surefire but survived
+ echo '************ BEGIN zombies jstack extract'
************ BEGIN zombies jstack extract
++ jps
++ grep surefirebooter
++ xargs -n 1 jstack
++ cut -d ' ' -f 1
++ grep '\.java'
++ grep .test
14055: No such process
+ ZB_STACK=
POST BUILD TASK : FAILURE
END OF POST BUILD TASK : 0
Archiving artifacts
Sending artifact delta relative to HBase-1.1 #358
Archived 914 artifacts
Archive block size is 32768
Received 3 blocks and 35089032 bytes
Compression is 0.3%
Took 1 min 30 sec
Recording test results
Updating HBASE-13410

Mime
View raw message