hbase-builds mailing list archives

Site index · List index
Message view « Date » · « Thread »
Top « Date » · « Thread »
From Apache Jenkins Server <jenk...@builds.apache.org>
Subject Build failed in Jenkins: HBase-1.1 #374
Date Wed, 08 Apr 2015 02:01:20 GMT
See <https://builds.apache.org/job/HBase-1.1/374/changes>

Changes:

[eclark] HBASE-13412 Region split decisions should have jitter

------------------------------------------
[...truncated 2410 lines...]
-------------------------------------------------------
 T E S T S
-------------------------------------------------------

Results :




Tests run: 0, Failures: 0, Errors: 0, Skipped: 0

[INFO] 
[INFO] --- maven-surefire-plugin:2.18:test (secondPartTestsExecution) @ hbase-shell ---
[INFO] Surefire report directory: <https://builds.apache.org/job/HBase-1.1/ws/hbase-shell/target/surefire-reports>
[INFO] Using configured provider org.apache.maven.surefire.junitcore.JUnitCoreProvider
[INFO] parallel='none', perCoreThreadCount=true, threadCount=0, useUnlimitedThreads=false,
threadCountSuites=0, threadCountClasses=0, threadCountMethods=0, parallelOptimized=true

-------------------------------------------------------
 T E S T S
-------------------------------------------------------
Running org.apache.hadoop.hbase.client.TestReplicationShell
Running org.apache.hadoop.hbase.client.TestShell
Tests run: 1, Failures: 0, Errors: 0, Skipped: 0, Time elapsed: 36.165 sec - in org.apache.hadoop.hbase.client.TestReplicationShell
Tests run: 1, Failures: 0, Errors: 0, Skipped: 0, Time elapsed: 116.573 sec - in org.apache.hadoop.hbase.client.TestShell

Results :




Tests run: 2, Failures: 0, Errors: 0, Skipped: 0

[INFO] 
[INFO] --- maven-jar-plugin:2.4:test-jar (default) @ hbase-shell ---
[INFO] Building jar: <https://builds.apache.org/job/HBase-1.1/ws/hbase-shell/target/hbase-shell-1.1.0-SNAPSHOT-tests.jar>
[INFO] 
[INFO] --- maven-source-plugin:2.2.1:jar-no-fork (attach-sources) @ hbase-shell ---
[INFO] Building jar: <https://builds.apache.org/job/HBase-1.1/ws/hbase-shell/target/hbase-shell-1.1.0-SNAPSHOT-sources.jar>
[INFO] 
[INFO] --- jacoco-maven-plugin:0.6.2.201302030002:report (report) @ hbase-shell ---
[INFO] Skipping JaCoCo execution
[INFO] 
[INFO] --- maven-jar-plugin:2.4:jar (default-jar) @ hbase-shell ---
[INFO] Building jar: <https://builds.apache.org/job/HBase-1.1/ws/hbase-shell/target/hbase-shell-1.1.0-SNAPSHOT.jar>
[INFO] 
[INFO] --- maven-install-plugin:2.3.1:install (default-install) @ hbase-shell ---
[INFO] Installing <https://builds.apache.org/job/HBase-1.1/ws/hbase-shell/target/hbase-shell-1.1.0-SNAPSHOT.jar>
to /home/jenkins/.m2/repository/org/apache/hbase/hbase-shell/1.1.0-SNAPSHOT/hbase-shell-1.1.0-SNAPSHOT.jar
[INFO] Installing <https://builds.apache.org/job/HBase-1.1/ws/hbase-shell/pom.xml> to
/home/jenkins/.m2/repository/org/apache/hbase/hbase-shell/1.1.0-SNAPSHOT/hbase-shell-1.1.0-SNAPSHOT.pom
[INFO] Installing <https://builds.apache.org/job/HBase-1.1/ws/hbase-shell/target/hbase-shell-1.1.0-SNAPSHOT-tests.jar>
to /home/jenkins/.m2/repository/org/apache/hbase/hbase-shell/1.1.0-SNAPSHOT/hbase-shell-1.1.0-SNAPSHOT-tests.jar
[INFO] Installing <https://builds.apache.org/job/HBase-1.1/ws/hbase-shell/target/hbase-shell-1.1.0-SNAPSHOT-sources.jar>
to /home/jenkins/.m2/repository/org/apache/hbase/hbase-shell/1.1.0-SNAPSHOT/hbase-shell-1.1.0-SNAPSHOT-sources.jar
[INFO]                                                                         
[INFO] ------------------------------------------------------------------------
[INFO] Building HBase - Integration Tests 1.1.0-SNAPSHOT
[INFO] ------------------------------------------------------------------------
[INFO] 
[INFO] --- maven-enforcer-plugin:1.0.1:enforce (enforce) @ hbase-it ---
[INFO] 
[INFO] --- jacoco-maven-plugin:0.6.2.201302030002:prepare-agent (prepare-agent) @ hbase-it
---
[INFO] Skipping JaCoCo execution
[INFO] argLine set to 
[INFO] 
[INFO] --- maven-remote-resources-plugin:1.4:process (default) @ hbase-it ---
[INFO] 
[INFO] --- maven-resources-plugin:2.6:resources (default-resources) @ hbase-it ---
[INFO] Using 'UTF-8' encoding to copy filtered resources.
[INFO] skip non existing resourceDirectory <https://builds.apache.org/job/HBase-1.1/ws/hbase-it/src/main/resources>
[INFO] Copying 3 resources
[INFO] 
[INFO] --- maven-compiler-plugin:2.5.1:compile (default-compile) @ hbase-it ---
[INFO] No sources to compile
[INFO] 
[INFO] --- maven-dependency-plugin:2.1:build-classpath (create-mrapp-generated-classpath)
@ hbase-it ---
[INFO] Wrote classpath file '<https://builds.apache.org/job/HBase-1.1/ws/hbase-it/target/test-classes/mrapp-generated-classpath'.>
[INFO] 
[INFO] --- maven-resources-plugin:2.6:testResources (default-testResources) @ hbase-it ---
[INFO] Using 'UTF-8' encoding to copy filtered resources.
[INFO] Copying 12 resources
[INFO] Copying 3 resources
[INFO] 
[INFO] --- maven-compiler-plugin:2.5.1:testCompile (default-testCompile) @ hbase-it ---
[INFO] Compiling 80 source files to <https://builds.apache.org/job/HBase-1.1/ws/hbase-it/target/test-classes>
[INFO] 
[INFO] --- maven-surefire-plugin:2.18:test (default-test) @ hbase-it ---
[INFO] 
[INFO] --- maven-surefire-plugin:2.18:test (secondPartTestsExecution) @ hbase-it ---
[INFO] 
[INFO] --- jacoco-maven-plugin:0.6.2.201302030002:report (report) @ hbase-it ---
[INFO] Skipping JaCoCo execution
[INFO] 
[INFO] --- maven-jar-plugin:2.4:test-jar (default) @ hbase-it ---
[INFO] Building jar: <https://builds.apache.org/job/HBase-1.1/ws/hbase-it/target/hbase-it-1.1.0-SNAPSHOT-tests.jar>
[INFO] 
[INFO] --- maven-jar-plugin:2.4:jar (default-jar) @ hbase-it ---
[INFO] Building jar: <https://builds.apache.org/job/HBase-1.1/ws/hbase-it/target/hbase-it-1.1.0-SNAPSHOT.jar>
[INFO] 
[INFO] --- maven-failsafe-plugin:2.18:integration-test (integration-test) @ hbase-it ---
[WARNING] The parameter forkMode is deprecated since version 2.14. Use forkCount and reuseForks
instead.
[WARNING] File encoding has not been set, using platform encoding ISO-8859-1, i.e. build is
platform dependent!
[INFO] 
[INFO] --- maven-failsafe-plugin:2.18:verify (verify) @ hbase-it ---
[INFO] Failsafe report directory: <https://builds.apache.org/job/HBase-1.1/ws/hbase-it/target/failsafe-reports>
[WARNING] File encoding has not been set, using platform encoding ISO-8859-1, i.e. build is
platform dependent!
[INFO] 
[INFO] --- maven-install-plugin:2.3.1:install (default-install) @ hbase-it ---
[INFO] Installing <https://builds.apache.org/job/HBase-1.1/ws/hbase-it/target/hbase-it-1.1.0-SNAPSHOT.jar>
to /home/jenkins/.m2/repository/org/apache/hbase/hbase-it/1.1.0-SNAPSHOT/hbase-it-1.1.0-SNAPSHOT.jar
[INFO] Installing <https://builds.apache.org/job/HBase-1.1/ws/hbase-it/pom.xml> to /home/jenkins/.m2/repository/org/apache/hbase/hbase-it/1.1.0-SNAPSHOT/hbase-it-1.1.0-SNAPSHOT.pom
[INFO] Installing <https://builds.apache.org/job/HBase-1.1/ws/hbase-it/target/hbase-it-1.1.0-SNAPSHOT-tests.jar>
to /home/jenkins/.m2/repository/org/apache/hbase/hbase-it/1.1.0-SNAPSHOT/hbase-it-1.1.0-SNAPSHOT-tests.jar
[INFO]                                                                         
[INFO] ------------------------------------------------------------------------
[INFO] Building HBase - Examples 1.1.0-SNAPSHOT
[INFO] ------------------------------------------------------------------------
[INFO] 
[INFO] --- maven-enforcer-plugin:1.0.1:enforce (enforce) @ hbase-examples ---
[INFO] 
[INFO] --- jacoco-maven-plugin:0.6.2.201302030002:prepare-agent (prepare-agent) @ hbase-examples
---
[INFO] Skipping JaCoCo execution
[INFO] argLine set to 
[INFO] 
[INFO] --- maven-remote-resources-plugin:1.4:process (default) @ hbase-examples ---
[INFO] 
[INFO] --- maven-resources-plugin:2.6:resources (default-resources) @ hbase-examples ---
[INFO] Using 'UTF-8' encoding to copy filtered resources.
[INFO] skip non existing resourceDirectory <https://builds.apache.org/job/HBase-1.1/ws/hbase-examples/src/main/resources>
[INFO] Copying 3 resources
[INFO] 
[INFO] --- maven-compiler-plugin:2.5.1:compile (default-compile) @ hbase-examples ---
[INFO] Compiling 12 source files to <https://builds.apache.org/job/HBase-1.1/ws/hbase-examples/target/classes>
[INFO] 
[INFO] --- maven-dependency-plugin:2.1:build-classpath (create-mrapp-generated-classpath)
@ hbase-examples ---
[INFO] Wrote classpath file '<https://builds.apache.org/job/HBase-1.1/ws/hbase-examples/target/test-classes/mrapp-generated-classpath'.>
[INFO] 
[INFO] --- maven-resources-plugin:2.6:testResources (default-testResources) @ hbase-examples
---
[INFO] Using 'UTF-8' encoding to copy filtered resources.
[INFO] skip non existing resourceDirectory <https://builds.apache.org/job/HBase-1.1/ws/hbase-examples/src/test/resources>
[INFO] Copying 3 resources
[INFO] 
[INFO] --- maven-compiler-plugin:2.5.1:testCompile (default-testCompile) @ hbase-examples
---
[INFO] Compiling 5 source files to <https://builds.apache.org/job/HBase-1.1/ws/hbase-examples/target/test-classes>
[INFO] 
[INFO] --- maven-surefire-plugin:2.18:test (default-test) @ hbase-examples ---
[INFO] Surefire report directory: <https://builds.apache.org/job/HBase-1.1/ws/hbase-examples/target/surefire-reports>
[INFO] Using configured provider org.apache.maven.surefire.junitcore.JUnitCoreProvider
[INFO] parallel='none', perCoreThreadCount=true, threadCount=0, useUnlimitedThreads=false,
threadCountSuites=0, threadCountClasses=0, threadCountMethods=0, parallelOptimized=true

-------------------------------------------------------
 T E S T S
-------------------------------------------------------

Results :




Tests run: 0, Failures: 0, Errors: 0, Skipped: 0

[INFO] 
[INFO] --- maven-surefire-plugin:2.18:test (secondPartTestsExecution) @ hbase-examples ---
[INFO] Surefire report directory: <https://builds.apache.org/job/HBase-1.1/ws/hbase-examples/target/surefire-reports>
[INFO] Using configured provider org.apache.maven.surefire.junitcore.JUnitCoreProvider
[INFO] parallel='none', perCoreThreadCount=true, threadCount=0, useUnlimitedThreads=false,
threadCountSuites=0, threadCountClasses=0, threadCountMethods=0, parallelOptimized=true

-------------------------------------------------------
 T E S T S
-------------------------------------------------------
Running org.apache.hadoop.hbase.mapreduce.TestMapReduceExamples
Tests run: 4, Failures: 0, Errors: 0, Skipped: 0, Time elapsed: 1.089 sec - in org.apache.hadoop.hbase.mapreduce.TestMapReduceExamples
[INFO] ------------------------------------------------------------------------
[INFO] Reactor Summary:
[INFO] 
[INFO] HBase ............................................. SUCCESS [3.783s]
[INFO] HBase - Checkstyle ................................ SUCCESS [0.694s]
[INFO] HBase - Annotations ............................... SUCCESS [0.975s]
[INFO] HBase - Common .................................... SUCCESS [1:22.838s]
[INFO] HBase - Protocol .................................. SUCCESS [9.213s]
[INFO] HBase - Client .................................... SUCCESS [1:19.150s]
[INFO] HBase - Hadoop Compatibility ...................... SUCCESS [7.093s]
[INFO] HBase - Hadoop Two Compatibility .................. SUCCESS [6.743s]
[INFO] HBase - Prefix Tree ............................... SUCCESS [8.827s]
[INFO] HBase - Server .................................... SUCCESS [1:11:37.766s]
[INFO] HBase - Testing Util .............................. SUCCESS [1.069s]
[INFO] HBase - Thrift .................................... SUCCESS [3:08.443s]
[INFO] HBase - Rest ...................................... SUCCESS [5:09.965s]
[INFO] HBase - Shell ..................................... SUCCESS [2:13.383s]
[INFO] HBase - Integration Tests ......................... SUCCESS [1.501s]
[INFO] HBase - Examples .................................. FAILURE [4.125s]
[INFO] HBase - Assembly .................................. SKIPPED
[INFO] ------------------------------------------------------------------------
[INFO] BUILD FAILURE
[INFO] ------------------------------------------------------------------------
[INFO] Total time: 1:25:37.692s
[INFO] Finished at: Wed Apr 08 01:57:06 UTC 2015
[INFO] Final Memory: 119M/576M
[INFO] ------------------------------------------------------------------------
[ERROR] Failed to execute goal org.apache.maven.plugins:maven-surefire-plugin:2.18:test (secondPartTestsExecution)
on project hbase-examples: Execution secondPartTestsExecution of goal org.apache.maven.plugins:maven-surefire-plugin:2.18:test
failed. NullPointerException -> [Help 1]
[ERROR] 
[ERROR] To see the full stack trace of the errors, re-run Maven with the -e switch.
[ERROR] Re-run Maven using the -X switch to enable full debug logging.
[ERROR] 
[ERROR] For more information about the errors and possible solutions, please read the following
articles:
[ERROR] [Help 1] http://cwiki.apache.org/confluence/display/MAVEN/PluginExecutionException
[ERROR] 
[ERROR] After correcting the problems, you can resume the build with the command
[ERROR]   mvn <goals> -rf :hbase-examples
Build step 'Invoke top-level Maven targets' marked build as failure
Performing Post build task...
Match found for :.* : True
Logical operation result is TRUE
Running script  :   ZOMBIE_TESTS_COUNT=`jps | grep surefirebooter | wc -l`
  if [[ $ZOMBIE_TESTS_COUNT != 0 ]] ; then
    #It seems sometimes the tests are not dying immediately. Let's give them 10s
    echo "Suspicious java process found - waiting 10s to see if there are just slow to stop"
    sleep 10   
    ZOMBIE_TESTS_COUNT=`jps | grep surefirebooter | wc -l`
    if [[ $ZOMBIE_TESTS_COUNT != 0 ]] ; then
      echo "There are $ZOMBIE_TESTS_COUNT zombie tests, they should have been killed by surefire
but survived"
      echo "************ BEGIN zombies jstack extract"
      ZB_STACK=`jps | grep surefirebooter | cut -d ' ' -f 1 | xargs -n 1 jstack | grep ".test"
| grep "\.java"`
      jps | grep surefirebooter | cut -d ' ' -f 1 | xargs -n 1 jstack
      echo "************ END  zombies jstack extract"
      JIRA_COMMENT="$JIRA_COMMENT

     {color:red}-1 core zombie tests{color}.  There are ${ZOMBIE_TESTS_COUNT} zombie test(s):
${ZB_STACK}"
      BAD=1
      jps | grep surefirebooter | cut -d ' ' -f 1 | xargs kill -9
    else
      echo "We're ok: there is no zombie test, but some tests took some time to stop"
    fi
  else
    echo "We're ok: there is no zombie test"
  fi
[HBase-1.1] $ /bin/bash -xe /tmp/hudson8763800763961805766.sh
++ jps
++ grep surefirebooter
++ wc -l
+ ZOMBIE_TESTS_COUNT=0
+ [[ 0 != 0 ]]
+ echo 'We'\''re ok: there is no zombie test'
We're ok: there is no zombie test
POST BUILD TASK : SUCCESS
END OF POST BUILD TASK : 0
Archiving artifacts
Sending artifact delta relative to HBase-1.1 #358
Archived 2056 artifacts
Archive block size is 32768
Received 27 blocks and 497485689 bytes
Compression is 0.2%
Took 4 min 0 sec
Recording test results
Updating HBASE-13412

Mime
View raw message