hbase-builds mailing list archives

Site index · List index
Message view « Date » · « Thread »
Top « Date » · « Thread »
From Apache Jenkins Server <jenk...@builds.apache.org>
Subject Build failed in Jenkins: HBase-TRUNK #6187
Date Sun, 01 Mar 2015 02:26:53 GMT
See <https://builds.apache.org/job/HBase-TRUNK/6187/changes>

Changes:

[stack] HBASE-13130 Add timeouts on TestMasterObserver, a frequent zombie show

------------------------------------------
[...truncated 1913 lines...]
Tests run: 1, Failures: 0, Errors: 0, Skipped: 0, Time elapsed: 3.418 sec - in org.apache.hadoop.hbase.security.visibility.TestDefaultScanLabelGeneratorStack
Running org.apache.hadoop.hbase.security.visibility.TestVisibilityLabelsOpWithDifferentUsersNoACL
Running org.apache.hadoop.hbase.security.visibility.TestVisibilityLabelsWithDefaultVisLabelService
Tests run: 1, Failures: 0, Errors: 0, Skipped: 0, Time elapsed: 1.767 sec - in org.apache.hadoop.hbase.security.visibility.TestVisibilityLabelsOpWithDifferentUsersNoACL
Tests run: 37, Failures: 0, Errors: 0, Skipped: 0, Time elapsed: 46.959 sec - in org.apache.hadoop.hbase.security.visibility.TestVisibilityLabelsWithDeletes
Running org.apache.hadoop.hbase.security.visibility.TestVisibilityLabelsWithACL
Tests run: 8, Failures: 0, Errors: 0, Skipped: 0, Time elapsed: 211.101 sec - in org.apache.hadoop.hbase.replication.regionserver.TestReplicationWALReaderManager
Tests run: 23, Failures: 0, Errors: 0, Skipped: 0, Time elapsed: 15.018 sec - in org.apache.hadoop.hbase.security.visibility.TestVisibilityLabelsWithDefaultVisLabelService
Tests run: 5, Failures: 0, Errors: 0, Skipped: 0, Time elapsed: 4.241 sec - in org.apache.hadoop.hbase.security.visibility.TestVisibilityLabelsWithACL
Running org.apache.hadoop.hbase.security.visibility.TestVisibilityLablesWithGroups
Running org.apache.hadoop.hbase.security.visibility.TestVisibilityLabelsWithCustomVisLabService
Tests run: 1, Failures: 0, Errors: 0, Skipped: 0, Time elapsed: 2.33 sec - in org.apache.hadoop.hbase.security.visibility.TestVisibilityLablesWithGroups
Running org.apache.hadoop.hbase.security.access.TestAccessController
Running org.apache.hadoop.hbase.security.access.TestAccessController2
Tests run: 2, Failures: 0, Errors: 0, Skipped: 0, Time elapsed: 4.322 sec - in org.apache.hadoop.hbase.security.access.TestAccessController2
Running org.apache.hadoop.hbase.security.access.TestTablePermissions
Tests run: 19, Failures: 0, Errors: 0, Skipped: 0, Time elapsed: 13.545 sec - in org.apache.hadoop.hbase.security.visibility.TestVisibilityLabelsWithCustomVisLabService
Running org.apache.hadoop.hbase.security.access.TestAccessControlFilter
Tests run: 1, Failures: 0, Errors: 0, Skipped: 0, Time elapsed: 3.913 sec - in org.apache.hadoop.hbase.security.access.TestAccessControlFilter
Running org.apache.hadoop.hbase.security.access.TestCellACLs
Tests run: 7, Failures: 0, Errors: 0, Skipped: 0, Time elapsed: 16.198 sec - in org.apache.hadoop.hbase.security.access.TestTablePermissions
Tests run: 2, Failures: 0, Errors: 0, Skipped: 0, Time elapsed: 8.77 sec - in org.apache.hadoop.hbase.security.access.TestCellACLs
Running org.apache.hadoop.hbase.security.access.TestNamespaceCommands
Tests run: 7, Failures: 0, Errors: 0, Skipped: 0, Time elapsed: 3.045 sec - in org.apache.hadoop.hbase.security.access.TestNamespaceCommands
Running org.apache.hadoop.hbase.security.access.TestZKPermissionsWatcher
Running org.apache.hadoop.hbase.security.access.TestScanEarlyTermination
Tests run: 1, Failures: 0, Errors: 0, Skipped: 0, Time elapsed: 4 sec - in org.apache.hadoop.hbase.security.access.TestZKPermissionsWatcher
Tests run: 1, Failures: 0, Errors: 0, Skipped: 0, Time elapsed: 3.076 sec - in org.apache.hadoop.hbase.security.access.TestScanEarlyTermination
Running org.apache.hadoop.hbase.security.access.TestCellACLWithMultipleVersions
Running org.apache.hadoop.hbase.security.token.TestZKSecretWatcher
Running org.apache.hadoop.hbase.security.token.TestTokenAuthentication
Tests run: 3, Failures: 0, Errors: 0, Skipped: 0, Time elapsed: 0.619 sec - in org.apache.hadoop.hbase.security.token.TestTokenAuthentication
Running org.apache.hadoop.hbase.TestMetaTableAccessorNoCluster
Tests run: 2, Failures: 0, Errors: 0, Skipped: 0, Time elapsed: 3.558 sec - in org.apache.hadoop.hbase.TestMetaTableAccessorNoCluster
Running org.apache.hadoop.hbase.TestMetaTableLocator
Tests run: 1, Failures: 0, Errors: 0, Skipped: 0, Time elapsed: 13.29 sec - in org.apache.hadoop.hbase.security.token.TestZKSecretWatcher
Tests run: 7, Failures: 0, Errors: 0, Skipped: 0, Time elapsed: 3.746 sec - in org.apache.hadoop.hbase.TestMetaTableLocator
Running org.apache.hadoop.hbase.TestHBaseTestingUtility
Running org.apache.hadoop.hbase.TestZooKeeper
Tests run: 8, Failures: 0, Errors: 0, Skipped: 0, Time elapsed: 23.384 sec - in org.apache.hadoop.hbase.security.access.TestCellACLWithMultipleVersions
Running org.apache.hadoop.hbase.snapshot.TestSnapshotDescriptionUtils
Tests run: 2, Failures: 0, Errors: 0, Skipped: 0, Time elapsed: 0.213 sec - in org.apache.hadoop.hbase.snapshot.TestSnapshotDescriptionUtils
Tests run: 57, Failures: 0, Errors: 0, Skipped: 0, Time elapsed: 91.942 sec - in org.apache.hadoop.hbase.security.access.TestAccessController
Running org.apache.hadoop.hbase.snapshot.TestSecureExportSnapshot
Tests run: 9, Failures: 0, Errors: 0, Skipped: 0, Time elapsed: 40.797 sec - in org.apache.hadoop.hbase.TestHBaseTestingUtility
Running org.apache.hadoop.hbase.snapshot.TestFlushSnapshotFromClient
Running org.apache.hadoop.hbase.snapshot.TestExportSnapshot
Tests run: 9, Failures: 0, Errors: 0, Skipped: 0, Time elapsed: 49.407 sec - in org.apache.hadoop.hbase.snapshot.TestFlushSnapshotFromClient
Running org.apache.hadoop.hbase.snapshot.TestRestoreFlushSnapshotFromClient
Tests run: 6, Failures: 0, Errors: 0, Skipped: 0, Time elapsed: 552.146 sec - in org.apache.hadoop.hbase.coprocessor.TestCoprocessorEndpoint
Running org.apache.hadoop.hbase.TestInfoServers
Tests run: 5, Failures: 0, Errors: 0, Skipped: 0, Time elapsed: 49.755 sec - in org.apache.hadoop.hbase.snapshot.TestRestoreFlushSnapshotFromClient
Tests run: 3, Failures: 0, Errors: 0, Skipped: 0, Time elapsed: 2.898 sec - in org.apache.hadoop.hbase.TestInfoServers
Running org.apache.hadoop.hbase.quotas.TestQuotaAdmin
Tests run: 2, Failures: 0, Errors: 0, Skipped: 0, Time elapsed: 2.996 sec - in org.apache.hadoop.hbase.quotas.TestQuotaAdmin
Running org.apache.hadoop.hbase.quotas.TestQuotaThrottle
Running org.apache.hadoop.hbase.quotas.TestQuotaTableUtil
Tests run: 3, Failures: 0, Errors: 0, Skipped: 0, Time elapsed: 2.716 sec - in org.apache.hadoop.hbase.quotas.TestQuotaTableUtil
Tests run: 7, Failures: 0, Errors: 0, Skipped: 0, Time elapsed: 13.398 sec - in org.apache.hadoop.hbase.quotas.TestQuotaThrottle
Running org.apache.hadoop.hbase.procedure.TestZKProcedureControllers
Running org.apache.hadoop.hbase.procedure.TestZKProcedure
Tests run: 4, Failures: 0, Errors: 0, Skipped: 0, Time elapsed: 1.736 sec - in org.apache.hadoop.hbase.procedure.TestZKProcedureControllers
Tests run: 4, Failures: 0, Errors: 0, Skipped: 0, Time elapsed: 2.238 sec - in org.apache.hadoop.hbase.procedure.TestZKProcedure
Running org.apache.hadoop.hbase.io.hfile.TestForceCacheImportantBlocks
Running org.apache.hadoop.hbase.io.hfile.TestCacheOnWrite
Tests run: 11, Failures: 0, Errors: 0, Skipped: 0, Time elapsed: 205.152 sec - in org.apache.hadoop.hbase.TestZooKeeper
Running org.apache.hadoop.hbase.io.hfile.TestHFileBlock
Tests run: 4, Failures: 0, Errors: 0, Skipped: 0, Time elapsed: 40.9 sec - in org.apache.hadoop.hbase.io.hfile.TestForceCacheImportantBlocks
Running org.apache.hadoop.hbase.io.hfile.TestHFileBlockIndex
Tests run: 10, Failures: 0, Errors: 0, Skipped: 0, Time elapsed: 14.173 sec - in org.apache.hadoop.hbase.io.hfile.TestHFileBlockIndex
Running org.apache.hadoop.hbase.io.hfile.TestHFileSeek
Tests run: 1, Failures: 0, Errors: 0, Skipped: 0, Time elapsed: 2.805 sec - in org.apache.hadoop.hbase.io.hfile.TestHFileSeek
Running org.apache.hadoop.hbase.io.hfile.TestScannerSelectionUsingTTL
Tests run: 28, Failures: 0, Errors: 0, Skipped: 0, Time elapsed: 91.87 sec - in org.apache.hadoop.hbase.io.hfile.TestHFileBlock
Running org.apache.hadoop.hbase.io.hfile.TestCacheConfig
Tests run: 6, Failures: 0, Errors: 0, Skipped: 0, Time elapsed: 1.678 sec - in org.apache.hadoop.hbase.io.hfile.TestCacheConfig
Running org.apache.hadoop.hbase.io.encoding.TestDataBlockEncoders
Tests run: 6, Failures: 0, Errors: 0, Skipped: 0, Time elapsed: 63.59 sec - in org.apache.hadoop.hbase.io.hfile.TestScannerSelectionUsingTTL
Running org.apache.hadoop.hbase.io.encoding.TestEncodedSeekers
Tests run: 9, Failures: 0, Errors: 0, Skipped: 0, Time elapsed: 314.543 sec - in org.apache.hadoop.hbase.snapshot.TestSecureExportSnapshot
Running org.apache.hadoop.hbase.io.encoding.TestBufferedDataBlockEncoder
Tests run: 1, Failures: 0, Errors: 0, Skipped: 0, Time elapsed: 18.01 sec - in org.apache.hadoop.hbase.io.encoding.TestBufferedDataBlockEncoder
Tests run: 9, Failures: 0, Errors: 0, Skipped: 0, Time elapsed: 304.45 sec - in org.apache.hadoop.hbase.snapshot.TestExportSnapshot
Running org.apache.hadoop.hbase.io.encoding.TestLoadAndSwitchEncodeOnDisk
Running org.apache.hadoop.hbase.io.encoding.TestChangingEncoding
Tests run: 1, Failures: 0, Errors: 0, Skipped: 0, Time elapsed: 22.578 sec - in org.apache.hadoop.hbase.io.encoding.TestLoadAndSwitchEncodeOnDisk
Running org.apache.hadoop.hbase.io.TestFileLink
Tests run: 5, Failures: 0, Errors: 0, Skipped: 0, Time elapsed: 12.665 sec - in org.apache.hadoop.hbase.io.TestFileLink
Tests run: 20, Failures: 0, Errors: 0, Skipped: 0, Time elapsed: 89.177 sec - in org.apache.hadoop.hbase.io.encoding.TestEncodedSeekers
Running org.apache.hadoop.hbase.wal.TestWALFiltering
Running org.apache.hadoop.hbase.wal.TestWALFactory
Tests run: 9, Failures: 0, Errors: 0, Skipped: 0, Time elapsed: 16.115 sec - in org.apache.hadoop.hbase.wal.TestWALFactory
Running org.apache.hadoop.hbase.wal.TestWALReaderOnSecureWAL
Tests run: 3, Failures: 0, Errors: 0, Skipped: 0, Time elapsed: 61.685 sec - in org.apache.hadoop.hbase.io.encoding.TestChangingEncoding
Tests run: 2, Failures: 0, Errors: 0, Skipped: 0, Time elapsed: 1.613 sec - in org.apache.hadoop.hbase.wal.TestWALReaderOnSecureWAL
Tests run: 1, Failures: 0, Errors: 0, Skipped: 0, Time elapsed: 24.581 sec - in org.apache.hadoop.hbase.wal.TestWALFiltering
Running org.apache.hadoop.hbase.wal.TestSecureWAL
Running org.apache.hadoop.hbase.wal.TestWALSplit
Running org.apache.hadoop.hbase.wal.TestDefaultWALProvider
Tests run: 1, Failures: 0, Errors: 0, Skipped: 0, Time elapsed: 1.474 sec - in org.apache.hadoop.hbase.wal.TestSecureWAL
Running org.apache.hadoop.hbase.wal.TestDefaultWALProviderWithHLogKey
Tests run: 5, Failures: 0, Errors: 0, Skipped: 0, Time elapsed: 6.392 sec - in org.apache.hadoop.hbase.wal.TestDefaultWALProvider
Running org.apache.hadoop.hbase.wal.TestBoundedRegionGroupingProvider
Tests run: 5, Failures: 0, Errors: 0, Skipped: 0, Time elapsed: 6.48 sec - in org.apache.hadoop.hbase.wal.TestDefaultWALProviderWithHLogKey
Running org.apache.hadoop.hbase.wal.TestWALSplitCompressed
Tests run: 5, Failures: 0, Errors: 0, Skipped: 0, Time elapsed: 19.593 sec - in org.apache.hadoop.hbase.wal.TestBoundedRegionGroupingProvider
Running org.apache.hadoop.hbase.zookeeper.TestZooKeeperACL
Tests run: 6, Failures: 0, Errors: 0, Skipped: 0, Time elapsed: 0.3 sec - in org.apache.hadoop.hbase.zookeeper.TestZooKeeperACL
Running org.apache.hadoop.hbase.zookeeper.TestZKLeaderManager
Tests run: 1, Failures: 0, Errors: 0, Skipped: 0, Time elapsed: 0.124 sec - in org.apache.hadoop.hbase.zookeeper.TestZKLeaderManager
Running org.apache.hadoop.hbase.zookeeper.TestZooKeeperNodeTracker
Tests run: 3, Failures: 0, Errors: 0, Skipped: 0, Time elapsed: 0.896 sec - in org.apache.hadoop.hbase.zookeeper.TestZooKeeperNodeTracker
Running org.apache.hadoop.hbase.zookeeper.TestRecoverableZooKeeper
Tests run: 1, Failures: 0, Errors: 0, Skipped: 0, Time elapsed: 1.262 sec - in org.apache.hadoop.hbase.zookeeper.TestRecoverableZooKeeper
Running org.apache.hadoop.hbase.zookeeper.TestZKMulti
Tests run: 8, Failures: 0, Errors: 0, Skipped: 0, Time elapsed: 0.622 sec - in org.apache.hadoop.hbase.zookeeper.TestZKMulti
Running org.apache.hadoop.hbase.zookeeper.lock.TestZKInterProcessReadWriteLock
Tests run: 6, Failures: 0, Errors: 0, Skipped: 0, Time elapsed: 24.531 sec - in org.apache.hadoop.hbase.zookeeper.lock.TestZKInterProcessReadWriteLock
Running org.apache.hadoop.hbase.zookeeper.TestHQuorumPeer
Tests run: 3, Failures: 0, Errors: 0, Skipped: 0, Time elapsed: 1.837 sec - in org.apache.hadoop.hbase.zookeeper.TestHQuorumPeer
Running org.apache.hadoop.hbase.TestIOFencing
Tests run: 28, Failures: 0, Errors: 0, Skipped: 0, Time elapsed: 240.109 sec - in org.apache.hadoop.hbase.io.encoding.TestDataBlockEncoders
Running org.apache.hadoop.hbase.constraint.TestConstraint
Tests run: 5, Failures: 0, Errors: 0, Skipped: 0, Time elapsed: 7.127 sec - in org.apache.hadoop.hbase.constraint.TestConstraint
Running org.apache.hadoop.hbase.TestMovedRegionsCleaner
Tests run: 1, Failures: 0, Errors: 0, Skipped: 0, Time elapsed: 8.648 sec - in org.apache.hadoop.hbase.TestMovedRegionsCleaner
Tests run: 216, Failures: 0, Errors: 0, Skipped: 0, Time elapsed: 389.503 sec - in org.apache.hadoop.hbase.io.hfile.TestCacheOnWrite
Running org.apache.hadoop.hbase.backup.example.TestZooKeeperTableArchiveClient
Tests run: 3, Failures: 0, Errors: 0, Skipped: 0, Time elapsed: 3.878 sec - in org.apache.hadoop.hbase.backup.example.TestZooKeeperTableArchiveClient
Running org.apache.hadoop.hbase.backup.TestHFileArchiving
Running org.apache.hadoop.hbase.TestHColumnDescriptorDefaultVersions
Tests run: 3, Failures: 0, Errors: 0, Skipped: 0, Time elapsed: 11.399 sec - in org.apache.hadoop.hbase.TestHColumnDescriptorDefaultVersions
Running org.apache.hadoop.hbase.ipc.TestProtoBufRpc
Tests run: 1, Failures: 0, Errors: 0, Skipped: 0, Time elapsed: 1.788 sec - in org.apache.hadoop.hbase.ipc.TestProtoBufRpc
Running org.apache.hadoop.hbase.ipc.TestDelayedRpc
Tests run: 4, Failures: 0, Errors: 0, Skipped: 0, Time elapsed: 3.451 sec - in org.apache.hadoop.hbase.ipc.TestDelayedRpc
Running org.apache.hadoop.hbase.ipc.TestHBaseClient
Tests run: 1, Failures: 0, Errors: 0, Skipped: 0, Time elapsed: 0.388 sec - in org.apache.hadoop.hbase.ipc.TestHBaseClient
Running org.apache.hadoop.hbase.TestNamespace
Tests run: 9, Failures: 0, Errors: 0, Skipped: 1, Time elapsed: 6.751 sec - in org.apache.hadoop.hbase.TestNamespace
Tests run: 5, Failures: 0, Errors: 0, Skipped: 0, Time elapsed: 49.671 sec - in org.apache.hadoop.hbase.backup.TestHFileArchiving
Tests run: 31, Failures: 0, Errors: 0, Skipped: 0, Time elapsed: 190.699 sec - in org.apache.hadoop.hbase.wal.TestWALSplit
Tests run: 31, Failures: 0, Errors: 0, Skipped: 0, Time elapsed: 188.962 sec - in org.apache.hadoop.hbase.wal.TestWALSplitCompressed
Tests run: 2, Failures: 0, Errors: 0, Skipped: 0, Time elapsed: 186.121 sec - in org.apache.hadoop.hbase.TestIOFencing

Results :

Failed tests: 
  TestSplitLogManager.testOrphanTaskAcquisition:306->waitForCounter:242->waitForCounter:249
Waiting timed out after [6,800] msec



Tests run: 2308, Failures: 1, Errors: 0, Skipped: 25

[INFO] ------------------------------------------------------------------------
[INFO] Reactor Summary:
[INFO] 
[INFO] HBase ............................................. SUCCESS [3.234s]
[INFO] HBase - Checkstyle ................................ SUCCESS [1.061s]
[INFO] HBase - Annotations ............................... SUCCESS [1.242s]
[INFO] HBase - Protocol .................................. SUCCESS [17.680s]
[INFO] HBase - Common .................................... SUCCESS [1:26.357s]
[INFO] HBase - Client .................................... SUCCESS [1:17.084s]
[INFO] HBase - Hadoop Compatibility ...................... SUCCESS [7.128s]
[INFO] HBase - Hadoop Two Compatibility .................. SUCCESS [6.756s]
[INFO] HBase - Prefix Tree ............................... SUCCESS [9.034s]
[INFO] HBase - Server .................................... FAILURE [1:09:10.580s]
[INFO] HBase - Testing Util .............................. SKIPPED
[INFO] HBase - Thrift .................................... SKIPPED
[INFO] HBase - Shell ..................................... SKIPPED
[INFO] HBase - Integration Tests ......................... SKIPPED
[INFO] HBase - Examples .................................. SKIPPED
[INFO] HBase - Rest ...................................... SKIPPED
[INFO] HBase - Assembly .................................. SKIPPED
[INFO] ------------------------------------------------------------------------
[INFO] BUILD FAILURE
[INFO] ------------------------------------------------------------------------
[INFO] Total time: 1:12:42.080s
[INFO] Finished at: Sun Mar 01 02:24:33 UTC 2015
[INFO] Final Memory: 95M/671M
[INFO] ------------------------------------------------------------------------
[ERROR] Failed to execute goal org.apache.maven.plugins:maven-surefire-plugin:2.18:test (secondPartTestsExecution)
on project hbase-server: There are test failures.
[ERROR] 
[ERROR] Please refer to <https://builds.apache.org/job/HBase-TRUNK/ws/hbase-server/target/surefire-reports>
for the individual test results.
[ERROR] -> [Help 1]
[ERROR] 
[ERROR] To see the full stack trace of the errors, re-run Maven with the -e switch.
[ERROR] Re-run Maven using the -X switch to enable full debug logging.
[ERROR] 
[ERROR] For more information about the errors and possible solutions, please read the following
articles:
[ERROR] [Help 1] http://cwiki.apache.org/confluence/display/MAVEN/MojoFailureException
[ERROR] 
[ERROR] After correcting the problems, you can resume the build with the command
[ERROR]   mvn <goals> -rf :hbase-server
Build step 'Invoke top-level Maven targets' marked build as failure
[FINDBUGS] Skipping publisher since build result is FAILURE
Performing Post build task...
Match found for :.* : True
Logical operation result is TRUE
Running script  :   ZOMBIE_TESTS_COUNT=`jps | grep surefirebooter | wc -l`
  if [[ $ZOMBIE_TESTS_COUNT != 0 ]] ; then
    #It seems sometimes the tests are not dying immediately. Let's give them 10s
    echo "Suspicious java process found - waiting 10s to see if there are just slow to stop"
    sleep 10   
    ZOMBIE_TESTS_COUNT=`jps | grep surefirebooter | wc -l`
    if [[ $ZOMBIE_TESTS_COUNT != 0 ]] ; then
      echo "There are $ZOMBIE_TESTS_COUNT zombie tests, they should have been killed by surefire
but survived"
      echo "************ BEGIN zombies jstack extract"
      ZB_STACK=`jps | grep surefirebooter | cut -d ' ' -f 1 | xargs -n 1 jstack | grep ".test"
| grep "\.java"`
      jps | grep surefirebooter | cut -d ' ' -f 1 | xargs -n 1 jstack
      echo "************ END  zombies jstack extract"
      JIRA_COMMENT="$JIRA_COMMENT

     {color:red}-1 core zombie tests{color}.  There are ${ZOMBIE_TESTS_COUNT} zombie test(s):
${ZB_STACK}"
      BAD=1
      jps | grep surefirebooter | cut -d ' ' -f 1 | xargs kill -9
    else
      echo "We're ok: there is no zombie test, but some tests took some time to stop"
    fi
  else
    echo "We're ok: there is no zombie test"
  fi
[HBase-TRUNK] $ /bin/bash -xe /tmp/hudson6738126721575321903.sh
++ jps
++ grep surefirebooter
++ wc -l
+ ZOMBIE_TESTS_COUNT=1
+ [[ 1 != 0 ]]
+ echo 'Suspicious java process found - waiting 10s to see if there are just slow to stop'
Suspicious java process found - waiting 10s to see if there are just slow to stop
+ sleep 10
++ jps
++ grep surefirebooter
++ wc -l
+ ZOMBIE_TESTS_COUNT=0
+ [[ 0 != 0 ]]
+ echo 'We'\''re ok: there is no zombie test, but some tests took some time to stop'
We're ok: there is no zombie test, but some tests took some time to stop
POST BUILD TASK : SUCCESS
END OF POST BUILD TASK : 0
Archiving artifacts
Sending artifact delta relative to HBase-TRUNK #6184
Archived 1880 artifacts
Archive block size is 32768
Received 31 blocks and 381119517 bytes
Compression is 0.3%
Took 1 min 40 sec
Recording test results
Updating HBASE-13130

Mime
View raw message