hbase-builds mailing list archives

Site index · List index
Message view « Date » · « Thread »
Top « Date » · « Thread »
From Stack <st...@duboce.net>
Subject Re: Build failed in Jenkins: HBase-TRUNK #6178
Date Fri, 27 Feb 2015 22:40:22 GMT
I see these failures:

kalashnikov-22:hbase.git stack$ python ./dev-support/findHangingTests.py
https://builds.apache.org/job/HBase-TRUNK/6178/consoleText
Fetching the console output from the URL
Printing hanging tests
Hanging test : org.apache.hadoop.hbase.TestAcidGuarantees
Hanging test : org.apache.hadoop.hbase.namespace.TestNamespaceAuditor
Printing Failing tests


I'd thought the TestAcidGuarantees addressed

St.Ack

On Fri, Feb 27, 2015 at 2:09 PM, Apache Jenkins Server <
jenkins@builds.apache.org> wrote:

> See <https://builds.apache.org/job/HBase-TRUNK/6178/>
>
> ------------------------------------------
> [...truncated 1886 lines...]
> Tests run: 1, Failures: 0, Errors: 0, Skipped: 0, Time elapsed: 1.79 sec -
> in
> org.apache.hadoop.hbase.security.visibility.TestVisibilityLabelsOpWithDifferentUsersNoACL
> Running
> org.apache.hadoop.hbase.security.visibility.TestVisibilityLabelReplicationWithExpAsString
> Running
> org.apache.hadoop.hbase.security.visibility.TestVisibilityWithCheckAuths
> Tests run: 2, Failures: 0, Errors: 0, Skipped: 0, Time elapsed: 2.843 sec
> - in
> org.apache.hadoop.hbase.security.visibility.TestVisibilityWithCheckAuths
> Running org.apache.hadoop.hbase.TestGlobalMemStoreSize
> Tests run: 1, Failures: 0, Errors: 0, Skipped: 0, Time elapsed: 16.276 sec
> - in
> org.apache.hadoop.hbase.security.visibility.TestVisibilityLabelReplicationWithExpAsString
> Tests run: 1, Failures: 0, Errors: 0, Skipped: 0, Time elapsed: 12.411 sec
> - in org.apache.hadoop.hbase.TestGlobalMemStoreSize
> Running org.apache.hadoop.hbase.TestNamespace
> Running org.apache.hadoop.hbase.constraint.TestConstraint
> Tests run: 9, Failures: 0, Errors: 0, Skipped: 1, Time elapsed: 7.972 sec
> - in org.apache.hadoop.hbase.TestNamespace
> Tests run: 37, Failures: 0, Errors: 0, Skipped: 0, Time elapsed: 48.417
> sec - in
> org.apache.hadoop.hbase.security.visibility.TestVisibilityLabelsWithDeletes
> Tests run: 5, Failures: 0, Errors: 0, Skipped: 0, Time elapsed: 8.244 sec
> - in org.apache.hadoop.hbase.constraint.TestConstraint
> Running org.apache.hadoop.hbase.filter.TestFuzzyRowAndColumnRangeFilter
> Running org.apache.hadoop.hbase.filter.TestFilterWrapper
> Running org.apache.hadoop.hbase.filter.TestMultiRowRangeFilter
> Tests run: 1, Failures: 0, Errors: 0, Skipped: 0, Time elapsed: 2.47 sec -
> in org.apache.hadoop.hbase.filter.TestFuzzyRowAndColumnRangeFilter
> Tests run: 1, Failures: 0, Errors: 0, Skipped: 0, Time elapsed: 2.249 sec
> - in org.apache.hadoop.hbase.filter.TestFilterWrapper
> Running org.apache.hadoop.hbase.filter.TestColumnRangeFilter
> Running org.apache.hadoop.hbase.filter.TestScanRowPrefix
> Tests run: 18, Failures: 0, Errors: 0, Skipped: 0, Time elapsed: 13.747
> sec - in org.apache.hadoop.hbase.filter.TestMultiRowRangeFilter
> Tests run: 1, Failures: 0, Errors: 0, Skipped: 0, Time elapsed: 2.886 sec
> - in org.apache.hadoop.hbase.filter.TestScanRowPrefix
> Running org.apache.hadoop.hbase.TestHBaseTestingUtility
> Tests run: 1, Failures: 0, Errors: 0, Skipped: 0, Time elapsed: 7.54 sec -
> in org.apache.hadoop.hbase.filter.TestColumnRangeFilter
> Running org.apache.hadoop.hbase.filter.TestFilterWithScanLimits
> Tests run: 1, Failures: 0, Errors: 0, Skipped: 0, Time elapsed: 1.655 sec
> - in org.apache.hadoop.hbase.filter.TestFilterWithScanLimits
> Running org.apache.hadoop.hbase.quotas.TestQuotaThrottle
> Running org.apache.hadoop.hbase.quotas.TestQuotaAdmin
> Tests run: 9, Failures: 0, Errors: 0, Skipped: 0, Time elapsed: 308.663
> sec - in org.apache.hadoop.hbase.snapshot.TestSecureExportSnapshot
> Tests run: 2, Failures: 0, Errors: 0, Skipped: 0, Time elapsed: 3.72 sec -
> in org.apache.hadoop.hbase.quotas.TestQuotaAdmin
> Running org.apache.hadoop.hbase.io.encoding.TestDataBlockEncoders
> Tests run: 7, Failures: 0, Errors: 0, Skipped: 0, Time elapsed: 14.287 sec
> - in org.apache.hadoop.hbase.quotas.TestQuotaThrottle
> Running org.apache.hadoop.hbase.quotas.TestQuotaTableUtil
> Tests run: 3, Failures: 0, Errors: 0, Skipped: 0, Time elapsed: 2.153 sec
> - in org.apache.hadoop.hbase.quotas.TestQuotaTableUtil
> Running org.apache.hadoop.hbase.io.encoding.TestEncodedSeekers
> Tests run: 9, Failures: 0, Errors: 0, Skipped: 0, Time elapsed: 33.885 sec
> - in org.apache.hadoop.hbase.TestHBaseTestingUtility
> Running org.apache.hadoop.hbase.io.encoding.TestChangingEncoding
> Running org.apache.hadoop.hbase.io.encoding.TestBufferedDataBlockEncoder
> Tests run: 9, Failures: 0, Errors: 0, Skipped: 0, Time elapsed: 312.448
> sec - in org.apache.hadoop.hbase.snapshot.TestExportSnapshot
> Running org.apache.hadoop.hbase.io.encoding.TestLoadAndSwitchEncodeOnDisk
> Tests run: 1, Failures: 0, Errors: 0, Skipped: 0, Time elapsed: 21.123 sec
> - in org.apache.hadoop.hbase.io.encoding.TestBufferedDataBlockEncoder
> Running org.apache.hadoop.hbase.io.hfile.TestScannerSelectionUsingTTL
> Tests run: 1, Failures: 0, Errors: 0, Skipped: 0, Time elapsed: 22.618 sec
> - in org.apache.hadoop.hbase.io.encoding.TestLoadAndSwitchEncodeOnDisk
> Running org.apache.hadoop.hbase.io.hfile.TestHFileBlock
> Tests run: 3, Failures: 0, Errors: 0, Skipped: 0, Time elapsed: 59.273 sec
> - in org.apache.hadoop.hbase.io.encoding.TestChangingEncoding
> Running org.apache.hadoop.hbase.io.hfile.TestCacheOnWrite
> Tests run: 20, Failures: 0, Errors: 0, Skipped: 0, Time elapsed: 92.368
> sec - in org.apache.hadoop.hbase.io.encoding.TestEncodedSeekers
> Tests run: 6, Failures: 0, Errors: 0, Skipped: 0, Time elapsed: 63.398 sec
> - in org.apache.hadoop.hbase.io.hfile.TestScannerSelectionUsingTTL
> Running org.apache.hadoop.hbase.io.hfile.TestHFileBlockIndex
> Running org.apache.hadoop.hbase.io.hfile.TestHFileSeek
> Tests run: 1, Failures: 0, Errors: 0, Skipped: 0, Time elapsed: 2.51 sec -
> in org.apache.hadoop.hbase.io.hfile.TestHFileSeek
> Running org.apache.hadoop.hbase.io.hfile.TestCacheConfig
> Tests run: 6, Failures: 0, Errors: 0, Skipped: 0, Time elapsed: 1.946 sec
> - in org.apache.hadoop.hbase.io.hfile.TestCacheConfig
> Tests run: 10, Failures: 0, Errors: 0, Skipped: 0, Time elapsed: 12.789
> sec - in org.apache.hadoop.hbase.io.hfile.TestHFileBlockIndex
> Running org.apache.hadoop.hbase.io.hfile.TestForceCacheImportantBlocks
> Running org.apache.hadoop.hbase.io.TestFileLink
> Tests run: 28, Failures: 0, Errors: 0, Skipped: 0, Time elapsed: 90.488
> sec - in org.apache.hadoop.hbase.io.hfile.TestHFileBlock
> Tests run: 3, Failures: 0, Errors: 0, Skipped: 0, Time elapsed: 14.014 sec
> - in org.apache.hadoop.hbase.io.TestFileLink
> Running org.apache.hadoop.hbase.procedure.TestZKProcedure
> Running org.apache.hadoop.hbase.procedure.TestZKProcedureControllers
> Tests run: 4, Failures: 0, Errors: 0, Skipped: 0, Time elapsed: 2.154 sec
> - in org.apache.hadoop.hbase.procedure.TestZKProcedure
> Tests run: 4, Failures: 0, Errors: 0, Skipped: 0, Time elapsed: 1.625 sec
> - in org.apache.hadoop.hbase.procedure.TestZKProcedureControllers
> Running org.apache.hadoop.hbase.ipc.TestHBaseClient
> Tests run: 1, Failures: 0, Errors: 0, Skipped: 0, Time elapsed: 0.406 sec
> - in org.apache.hadoop.hbase.ipc.TestHBaseClient
> Running org.apache.hadoop.hbase.ipc.TestDelayedRpc
> Running org.apache.hadoop.hbase.ipc.TestProtoBufRpc
> Tests run: 1, Failures: 0, Errors: 0, Skipped: 0, Time elapsed: 1.728 sec
> - in org.apache.hadoop.hbase.ipc.TestProtoBufRpc
> Running org.apache.hadoop.hbase.TestLocalHBaseCluster
> Tests run: 4, Failures: 0, Errors: 0, Skipped: 0, Time elapsed: 3.444 sec
> - in org.apache.hadoop.hbase.ipc.TestDelayedRpc
> Running org.apache.hadoop.hbase.TestAcidGuarantees
> Tests run: 1, Failures: 0, Errors: 0, Skipped: 0, Time elapsed: 8.046 sec
> - in org.apache.hadoop.hbase.TestLocalHBaseCluster
> Tests run: 4, Failures: 0, Errors: 0, Skipped: 0, Time elapsed: 38.735 sec
> - in org.apache.hadoop.hbase.io.hfile.TestForceCacheImportantBlocks
> Running org.apache.hadoop.hbase.zookeeper.TestRecoverableZooKeeper
> Tests run: 1, Failures: 0, Errors: 0, Skipped: 0, Time elapsed: 1.297 sec
> - in org.apache.hadoop.hbase.zookeeper.TestRecoverableZooKeeper
> Running org.apache.hadoop.hbase.zookeeper.TestZooKeeperNodeTracker
> Running org.apache.hadoop.hbase.zookeeper.TestZooKeeperACL
> Tests run: 6, Failures: 0, Errors: 0, Skipped: 0, Time elapsed: 0.387 sec
> - in org.apache.hadoop.hbase.zookeeper.TestZooKeeperACL
> Tests run: 3, Failures: 0, Errors: 0, Skipped: 0, Time elapsed: 1.414 sec
> - in org.apache.hadoop.hbase.zookeeper.TestZooKeeperNodeTracker
> Running org.apache.hadoop.hbase.zookeeper.TestHQuorumPeer
> Running org.apache.hadoop.hbase.zookeeper.TestZKLeaderManager
> Tests run: 1, Failures: 0, Errors: 0, Skipped: 0, Time elapsed: 0.151 sec
> - in org.apache.hadoop.hbase.zookeeper.TestZKLeaderManager
> Tests run: 3, Failures: 0, Errors: 0, Skipped: 0, Time elapsed: 2.354 sec
> - in org.apache.hadoop.hbase.zookeeper.TestHQuorumPeer
> Running org.apache.hadoop.hbase.zookeeper.TestZKMulti
> Running
> org.apache.hadoop.hbase.zookeeper.lock.TestZKInterProcessReadWriteLock
> Tests run: 8, Failures: 0, Errors: 0, Skipped: 0, Time elapsed: 0.791 sec
> - in org.apache.hadoop.hbase.zookeeper.TestZKMulti
> Running org.apache.hadoop.hbase.TestJMXListener
> Tests run: 6, Failures: 0, Errors: 0, Skipped: 0, Time elapsed: 24.639 sec
> - in org.apache.hadoop.hbase.zookeeper.lock.TestZKInterProcessReadWriteLock
> Tests run: 2, Failures: 0, Errors: 0, Skipped: 0, Time elapsed: 16.798 sec
> - in org.apache.hadoop.hbase.TestJMXListener
> Running org.apache.hadoop.hbase.TestMetaTableAccessorNoCluster
> Tests run: 2, Failures: 0, Errors: 0, Skipped: 0, Time elapsed: 4.259 sec
> - in org.apache.hadoop.hbase.TestMetaTableAccessorNoCluster
> Running org.apache.hadoop.hbase.TestZooKeeper
> Running
> org.apache.hadoop.hbase.replication.regionserver.TestReplicationWALReaderManager
> Tests run: 28, Failures: 0, Errors: 0, Skipped: 0, Time elapsed: 259.064
> sec - in org.apache.hadoop.hbase.io.encoding.TestDataBlockEncoders
> Running
> org.apache.hadoop.hbase.replication.regionserver.TestRegionReplicaReplicationEndpoint
> Tests run: 7, Failures: 0, Errors: 0, Skipped: 7, Time elapsed: 0.005 sec
> - in
> org.apache.hadoop.hbase.replication.regionserver.TestRegionReplicaReplicationEndpoint
> Running
> org.apache.hadoop.hbase.replication.regionserver.TestRegionReplicaReplicationEndpointNoMaster
> Tests run: 3, Failures: 0, Errors: 0, Skipped: 0, Time elapsed: 36.731 sec
> - in
> org.apache.hadoop.hbase.replication.regionserver.TestRegionReplicaReplicationEndpointNoMaster
> Running
> org.apache.hadoop.hbase.replication.regionserver.TestReplicationSink
> Tests run: 5, Failures: 0, Errors: 0, Skipped: 0, Time elapsed: 2.717 sec
> - in org.apache.hadoop.hbase.replication.regionserver.TestReplicationSink
> Running
> org.apache.hadoop.hbase.replication.regionserver.TestReplicationSourceManager
> Tests run: 4, Failures: 0, Errors: 0, Skipped: 0, Time elapsed: 4.243 sec
> - in
> org.apache.hadoop.hbase.replication.regionserver.TestReplicationSourceManager
> Running org.apache.hadoop.hbase.replication.TestReplicationTrackerZKImpl
> Tests run: 5, Failures: 0, Errors: 0, Skipped: 0, Time elapsed: 1.557 sec
> - in org.apache.hadoop.hbase.replication.TestReplicationTrackerZKImpl
> Running
> org.apache.hadoop.hbase.replication.TestReplicationKillMasterRSCompressed
> Tests run: 8, Failures: 0, Errors: 0, Skipped: 0, Time elapsed: 155.339
> sec - in
> org.apache.hadoop.hbase.replication.regionserver.TestReplicationWALReaderManager
> Tests run: 1, Failures: 0, Errors: 0, Skipped: 0, Time elapsed: 21.41 sec
> - in
> org.apache.hadoop.hbase.replication.TestReplicationKillMasterRSCompressed
> Running org.apache.hadoop.hbase.replication.TestReplicationKillMasterRS
> Running org.apache.hadoop.hbase.replication.TestMultiSlaveReplication
> Tests run: 1, Failures: 0, Errors: 0, Skipped: 0, Time elapsed: 22.71 sec
> - in org.apache.hadoop.hbase.replication.TestReplicationKillMasterRS
> Tests run: 1, Failures: 0, Errors: 0, Skipped: 0, Time elapsed: 23.39 sec
> - in org.apache.hadoop.hbase.replication.TestMultiSlaveReplication
> Tests run: 11, Failures: 0, Errors: 0, Skipped: 0, Time elapsed: 209.871
> sec - in org.apache.hadoop.hbase.TestZooKeeper
> Running
> org.apache.hadoop.hbase.replication.TestReplicationChangingPeerRegionservers
> Running org.apache.hadoop.hbase.replication.TestReplicationKillSlaveRS
> Tests run: 1, Failures: 0, Errors: 0, Skipped: 0, Time elapsed: 5.685 sec
> - in
> org.apache.hadoop.hbase.replication.TestReplicationChangingPeerRegionservers
> Running org.apache.hadoop.hbase.replication.TestPerTableCFReplication
> Tests run: 1, Failures: 0, Errors: 0, Skipped: 0, Time elapsed: 21.432 sec
> - in org.apache.hadoop.hbase.replication.TestReplicationKillSlaveRS
> Running org.apache.hadoop.hbase.replication.TestMasterReplication
> Running
> org.apache.hadoop.hbase.replication.TestReplicationDisableInactivePeer
> Tests run: 2, Failures: 0, Errors: 0, Skipped: 0, Time elapsed: 29.525 sec
> - in org.apache.hadoop.hbase.replication.TestPerTableCFReplication
> Tests run: 1, Failures: 0, Errors: 0, Skipped: 0, Time elapsed: 20.233 sec
> - in org.apache.hadoop.hbase.replication.TestReplicationDisableInactivePeer
> Running org.apache.hadoop.hbase.replication.TestReplicationWithTags
> Tests run: 1, Failures: 0, Errors: 0, Skipped: 0, Time elapsed: 2.986 sec
> - in org.apache.hadoop.hbase.replication.TestReplicationWithTags
> Running org.apache.hadoop.hbase.replication.TestReplicationEndpoint
> Tests run: 3, Failures: 0, Errors: 0, Skipped: 0, Time elapsed: 2.355 sec
> - in org.apache.hadoop.hbase.replication.TestReplicationEndpoint
> Tests run: 3, Failures: 0, Errors: 0, Skipped: 0, Time elapsed: 45.372 sec
> - in org.apache.hadoop.hbase.replication.TestMasterReplication
> Running org.apache.hadoop.hbase.replication.TestReplicationSource
> Tests run: 1, Failures: 0, Errors: 0, Skipped: 0, Time elapsed: 0.226 sec
> - in org.apache.hadoop.hbase.replication.TestReplicationSource
> Running org.apache.hadoop.hbase.replication.TestReplicationSmallTests
> Running org.apache.hadoop.hbase.replication.TestReplicationStateZKImpl
> Tests run: 6, Failures: 0, Errors: 0, Skipped: 0, Time elapsed: 0.861 sec
> - in org.apache.hadoop.hbase.replication.TestReplicationStateZKImpl
> Running org.apache.hadoop.hbase.fs.TestBlockReorder
> Tests run: 216, Failures: 0, Errors: 0, Skipped: 0, Time elapsed: 428.58
> sec - in org.apache.hadoop.hbase.io.hfile.TestCacheOnWrite
> Running org.apache.hadoop.hbase.replication.TestReplicationSyncUpTool
> Tests run: 3, Failures: 0, Errors: 0, Skipped: 0, Time elapsed: 18.775 sec
> - in org.apache.hadoop.hbase.fs.TestBlockReorder
> Running org.apache.hadoop.hbase.trace.TestHTraceHooks
> Tests run: 1, Failures: 0, Errors: 0, Skipped: 0, Time elapsed: 2.192 sec
> - in org.apache.hadoop.hbase.trace.TestHTraceHooks
> Running org.apache.hadoop.hbase.TestMetaTableLocator
> Tests run: 7, Failures: 0, Errors: 0, Skipped: 0, Time elapsed: 4.044 sec
> - in org.apache.hadoop.hbase.TestMetaTableLocator
> Running org.apache.hadoop.hbase.namespace.TestNamespaceAuditor
> Tests run: 10, Failures: 0, Errors: 0, Skipped: 0, Time elapsed: 45.1 sec
> - in org.apache.hadoop.hbase.replication.TestReplicationSmallTests
> Running org.apache.hadoop.hbase.mapred.TestTableSnapshotInputFormat
> Running org.apache.hadoop.hbase.mapred.TestTableMapReduceUtil
> Tests run: 1, Failures: 0, Errors: 0, Skipped: 0, Time elapsed: 52.106 sec
> - in org.apache.hadoop.hbase.replication.TestReplicationSyncUpTool
> Running org.apache.hadoop.hbase.mapred.TestTableInputFormat
> Tests run: 4, Failures: 0, Errors: 0, Skipped: 0, Time elapsed: 90.973 sec
> - in org.apache.hadoop.hbase.mapred.TestTableMapReduceUtil
> Tests run: 8, Failures: 0, Errors: 0, Skipped: 0, Time elapsed: 85.728 sec
> - in org.apache.hadoop.hbase.mapred.TestTableInputFormat
> Running org.apache.hadoop.hbase.mapred.TestTableMapReduce
> Running org.apache.hadoop.hbase.TestMultiVersions
> Tests run: 3, Failures: 0, Errors: 0, Skipped: 0, Time elapsed: 6.24 sec -
> in org.apache.hadoop.hbase.TestMultiVersions
> Tests run: 2, Failures: 0, Errors: 0, Skipped: 0, Time elapsed: 101.237
> sec - in org.apache.hadoop.hbase.mapred.TestTableMapReduce
> Tests run: 6, Failures: 0, Errors: 0, Skipped: 0, Time elapsed: 274.879
> sec - in org.apache.hadoop.hbase.mapred.TestTableSnapshotInputFormat
>
> Results :
>
>
>
>
> Tests run: 2296, Failures: 0, Errors: 0, Skipped: 25
>
> [INFO]
> ------------------------------------------------------------------------
> [INFO] Reactor Summary:
> [INFO]
> [INFO] HBase ............................................. SUCCESS [2.948s]
> [INFO] HBase - Checkstyle ................................ SUCCESS [0.613s]
> [INFO] HBase - Annotations ............................... SUCCESS [0.853s]
> [INFO] HBase - Protocol .................................. SUCCESS
> [13.043s]
> [INFO] HBase - Common .................................... SUCCESS
> [1:24.833s]
> [INFO] HBase - Client .................................... SUCCESS
> [1:17.002s]
> [INFO] HBase - Hadoop Compatibility ...................... SUCCESS [7.100s]
> [INFO] HBase - Hadoop Two Compatibility .................. SUCCESS [6.580s]
> [INFO] HBase - Prefix Tree ............................... SUCCESS [9.078s]
> [INFO] HBase - Server .................................... FAILURE
> [1:20:16.906s]
> [INFO] HBase - Testing Util .............................. SKIPPED
> [INFO] HBase - Thrift .................................... SKIPPED
> [INFO] HBase - Shell ..................................... SKIPPED
> [INFO] HBase - Integration Tests ......................... SKIPPED
> [INFO] HBase - Examples .................................. SKIPPED
> [INFO] HBase - Rest ...................................... SKIPPED
> [INFO] HBase - Assembly .................................. SKIPPED
> [INFO]
> ------------------------------------------------------------------------
> [INFO] BUILD FAILURE
> [INFO]
> ------------------------------------------------------------------------
> [INFO] Total time: 1:23:40.754s
> [INFO] Finished at: Fri Feb 27 22:07:28 UTC 2015
> [INFO] Final Memory: 98M/956M
> [INFO]
> ------------------------------------------------------------------------
> [ERROR] Failed to execute goal
> org.apache.maven.plugins:maven-surefire-plugin:2.18:test
> (secondPartTestsExecution) on project hbase-server: There was a timeout or
> other error in the fork -> [Help 1]
> [ERROR]
> [ERROR] To see the full stack trace of the errors, re-run Maven with the
> -e switch.
> [ERROR] Re-run Maven using the -X switch to enable full debug logging.
> [ERROR]
> [ERROR] For more information about the errors and possible solutions,
> please read the following articles:
> [ERROR] [Help 1]
> http://cwiki.apache.org/confluence/display/MAVEN/MojoFailureException
> [ERROR]
> [ERROR] After correcting the problems, you can resume the build with the
> command
> [ERROR]   mvn <goals> -rf :hbase-server
> Build step 'Invoke top-level Maven targets' marked build as failure
> [FINDBUGS] Skipping publisher since build result is FAILURE
> Performing Post build task...
> Match found for :.* : True
> Logical operation result is TRUE
> Running script  :   ZOMBIE_TESTS_COUNT=`jps | grep surefirebooter | wc -l`
>   if [[ $ZOMBIE_TESTS_COUNT != 0 ]] ; then
>     #It seems sometimes the tests are not dying immediately. Let's give
> them 10s
>     echo "Suspicious java process found - waiting 10s to see if there are
> just slow to stop"
>     sleep 10
>     ZOMBIE_TESTS_COUNT=`jps | grep surefirebooter | wc -l`
>     if [[ $ZOMBIE_TESTS_COUNT != 0 ]] ; then
>       echo "There are $ZOMBIE_TESTS_COUNT zombie tests, they should have
> been killed by surefire but survived"
>       echo "************ BEGIN zombies jstack extract"
>       ZB_STACK=`jps | grep surefirebooter | cut -d ' ' -f 1 | xargs -n 1
> jstack | grep ".test" | grep "\.java"`
>       jps | grep surefirebooter | cut -d ' ' -f 1 | xargs -n 1 jstack
>       echo "************ END  zombies jstack extract"
>       JIRA_COMMENT="$JIRA_COMMENT
>
>      {color:red}-1 core zombie tests{color}.  There are
> ${ZOMBIE_TESTS_COUNT} zombie test(s): ${ZB_STACK}"
>       BAD=1
>       jps | grep surefirebooter | cut -d ' ' -f 1 | xargs kill -9
>     else
>       echo "We're ok: there is no zombie test, but some tests took some
> time to stop"
>     fi
>   else
>     echo "We're ok: there is no zombie test"
>   fi
> [HBase-TRUNK] $ /bin/bash -xe /tmp/hudson7930225765079748708.sh
> ++ jps
> ++ grep surefirebooter
> ++ wc -l
> + ZOMBIE_TESTS_COUNT=1
> + [[ 1 != 0 ]]
> + echo 'Suspicious java process found - waiting 10s to see if there are
> just slow to stop'
> Suspicious java process found - waiting 10s to see if there are just slow
> to stop
> + sleep 10
> ++ jps
> ++ grep surefirebooter
> ++ wc -l
> + ZOMBIE_TESTS_COUNT=0
> + [[ 0 != 0 ]]
> + echo 'We'\''re ok: there is no zombie test, but some tests took some
> time to stop'
> We're ok: there is no zombie test, but some tests took some time to stop
> POST BUILD TASK : SUCCESS
> END OF POST BUILD TASK : 0
> Archiving artifacts
> Sending artifact delta relative to HBase-TRUNK #6164
> Archived 1873 artifacts
> Archive block size is 32768
> Received 31 blocks and 383943538 bytes
> Compression is 0.3%
> Took 1 min 46 sec
> Recording test results
>

Mime
  • Unnamed multipart/alternative (inline, None, 0 bytes)
View raw message