hbase-builds mailing list archives

Site index · List index
Message view « Date » · « Thread »
Top « Date » · « Thread »
From Apache Jenkins Server <jenk...@builds.apache.org>
Subject Build failed in Jenkins: HBase-TRUNK #6176
Date Fri, 27 Feb 2015 18:24:17 GMT
See <https://builds.apache.org/job/HBase-TRUNK/6176/changes>

Changes:

[stack] HBASE-13084 addendum move replication_admin_test.rb to individual test

[stack] HBASE-13097 Use same EventLoopGroup for different AsyncRpcClients if possible

------------------------------------------
[...truncated 1889 lines...]
Running org.apache.hadoop.hbase.TestGlobalMemStoreSize
Tests run: 1, Failures: 0, Errors: 0, Skipped: 0, Time elapsed: 17.186 sec - in org.apache.hadoop.hbase.security.visibility.TestVisibilityLabelReplicationWithExpAsString
Tests run: 1, Failures: 0, Errors: 0, Skipped: 0, Time elapsed: 13.372 sec - in org.apache.hadoop.hbase.TestGlobalMemStoreSize
Running org.apache.hadoop.hbase.constraint.TestConstraint
Running org.apache.hadoop.hbase.TestNamespace
Tests run: 9, Failures: 0, Errors: 0, Skipped: 1, Time elapsed: 6.773 sec - in org.apache.hadoop.hbase.TestNamespace
Tests run: 5, Failures: 0, Errors: 0, Skipped: 0, Time elapsed: 8.587 sec - in org.apache.hadoop.hbase.constraint.TestConstraint
Tests run: 37, Failures: 0, Errors: 0, Skipped: 0, Time elapsed: 48.049 sec - in org.apache.hadoop.hbase.security.visibility.TestVisibilityLabelsWithDeletes
Running org.apache.hadoop.hbase.filter.TestFilterWrapper
Running org.apache.hadoop.hbase.filter.TestFuzzyRowAndColumnRangeFilter
Running org.apache.hadoop.hbase.filter.TestMultiRowRangeFilter
Tests run: 1, Failures: 0, Errors: 0, Skipped: 0, Time elapsed: 1.956 sec - in org.apache.hadoop.hbase.filter.TestFilterWrapper
Tests run: 1, Failures: 0, Errors: 0, Skipped: 0, Time elapsed: 2.543 sec - in org.apache.hadoop.hbase.filter.TestFuzzyRowAndColumnRangeFilter
Tests run: 18, Failures: 0, Errors: 0, Skipped: 0, Time elapsed: 11.482 sec - in org.apache.hadoop.hbase.filter.TestMultiRowRangeFilter
Running org.apache.hadoop.hbase.filter.TestColumnRangeFilter
Running org.apache.hadoop.hbase.filter.TestScanRowPrefix
Tests run: 1, Failures: 0, Errors: 0, Skipped: 0, Time elapsed: 3.205 sec - in org.apache.hadoop.hbase.filter.TestScanRowPrefix
Running org.apache.hadoop.hbase.TestHBaseTestingUtility
Tests run: 1, Failures: 0, Errors: 0, Skipped: 0, Time elapsed: 7.999 sec - in org.apache.hadoop.hbase.filter.TestColumnRangeFilter
Running org.apache.hadoop.hbase.filter.TestFilterWithScanLimits
Tests run: 1, Failures: 0, Errors: 0, Skipped: 0, Time elapsed: 2.237 sec - in org.apache.hadoop.hbase.filter.TestFilterWithScanLimits
Running org.apache.hadoop.hbase.quotas.TestQuotaThrottle
Tests run: 9, Failures: 0, Errors: 0, Skipped: 0, Time elapsed: 313.974 sec - in org.apache.hadoop.hbase.snapshot.TestSecureExportSnapshot
Running org.apache.hadoop.hbase.quotas.TestQuotaAdmin
Tests run: 2, Failures: 0, Errors: 0, Skipped: 0, Time elapsed: 3.307 sec - in org.apache.hadoop.hbase.quotas.TestQuotaAdmin
Running org.apache.hadoop.hbase.quotas.TestQuotaTableUtil
Running org.apache.hadoop.hbase.io.encoding.TestDataBlockEncoders
Tests run: 7, Failures: 0, Errors: 0, Skipped: 0, Time elapsed: 14.54 sec - in org.apache.hadoop.hbase.quotas.TestQuotaThrottle
Tests run: 3, Failures: 0, Errors: 0, Skipped: 0, Time elapsed: 1.773 sec - in org.apache.hadoop.hbase.quotas.TestQuotaTableUtil
Tests run: 9, Failures: 0, Errors: 0, Skipped: 0, Time elapsed: 312.794 sec - in org.apache.hadoop.hbase.snapshot.TestExportSnapshot
Running org.apache.hadoop.hbase.io.encoding.TestEncodedSeekers
Running org.apache.hadoop.hbase.io.encoding.TestBufferedDataBlockEncoder
Tests run: 9, Failures: 0, Errors: 0, Skipped: 0, Time elapsed: 32.892 sec - in org.apache.hadoop.hbase.TestHBaseTestingUtility
Running org.apache.hadoop.hbase.io.encoding.TestLoadAndSwitchEncodeOnDisk
Running org.apache.hadoop.hbase.io.encoding.TestChangingEncoding
Tests run: 1, Failures: 0, Errors: 0, Skipped: 0, Time elapsed: 21.519 sec - in org.apache.hadoop.hbase.io.encoding.TestBufferedDataBlockEncoder
Tests run: 1, Failures: 0, Errors: 0, Skipped: 0, Time elapsed: 23.249 sec - in org.apache.hadoop.hbase.io.encoding.TestLoadAndSwitchEncodeOnDisk
Running org.apache.hadoop.hbase.io.hfile.TestScannerSelectionUsingTTL
Running org.apache.hadoop.hbase.io.hfile.TestHFileBlock
Tests run: 3, Failures: 0, Errors: 0, Skipped: 0, Time elapsed: 63.396 sec - in org.apache.hadoop.hbase.io.encoding.TestChangingEncoding
Running org.apache.hadoop.hbase.io.hfile.TestCacheOnWrite
Tests run: 6, Failures: 0, Errors: 0, Skipped: 0, Time elapsed: 63.231 sec - in org.apache.hadoop.hbase.io.hfile.TestScannerSelectionUsingTTL
Running org.apache.hadoop.hbase.io.hfile.TestHFileBlockIndex
Tests run: 20, Failures: 0, Errors: 0, Skipped: 0, Time elapsed: 95.579 sec - in org.apache.hadoop.hbase.io.encoding.TestEncodedSeekers
Running org.apache.hadoop.hbase.io.hfile.TestHFileSeek
Tests run: 1, Failures: 0, Errors: 0, Skipped: 0, Time elapsed: 2.366 sec - in org.apache.hadoop.hbase.io.hfile.TestHFileSeek
Running org.apache.hadoop.hbase.io.hfile.TestCacheConfig
Tests run: 6, Failures: 0, Errors: 0, Skipped: 0, Time elapsed: 2.012 sec - in org.apache.hadoop.hbase.io.hfile.TestCacheConfig
Tests run: 10, Failures: 0, Errors: 0, Skipped: 0, Time elapsed: 12.546 sec - in org.apache.hadoop.hbase.io.hfile.TestHFileBlockIndex
Running org.apache.hadoop.hbase.io.hfile.TestForceCacheImportantBlocks
Running org.apache.hadoop.hbase.io.TestFileLink
Tests run: 28, Failures: 0, Errors: 0, Skipped: 0, Time elapsed: 90.537 sec - in org.apache.hadoop.hbase.io.hfile.TestHFileBlock
Running org.apache.hadoop.hbase.procedure.TestZKProcedure
Tests run: 4, Failures: 0, Errors: 0, Skipped: 0, Time elapsed: 2.1 sec - in org.apache.hadoop.hbase.procedure.TestZKProcedure
Tests run: 3, Failures: 0, Errors: 0, Skipped: 0, Time elapsed: 13.277 sec - in org.apache.hadoop.hbase.io.TestFileLink
Running org.apache.hadoop.hbase.procedure.TestZKProcedureControllers
Running org.apache.hadoop.hbase.ipc.TestHBaseClient
Tests run: 1, Failures: 0, Errors: 0, Skipped: 0, Time elapsed: 0.369 sec - in org.apache.hadoop.hbase.ipc.TestHBaseClient
Tests run: 4, Failures: 0, Errors: 0, Skipped: 0, Time elapsed: 4.64 sec - in org.apache.hadoop.hbase.procedure.TestZKProcedureControllers
Running org.apache.hadoop.hbase.ipc.TestDelayedRpc
Running org.apache.hadoop.hbase.ipc.TestProtoBufRpc
Tests run: 1, Failures: 0, Errors: 0, Skipped: 0, Time elapsed: 1.739 sec - in org.apache.hadoop.hbase.ipc.TestProtoBufRpc
Running org.apache.hadoop.hbase.TestLocalHBaseCluster
Tests run: 4, Failures: 0, Errors: 0, Skipped: 0, Time elapsed: 3.406 sec - in org.apache.hadoop.hbase.ipc.TestDelayedRpc
Running org.apache.hadoop.hbase.TestAcidGuarantees
Tests run: 1, Failures: 0, Errors: 0, Skipped: 0, Time elapsed: 8.448 sec - in org.apache.hadoop.hbase.TestLocalHBaseCluster
Tests run: 4, Failures: 0, Errors: 0, Skipped: 0, Time elapsed: 40.037 sec - in org.apache.hadoop.hbase.io.hfile.TestForceCacheImportantBlocks
Running org.apache.hadoop.hbase.zookeeper.TestRecoverableZooKeeper
Tests run: 1, Failures: 0, Errors: 0, Skipped: 0, Time elapsed: 1.342 sec - in org.apache.hadoop.hbase.zookeeper.TestRecoverableZooKeeper
Running org.apache.hadoop.hbase.zookeeper.TestZooKeeperACL
Tests run: 6, Failures: 0, Errors: 0, Skipped: 0, Time elapsed: 0.528 sec - in org.apache.hadoop.hbase.zookeeper.TestZooKeeperACL
Running org.apache.hadoop.hbase.zookeeper.TestZooKeeperNodeTracker
Tests run: 3, Failures: 0, Errors: 0, Skipped: 0, Time elapsed: 1.121 sec - in org.apache.hadoop.hbase.zookeeper.TestZooKeeperNodeTracker
Running org.apache.hadoop.hbase.zookeeper.TestHQuorumPeer
Running org.apache.hadoop.hbase.zookeeper.TestZKLeaderManager
Tests run: 1, Failures: 0, Errors: 0, Skipped: 0, Time elapsed: 0.161 sec - in org.apache.hadoop.hbase.zookeeper.TestZKLeaderManager
Tests run: 3, Failures: 0, Errors: 0, Skipped: 0, Time elapsed: 1.857 sec - in org.apache.hadoop.hbase.zookeeper.TestHQuorumPeer
Running org.apache.hadoop.hbase.zookeeper.TestZKMulti
Running org.apache.hadoop.hbase.zookeeper.lock.TestZKInterProcessReadWriteLock
Tests run: 8, Failures: 0, Errors: 0, Skipped: 0, Time elapsed: 0.672 sec - in org.apache.hadoop.hbase.zookeeper.TestZKMulti
Running org.apache.hadoop.hbase.TestJMXListener
Tests run: 6, Failures: 0, Errors: 0, Skipped: 0, Time elapsed: 24.662 sec - in org.apache.hadoop.hbase.zookeeper.lock.TestZKInterProcessReadWriteLock
Running org.apache.hadoop.hbase.TestMetaTableAccessorNoCluster
Tests run: 2, Failures: 0, Errors: 0, Skipped: 0, Time elapsed: 16.222 sec - in org.apache.hadoop.hbase.TestJMXListener
Tests run: 2, Failures: 0, Errors: 0, Skipped: 0, Time elapsed: 4.073 sec - in org.apache.hadoop.hbase.TestMetaTableAccessorNoCluster
Running org.apache.hadoop.hbase.TestZooKeeper
Running org.apache.hadoop.hbase.replication.regionserver.TestReplicationWALReaderManager
Tests run: 3, Failures: 0, Errors: 0, Skipped: 0, Time elapsed: 102.472 sec - in org.apache.hadoop.hbase.TestAcidGuarantees
Running org.apache.hadoop.hbase.replication.regionserver.TestRegionReplicaReplicationEndpoint
Tests run: 7, Failures: 0, Errors: 0, Skipped: 7, Time elapsed: 0.005 sec - in org.apache.hadoop.hbase.replication.regionserver.TestRegionReplicaReplicationEndpoint
Tests run: 28, Failures: 0, Errors: 0, Skipped: 0, Time elapsed: 254.368 sec - in org.apache.hadoop.hbase.io.encoding.TestDataBlockEncoders
Running org.apache.hadoop.hbase.replication.regionserver.TestRegionReplicaReplicationEndpointNoMaster
Running org.apache.hadoop.hbase.replication.regionserver.TestReplicationSink
Tests run: 5, Failures: 0, Errors: 0, Skipped: 0, Time elapsed: 2.339 sec - in org.apache.hadoop.hbase.replication.regionserver.TestReplicationSink
Running org.apache.hadoop.hbase.replication.regionserver.TestReplicationSourceManager
Tests run: 4, Failures: 0, Errors: 0, Skipped: 0, Time elapsed: 4.127 sec - in org.apache.hadoop.hbase.replication.regionserver.TestReplicationSourceManager
Running org.apache.hadoop.hbase.replication.TestReplicationTrackerZKImpl
Tests run: 5, Failures: 0, Errors: 0, Skipped: 0, Time elapsed: 1.159 sec - in org.apache.hadoop.hbase.replication.TestReplicationTrackerZKImpl
Running org.apache.hadoop.hbase.replication.TestReplicationKillMasterRSCompressed
Tests run: 3, Failures: 0, Errors: 0, Skipped: 0, Time elapsed: 38.323 sec - in org.apache.hadoop.hbase.replication.regionserver.TestRegionReplicaReplicationEndpointNoMaster
Running org.apache.hadoop.hbase.replication.TestReplicationKillMasterRS
Tests run: 1, Failures: 0, Errors: 0, Skipped: 0, Time elapsed: 24.298 sec - in org.apache.hadoop.hbase.replication.TestReplicationKillMasterRSCompressed
Running org.apache.hadoop.hbase.replication.TestMultiSlaveReplication
Tests run: 1, Failures: 0, Errors: 0, Skipped: 0, Time elapsed: 22.555 sec - in org.apache.hadoop.hbase.replication.TestReplicationKillMasterRS
Tests run: 1, Failures: 0, Errors: 0, Skipped: 0, Time elapsed: 22.283 sec - in org.apache.hadoop.hbase.replication.TestMultiSlaveReplication
Running org.apache.hadoop.hbase.replication.TestReplicationChangingPeerRegionservers
Running org.apache.hadoop.hbase.replication.TestReplicationKillSlaveRS
Tests run: 1, Failures: 0, Errors: 0, Skipped: 0, Time elapsed: 5.357 sec - in org.apache.hadoop.hbase.replication.TestReplicationChangingPeerRegionservers
Running org.apache.hadoop.hbase.replication.TestPerTableCFReplication
Tests run: 1, Failures: 0, Errors: 0, Skipped: 0, Time elapsed: 21.633 sec - in org.apache.hadoop.hbase.replication.TestReplicationKillSlaveRS
Tests run: 8, Failures: 0, Errors: 0, Skipped: 0, Time elapsed: 189.909 sec - in org.apache.hadoop.hbase.replication.regionserver.TestReplicationWALReaderManager
Running org.apache.hadoop.hbase.replication.TestMasterReplication
Running org.apache.hadoop.hbase.replication.TestReplicationDisableInactivePeer
Tests run: 2, Failures: 0, Errors: 0, Skipped: 0, Time elapsed: 28.435 sec - in org.apache.hadoop.hbase.replication.TestPerTableCFReplication
Tests run: 11, Failures: 0, Errors: 0, Skipped: 0, Time elapsed: 206.921 sec - in org.apache.hadoop.hbase.TestZooKeeper
Tests run: 1, Failures: 0, Errors: 0, Skipped: 0, Time elapsed: 21.041 sec - in org.apache.hadoop.hbase.replication.TestReplicationDisableInactivePeer
Running org.apache.hadoop.hbase.replication.TestReplicationWithTags
Tests run: 1, Failures: 0, Errors: 0, Skipped: 0, Time elapsed: 2.961 sec - in org.apache.hadoop.hbase.replication.TestReplicationWithTags
Running org.apache.hadoop.hbase.replication.TestReplicationEndpoint
Running org.apache.hadoop.hbase.replication.TestReplicationSource
Tests run: 1, Failures: 0, Errors: 0, Skipped: 0, Time elapsed: 0.233 sec - in org.apache.hadoop.hbase.replication.TestReplicationSource
Tests run: 3, Failures: 0, Errors: 0, Skipped: 0, Time elapsed: 2.162 sec - in org.apache.hadoop.hbase.replication.TestReplicationEndpoint
Running org.apache.hadoop.hbase.replication.TestReplicationStateZKImpl
Tests run: 6, Failures: 0, Errors: 0, Skipped: 0, Time elapsed: 1.014 sec - in org.apache.hadoop.hbase.replication.TestReplicationStateZKImpl
Running org.apache.hadoop.hbase.replication.TestReplicationSmallTests
Running org.apache.hadoop.hbase.fs.TestBlockReorder
Tests run: 3, Failures: 0, Errors: 0, Skipped: 0, Time elapsed: 48.653 sec - in org.apache.hadoop.hbase.replication.TestMasterReplication
Running org.apache.hadoop.hbase.replication.TestReplicationSyncUpTool
Tests run: 3, Failures: 0, Errors: 0, Skipped: 0, Time elapsed: 17.957 sec - in org.apache.hadoop.hbase.fs.TestBlockReorder
Running org.apache.hadoop.hbase.trace.TestHTraceHooks
Tests run: 1, Failures: 0, Errors: 0, Skipped: 0, Time elapsed: 1.831 sec - in org.apache.hadoop.hbase.trace.TestHTraceHooks
Running org.apache.hadoop.hbase.TestMetaTableLocator
Tests run: 7, Failures: 0, Errors: 0, Skipped: 0, Time elapsed: 3.723 sec - in org.apache.hadoop.hbase.TestMetaTableLocator
Running org.apache.hadoop.hbase.namespace.TestNamespaceAuditor
Tests run: 216, Failures: 0, Errors: 0, Skipped: 0, Time elapsed: 402.613 sec - in org.apache.hadoop.hbase.io.hfile.TestCacheOnWrite
Tests run: 10, Failures: 0, Errors: 0, Skipped: 0, Time elapsed: 45.607 sec - in org.apache.hadoop.hbase.replication.TestReplicationSmallTests
Running org.apache.hadoop.hbase.mapred.TestTableSnapshotInputFormat
Running org.apache.hadoop.hbase.mapred.TestTableMapReduceUtil
Tests run: 1, Failures: 0, Errors: 0, Skipped: 0, Time elapsed: 52.345 sec - in org.apache.hadoop.hbase.replication.TestReplicationSyncUpTool
Running org.apache.hadoop.hbase.mapred.TestTableInputFormat
Running org.apache.hadoop.hbase.mapred.TestTableMapReduce
Tests run: 4, Failures: 0, Errors: 0, Skipped: 0, Time elapsed: 91.758 sec - in org.apache.hadoop.hbase.mapred.TestTableMapReduceUtil
Running org.apache.hadoop.hbase.TestMultiVersions
Tests run: 8, Failures: 0, Errors: 0, Skipped: 0, Time elapsed: 88.991 sec - in org.apache.hadoop.hbase.mapred.TestTableInputFormat
Tests run: 3, Failures: 0, Errors: 0, Skipped: 0, Time elapsed: 6.031 sec - in org.apache.hadoop.hbase.TestMultiVersions
Tests run: 6, Failures: 0, Errors: 0, Skipped: 0, Time elapsed: 142.536 sec - in org.apache.hadoop.hbase.namespace.TestNamespaceAuditor
Tests run: 2, Failures: 0, Errors: 0, Skipped: 0, Time elapsed: 102.331 sec - in org.apache.hadoop.hbase.mapred.TestTableMapReduce
Tests run: 6, Failures: 0, Errors: 0, Skipped: 0, Time elapsed: 255.241 sec - in org.apache.hadoop.hbase.mapred.TestTableSnapshotInputFormat

Results :




Tests run: 2298, Failures: 0, Errors: 0, Skipped: 25

[INFO] ------------------------------------------------------------------------
[INFO] Reactor Summary:
[INFO] 
[INFO] HBase ............................................. SUCCESS [3.080s]
[INFO] HBase - Checkstyle ................................ SUCCESS [0.794s]
[INFO] HBase - Annotations ............................... SUCCESS [1.032s]
[INFO] HBase - Protocol .................................. SUCCESS [17.579s]
[INFO] HBase - Common .................................... SUCCESS [1:30.422s]
[INFO] HBase - Client .................................... SUCCESS [1:18.033s]
[INFO] HBase - Hadoop Compatibility ...................... SUCCESS [7.097s]
[INFO] HBase - Hadoop Two Compatibility .................. SUCCESS [6.559s]
[INFO] HBase - Prefix Tree ............................... SUCCESS [8.873s]
[INFO] HBase - Server .................................... FAILURE [1:12:48.631s]
[INFO] HBase - Testing Util .............................. SKIPPED
[INFO] HBase - Thrift .................................... SKIPPED
[INFO] HBase - Shell ..................................... SKIPPED
[INFO] HBase - Integration Tests ......................... SKIPPED
[INFO] HBase - Examples .................................. SKIPPED
[INFO] HBase - Rest ...................................... SKIPPED
[INFO] HBase - Assembly .................................. SKIPPED
[INFO] ------------------------------------------------------------------------
[INFO] BUILD FAILURE
[INFO] ------------------------------------------------------------------------
[INFO] Total time: 1:16:23.967s
[INFO] Finished at: Fri Feb 27 18:21:45 UTC 2015
[INFO] Final Memory: 95M/655M
[INFO] ------------------------------------------------------------------------
[ERROR] Failed to execute goal org.apache.maven.plugins:maven-surefire-plugin:2.18:test (secondPartTestsExecution)
on project hbase-server: There was a timeout or other error in the fork -> [Help 1]
[ERROR] 
[ERROR] To see the full stack trace of the errors, re-run Maven with the -e switch.
[ERROR] Re-run Maven using the -X switch to enable full debug logging.
[ERROR] 
[ERROR] For more information about the errors and possible solutions, please read the following
articles:
[ERROR] [Help 1] http://cwiki.apache.org/confluence/display/MAVEN/MojoFailureException
[ERROR] 
[ERROR] After correcting the problems, you can resume the build with the command
[ERROR]   mvn <goals> -rf :hbase-server
Build step 'Invoke top-level Maven targets' marked build as failure
[FINDBUGS] Skipping publisher since build result is FAILURE
Performing Post build task...
Match found for :.* : True
Logical operation result is TRUE
Running script  :   ZOMBIE_TESTS_COUNT=`jps | grep surefirebooter | wc -l`
  if [[ $ZOMBIE_TESTS_COUNT != 0 ]] ; then
    #It seems sometimes the tests are not dying immediately. Let's give them 10s
    echo "Suspicious java process found - waiting 10s to see if there are just slow to stop"
    sleep 10   
    ZOMBIE_TESTS_COUNT=`jps | grep surefirebooter | wc -l`
    if [[ $ZOMBIE_TESTS_COUNT != 0 ]] ; then
      echo "There are $ZOMBIE_TESTS_COUNT zombie tests, they should have been killed by surefire
but survived"
      echo "************ BEGIN zombies jstack extract"
      ZB_STACK=`jps | grep surefirebooter | cut -d ' ' -f 1 | xargs -n 1 jstack | grep ".test"
| grep "\.java"`
      jps | grep surefirebooter | cut -d ' ' -f 1 | xargs -n 1 jstack
      echo "************ END  zombies jstack extract"
      JIRA_COMMENT="$JIRA_COMMENT

     {color:red}-1 core zombie tests{color}.  There are ${ZOMBIE_TESTS_COUNT} zombie test(s):
${ZB_STACK}"
      BAD=1
      jps | grep surefirebooter | cut -d ' ' -f 1 | xargs kill -9
    else
      echo "We're ok: there is no zombie test, but some tests took some time to stop"
    fi
  else
    echo "We're ok: there is no zombie test"
  fi
[HBase-TRUNK] $ /bin/bash -xe /tmp/hudson9039318699231739227.sh
++ jps
++ grep surefirebooter
++ wc -l
+ ZOMBIE_TESTS_COUNT=1
+ [[ 1 != 0 ]]
+ echo 'Suspicious java process found - waiting 10s to see if there are just slow to stop'
Suspicious java process found - waiting 10s to see if there are just slow to stop
+ sleep 10
++ jps
++ grep surefirebooter
++ wc -l
+ ZOMBIE_TESTS_COUNT=0
+ [[ 0 != 0 ]]
+ echo 'We'\''re ok: there is no zombie test, but some tests took some time to stop'
We're ok: there is no zombie test, but some tests took some time to stop
POST BUILD TASK : SUCCESS
END OF POST BUILD TASK : 0
Archiving artifacts
Sending artifact delta relative to HBase-TRUNK #6164
Archived 1875 artifacts
Archive block size is 32768
Received 31 blocks and 453876575 bytes
Compression is 0.2%
Took 1 min 52 sec
Recording test results
Updating HBASE-13097
Updating HBASE-13084

Mime
View raw message