hbase-builds mailing list archives

Site index · List index
Message view « Date » · « Thread »
Top « Date » · « Thread »
From Apache Jenkins Server <jenk...@builds.apache.org>
Subject Build failed in Jenkins: HBase-1.0 #708
Date Thu, 05 Feb 2015 09:37:14 GMT
See <https://builds.apache.org/job/HBase-1.0/708/changes>

Changes:

[stack] HBASE-12958 SSH doing hbase:meta get but hbase:meta not assigned

------------------------------------------
[...truncated 2457 lines...]
Running org.apache.hadoop.hbase.master.TestAssignmentListener
Tests run: 2, Failures: 0, Errors: 0, Skipped: 0, Time elapsed: 5.901 sec - in org.apache.hadoop.hbase.master.TestAssignmentListener
Running org.apache.hadoop.hbase.master.TestHMasterRPCException
Tests run: 1, Failures: 0, Errors: 0, Skipped: 0, Time elapsed: 2.255 sec - in org.apache.hadoop.hbase.master.TestHMasterRPCException
Running org.apache.hadoop.hbase.master.TestDeadServer
Tests run: 3, Failures: 0, Errors: 0, Skipped: 0, Time elapsed: 0.288 sec - in org.apache.hadoop.hbase.master.TestDeadServer
Running org.apache.hadoop.hbase.master.TestMasterRestartAfterDisablingTable
Tests run: 1, Failures: 0, Errors: 0, Skipped: 0, Time elapsed: 12.948 sec - in org.apache.hadoop.hbase.master.TestMasterRestartAfterDisablingTable
Running org.apache.hadoop.hbase.master.TestZKBasedOpenCloseRegion
Tests run: 3, Failures: 0, Errors: 0, Skipped: 0, Time elapsed: 3.151 sec - in org.apache.hadoop.hbase.master.TestZKBasedOpenCloseRegion
Running org.apache.hadoop.hbase.master.TestMasterFailoverBalancerPersistence
Tests run: 1, Failures: 0, Errors: 0, Skipped: 0, Time elapsed: 13.049 sec - in org.apache.hadoop.hbase.master.TestMasterFailoverBalancerPersistence
Running org.apache.hadoop.hbase.master.snapshot.TestSnapshotFileCache
Tests run: 5, Failures: 0, Errors: 0, Skipped: 0, Time elapsed: 25.914 sec - in org.apache.hadoop.hbase.master.snapshot.TestSnapshotFileCache
Running org.apache.hadoop.hbase.master.TestMasterShutdown
Tests run: 2, Failures: 0, Errors: 0, Skipped: 0, Time elapsed: 14.205 sec - in org.apache.hadoop.hbase.master.TestMasterShutdown
Running org.apache.hadoop.hbase.master.cleaner.TestHFileCleaner
Tests run: 3, Failures: 0, Errors: 0, Skipped: 0, Time elapsed: 1.015 sec - in org.apache.hadoop.hbase.master.cleaner.TestHFileCleaner
Running org.apache.hadoop.hbase.master.cleaner.TestSnapshotFromMaster
Tests run: 4, Failures: 0, Errors: 0, Skipped: 0, Time elapsed: 10.724 sec - in org.apache.hadoop.hbase.master.cleaner.TestSnapshotFromMaster
Running org.apache.hadoop.hbase.master.cleaner.TestLogsCleaner
Tests run: 1, Failures: 0, Errors: 0, Skipped: 0, Time elapsed: 11.031 sec - in org.apache.hadoop.hbase.master.cleaner.TestLogsCleaner
Running org.apache.hadoop.hbase.master.TestMasterOperationsForRegionReplicas
Tests run: 2, Failures: 0, Errors: 0, Skipped: 0, Time elapsed: 14.237 sec - in org.apache.hadoop.hbase.master.TestMasterOperationsForRegionReplicas
Running org.apache.hadoop.hbase.master.TestGetInfoPort
Tests run: 1, Failures: 0, Errors: 0, Skipped: 0, Time elapsed: 9.419 sec - in org.apache.hadoop.hbase.master.TestGetInfoPort
Running org.apache.hadoop.hbase.master.TestMasterStatusServlet
Tests run: 4, Failures: 0, Errors: 0, Skipped: 0, Time elapsed: 1.277 sec - in org.apache.hadoop.hbase.master.TestMasterStatusServlet
Running org.apache.hadoop.hbase.master.balancer.TestStochasticLoadBalancer
Running org.apache.hadoop.hbase.master.balancer.TestDefaultLoadBalancer
Tests run: 1, Failures: 0, Errors: 0, Skipped: 0, Time elapsed: 1.417 sec - in org.apache.hadoop.hbase.master.balancer.TestDefaultLoadBalancer
Running org.apache.hadoop.hbase.master.balancer.TestBaseLoadBalancer
Tests run: 7, Failures: 0, Errors: 0, Skipped: 0, Time elapsed: 0.517 sec - in org.apache.hadoop.hbase.master.balancer.TestBaseLoadBalancer
Running org.apache.hadoop.hbase.master.TestMasterFailover
Running org.apache.hadoop.hbase.master.TestDistributedLogSplitting
Tests run: 2, Failures: 0, Errors: 2, Skipped: 0, Time elapsed: 613.587 sec <<< FAILURE!
- in org.apache.hadoop.hbase.TestRegionRebalancing
testRebalanceOnRegionServerNumberChange[0](org.apache.hadoop.hbase.TestRegionRebalancing)
 Time elapsed: 309.081 sec  <<< ERROR!
java.lang.Exception: test timed out after 300000 milliseconds
	at java.lang.Thread.sleep(Native Method)
	at org.apache.hadoop.hbase.TestRegionRebalancing.waitForAllRegionsAssigned(TestRegionRebalancing.java:244)
	at org.apache.hadoop.hbase.TestRegionRebalancing.assertRegionsAreBalanced(TestRegionRebalancing.java:173)
	at org.apache.hadoop.hbase.TestRegionRebalancing.testRebalanceOnRegionServerNumberChange(TestRegionRebalancing.java:138)

testRebalanceOnRegionServerNumberChange[1](org.apache.hadoop.hbase.TestRegionRebalancing)
 Time elapsed: 304.448 sec  <<< ERROR!
java.lang.Exception: test timed out after 300000 milliseconds
	at java.lang.Thread.sleep(Native Method)
	at org.apache.hadoop.hbase.TestRegionRebalancing.waitForAllRegionsAssigned(TestRegionRebalancing.java:244)
	at org.apache.hadoop.hbase.TestRegionRebalancing.assertRegionsAreBalanced(TestRegionRebalancing.java:173)
	at org.apache.hadoop.hbase.TestRegionRebalancing.testRebalanceOnRegionServerNumberChange(TestRegionRebalancing.java:138)

Running org.apache.hadoop.hbase.master.TestMasterNoCluster
Tests run: 3, Failures: 0, Errors: 0, Skipped: 0, Time elapsed: 13.31 sec - in org.apache.hadoop.hbase.master.TestMasterNoCluster
Running org.apache.hadoop.hbase.master.TestGetLastFlushedSequenceId
Tests run: 7, Failures: 0, Errors: 0, Skipped: 0, Time elapsed: 64.314 sec - in org.apache.hadoop.hbase.master.TestMasterFailover
Running org.apache.hadoop.hbase.master.TestRollingRestart
Tests run: 1, Failures: 0, Errors: 0, Skipped: 0, Time elapsed: 12.727 sec - in org.apache.hadoop.hbase.master.TestGetLastFlushedSequenceId
Tests run: 1, Failures: 1, Errors: 0, Skipped: 0, Time elapsed: 13.408 sec <<< FAILURE!
- in org.apache.hadoop.hbase.master.TestRollingRestart
testBasicRollingRestart(org.apache.hadoop.hbase.master.TestRollingRestart)  Time elapsed:
13.332 sec  <<< FAILURE!
java.lang.AssertionError: expected:<22> but was:<15>
	at org.junit.Assert.fail(Assert.java:88)
	at org.junit.Assert.failNotEquals(Assert.java:743)
	at org.junit.Assert.assertEquals(Assert.java:118)
	at org.junit.Assert.assertEquals(Assert.java:555)
	at org.junit.Assert.assertEquals(Assert.java:542)
	at org.apache.hadoop.hbase.master.TestRollingRestart.assertRegionsAssigned(TestRollingRestart.java:249)
	at org.apache.hadoop.hbase.master.TestRollingRestart.testBasicRollingRestart(TestRollingRestart.java:173)

Running org.apache.hadoop.hbase.master.TestRegionPlacement2
Tests run: 2, Failures: 0, Errors: 0, Skipped: 0, Time elapsed: 2.144 sec - in org.apache.hadoop.hbase.master.TestRegionPlacement2
Running org.apache.hadoop.hbase.master.TestMaster
Tests run: 4, Failures: 0, Errors: 0, Skipped: 0, Time elapsed: 6.063 sec - in org.apache.hadoop.hbase.master.TestMaster
Running org.apache.hadoop.hbase.master.TestMasterMetricsWrapper
Running org.apache.hadoop.hbase.master.TestActiveMasterManager
Tests run: 1, Failures: 0, Errors: 0, Skipped: 0, Time elapsed: 1.898 sec - in org.apache.hadoop.hbase.master.TestMasterMetricsWrapper
Tests run: 2, Failures: 0, Errors: 0, Skipped: 0, Time elapsed: 1.004 sec - in org.apache.hadoop.hbase.master.TestActiveMasterManager
Running org.apache.hadoop.hbase.master.TestRestartCluster
Running org.apache.hadoop.hbase.master.TestOpenedRegionHandler
Running org.apache.hadoop.hbase.master.TestMasterTransitions
Tests run: 3, Failures: 0, Errors: 0, Skipped: 3, Time elapsed: 2.204 sec - in org.apache.hadoop.hbase.master.TestMasterTransitions
Tests run: 2, Failures: 0, Errors: 0, Skipped: 0, Time elapsed: 12.237 sec - in org.apache.hadoop.hbase.master.TestOpenedRegionHandler
Running org.apache.hadoop.hbase.master.handler.TestCreateTableHandler
Running org.apache.hadoop.hbase.master.handler.TestTableDescriptorModification
Tests run: 3, Failures: 0, Errors: 0, Skipped: 0, Time elapsed: 4.406 sec - in org.apache.hadoop.hbase.master.handler.TestTableDescriptorModification
Tests run: 3, Failures: 0, Errors: 0, Skipped: 0, Time elapsed: 33.323 sec - in org.apache.hadoop.hbase.master.TestRestartCluster
Running org.apache.hadoop.hbase.master.TestSplitLogManager
Running org.apache.hadoop.hbase.master.handler.TestTableDeleteFamilyHandler
Tests run: 1, Failures: 0, Errors: 0, Skipped: 0, Time elapsed: 1.64 sec - in org.apache.hadoop.hbase.master.handler.TestTableDeleteFamilyHandler
Tests run: 3, Failures: 0, Errors: 0, Skipped: 0, Time elapsed: 22.124 sec - in org.apache.hadoop.hbase.master.handler.TestCreateTableHandler
Running org.apache.hadoop.hbase.master.TestAssignmentManagerOnCluster
Running org.apache.hadoop.hbase.master.TestRegionPlacement
Tests run: 15, Failures: 0, Errors: 0, Skipped: 0, Time elapsed: 133.41 sec - in org.apache.hadoop.hbase.master.TestSplitLogManager
Running org.apache.hadoop.hbase.master.TestClusterStatusPublisher
Tests run: 3, Failures: 0, Errors: 0, Skipped: 0, Time elapsed: 0.429 sec - in org.apache.hadoop.hbase.master.TestClusterStatusPublisher
Running org.apache.hadoop.hbase.master.TestTableLockManager
Tests run: 23, Failures: 0, Errors: 0, Skipped: 0, Time elapsed: 519.495 sec - in org.apache.hadoop.hbase.master.balancer.TestStochasticLoadBalancer
Running org.apache.hadoop.hbase.master.TestMasterMetrics
Tests run: 2, Failures: 0, Errors: 0, Skipped: 0, Time elapsed: 1.483 sec - in org.apache.hadoop.hbase.master.TestMasterMetrics
Running org.apache.hadoop.hbase.master.TestZKLessAMOnCluster
Tests run: 5, Failures: 0, Errors: 0, Skipped: 0, Time elapsed: 73.558 sec - in org.apache.hadoop.hbase.master.TestTableLockManager
Running org.apache.hadoop.hbase.master.TestMasterFileSystem
Tests run: 2, Failures: 0, Errors: 0, Skipped: 0, Time elapsed: 1.335 sec - in org.apache.hadoop.hbase.master.TestMasterFileSystem
Running org.apache.hadoop.hbase.master.TestAssignmentManager
Tests run: 20, Failures: 0, Errors: 0, Skipped: 0, Time elapsed: 4.359 sec - in org.apache.hadoop.hbase.master.TestAssignmentManager
Tests run: 21, Failures: 0, Errors: 1, Skipped: 0, Time elapsed: 332.925 sec <<<
FAILURE! - in org.apache.hadoop.hbase.master.TestAssignmentManagerOnCluster
testSSHWaitForServerToAssignRegion(org.apache.hadoop.hbase.master.TestAssignmentManagerOnCluster)
 Time elapsed: 300.053 sec  <<< ERROR!
java.lang.Exception: test timed out after 300000 milliseconds
	at java.lang.Thread.sleep(Native Method)
	at java.lang.Thread.sleep(Thread.java:340)
	at java.util.concurrent.TimeUnit.sleep(TimeUnit.java:360)
	at org.apache.hadoop.hbase.util.RetryCounter.sleepUntilNextRetry(RetryCounter.java:156)
	at org.apache.hadoop.hbase.HBaseTestingUtility.getRSForFirstRegionInTable(HBaseTestingUtility.java:2293)
	at org.apache.hadoop.hbase.master.TestAssignmentManagerOnCluster.testSSHWaitForServerToAssignRegion(TestAssignmentManagerOnCluster.java:1102)

Tests run: 21, Failures: 0, Errors: 1, Skipped: 0, Time elapsed: 333.046 sec <<<
FAILURE! - in org.apache.hadoop.hbase.master.TestZKLessAMOnCluster
testSSHWaitForServerToAssignRegion(org.apache.hadoop.hbase.master.TestZKLessAMOnCluster) 
Time elapsed: 300.071 sec  <<< ERROR!
java.lang.Exception: test timed out after 300000 milliseconds
	at java.lang.Thread.sleep(Native Method)
	at java.lang.Thread.sleep(Thread.java:340)
	at java.util.concurrent.TimeUnit.sleep(TimeUnit.java:360)
	at org.apache.hadoop.hbase.util.RetryCounter.sleepUntilNextRetry(RetryCounter.java:156)
	at org.apache.hadoop.hbase.HBaseTestingUtility.getRSForFirstRegionInTable(HBaseTestingUtility.java:2293)
	at org.apache.hadoop.hbase.master.TestAssignmentManagerOnCluster.testSSHWaitForServerToAssignRegion(TestAssignmentManagerOnCluster.java:1102)
	at sun.reflect.NativeMethodAccessorImpl.invoke0(Native Method)
	at sun.reflect.NativeMethodAccessorImpl.invoke(NativeMethodAccessorImpl.java:57)
	at sun.reflect.DelegatingMethodAccessorImpl.invoke(DelegatingMethodAccessorImpl.java:43)
	at java.lang.reflect.Method.invoke(Method.java:606)
	at org.junit.runners.model.FrameworkMethod$1.runReflectiveCall(FrameworkMethod.java:47)
	at org.junit.internal.runners.model.ReflectiveCallable.run(ReflectiveCallable.java:12)
	at org.junit.runners.model.FrameworkMethod.invokeExplosively(FrameworkMethod.java:44)
	at org.junit.internal.runners.statements.InvokeMethod.evaluate(InvokeMethod.java:17)
	at org.junit.internal.runners.statements.FailOnTimeout$StatementThread.run(FailOnTimeout.java:74)


Results :

Failed tests: 
  TestIOFencing.testFencingAroundCompaction:222->doTest:308 Waiting timed out after [60,000]
msec
  TestIOFencing.testFencingAroundCompactionAfterWALSync:234->doTest:308 Waiting timed out
after [60,000] msec
  TestRollingRestart.testBasicRollingRestart:173->assertRegionsAssigned:249 expected:<22>
but was:<15>

Tests in error: 
  TestFullLogReconstruction.testReconstruction:109 » Runtime org.apache.hadoop.h...
  TestRegionRebalancing.testRebalanceOnRegionServerNumberChange:138->assertRegionsAreBalanced:173->waitForAllRegionsAssigned:244
» 
  TestRegionRebalancing.testRebalanceOnRegionServerNumberChange:138->assertRegionsAreBalanced:173->waitForAllRegionsAssigned:244
» 
  TestHTableMultiplexerFlushCache.testOnRegionChange:112->checkExistence:77 » RetriesExhausted
  TestAssignmentManagerOnCluster.testSSHWaitForServerToAssignRegion:1102 »  test...
  TestZKLessAMOnCluster>TestAssignmentManagerOnCluster.testSSHWaitForServerToAssignRegion:1102
» 
  TestHRegionOnCluster.testDataCorrectnessReplayingRecoveredEdits:130->putDataAndVerify:143->Object.wait:-2
» 
  TestZKLessSplitOnCluster>TestSplitTransactionOnCluster.testSSHCleanupDaugtherRegionsOfAbortedSplit:1287
» 
  TestSecureWALReplay>TestWALReplay.testReplayEditsAfterRegionMovedWithMultiCF:242 » RetriesExhausted
  TestWALReplay.testReplayEditsAfterRegionMovedWithMultiCF:242 » RetriesExhausted
  TestWALReplayCompressed>TestWALReplay.testReplayEditsAfterRegionMovedWithMultiCF:242
» RetriesExhausted
  TestReplicationChangingPeerRegionservers.testChangingNumberOfPeerRegionServers:104->doPutTest:130
» RetriesExhausted
  TestReplicationKillSlaveRS.killOneSlaveRS » RetriesExhausted Failed after atte...


Tests run: 2189, Failures: 3, Errors: 13, Skipped: 18

[INFO] ------------------------------------------------------------------------
[INFO] Reactor Summary:
[INFO] 
[INFO] HBase ............................................. SUCCESS [3.031s]
[INFO] HBase - Checkstyle ................................ SUCCESS [0.609s]
[INFO] HBase - Annotations ............................... SUCCESS [0.811s]
[INFO] HBase - Common .................................... SUCCESS [59.727s]
[INFO] HBase - Protocol .................................. SUCCESS [9.136s]
[INFO] HBase - Client .................................... SUCCESS [1:14.277s]
[INFO] HBase - Hadoop Compatibility ...................... SUCCESS [6.947s]
[INFO] HBase - Hadoop Two Compatibility .................. SUCCESS [6.033s]
[INFO] HBase - Prefix Tree ............................... SUCCESS [8.199s]
[INFO] HBase - Server .................................... FAILURE [1:49:47.179s]
[INFO] HBase - Testing Util .............................. SKIPPED
[INFO] HBase - Thrift .................................... SKIPPED
[INFO] HBase - Rest ...................................... SKIPPED
[INFO] HBase - Shell ..................................... SKIPPED
[INFO] HBase - Integration Tests ......................... SKIPPED
[INFO] HBase - Examples .................................. SKIPPED
[INFO] HBase - Assembly .................................. SKIPPED
[INFO] ------------------------------------------------------------------------
[INFO] BUILD FAILURE
[INFO] ------------------------------------------------------------------------
[INFO] Total time: 1:52:36.731s
[INFO] Finished at: Thu Feb 05 09:31:56 UTC 2015
[INFO] Final Memory: 53M/446M
[INFO] ------------------------------------------------------------------------
[ERROR] Failed to execute goal org.apache.maven.plugins:maven-surefire-plugin:2.18:test (secondPartTestsExecution)
on project hbase-server: There was a timeout or other error in the fork -> [Help 1]
[ERROR] 
[ERROR] To see the full stack trace of the errors, re-run Maven with the -e switch.
[ERROR] Re-run Maven using the -X switch to enable full debug logging.
[ERROR] 
[ERROR] For more information about the errors and possible solutions, please read the following
articles:
[ERROR] [Help 1] http://cwiki.apache.org/confluence/display/MAVEN/MojoFailureException
[ERROR] 
[ERROR] After correcting the problems, you can resume the build with the command
[ERROR]   mvn <goals> -rf :hbase-server
Build step 'Invoke top-level Maven targets' marked build as failure
Performing Post build task...
Match found for :.* : True
Logical operation result is TRUE
Running script  :   ZOMBIE_TESTS_COUNT=`jps | grep surefirebooter | wc -l`
  if [[ $ZOMBIE_TESTS_COUNT != 0 ]] ; then
    #It seems sometimes the tests are not dying immediately. Let's give them 10s
    echo "Suspicious java process found - waiting 10s to see if there are just slow to stop"
    sleep 10   
    ZOMBIE_TESTS_COUNT=`jps | grep surefirebooter | wc -l`
    if [[ $ZOMBIE_TESTS_COUNT != 0 ]] ; then
      echo "There are $ZOMBIE_TESTS_COUNT zombie tests, they should have been killed by surefire
but survived"
      echo "************ BEGIN zombies jstack extract"
      ZB_STACK=`jps | grep surefirebooter | cut -d ' ' -f 1 | xargs -n 1 jstack | grep ".test"
| grep "\.java"`
      jps | grep surefirebooter | cut -d ' ' -f 1 | xargs -n 1 jstack
      echo "************ END  zombies jstack extract"
      JIRA_COMMENT="$JIRA_COMMENT

     {color:red}-1 core zombie tests{color}.  There are ${ZOMBIE_TESTS_COUNT} zombie test(s):
${ZB_STACK}"
      BAD=1
      jps | grep surefirebooter | cut -d ' ' -f 1 | xargs kill -9
    else
      echo "We're ok: there is no zombie test, but some tests took some time to stop"
    fi
  else
    echo "We're ok: there is no zombie test"
  fi
[HBase-1.0] $ /bin/bash -xe /tmp/hudson1788651130991435495.sh
++ jps
++ grep surefirebooter
++ wc -l
+ ZOMBIE_TESTS_COUNT=6
+ [[ 6 != 0 ]]
+ echo 'Suspicious java process found - waiting 10s to see if there are just slow to stop'
Suspicious java process found - waiting 10s to see if there are just slow to stop
+ sleep 10
++ jps
++ grep surefirebooter
++ wc -l
+ ZOMBIE_TESTS_COUNT=0
+ [[ 0 != 0 ]]
+ echo 'We'\''re ok: there is no zombie test, but some tests took some time to stop'
We're ok: there is no zombie test, but some tests took some time to stop
POST BUILD TASK : SUCCESS
END OF POST BUILD TASK : 0
Archiving artifacts
Sending artifact delta relative to HBase-1.0 #707
Archived 1831 artifacts
Archive block size is 32768
Received 27 blocks and 1268289584 bytes
Compression is 0.1%
Took 4 min 51 sec
Recording test results
Updating HBASE-12958

Mime
View raw message