hbase-builds mailing list archives

Site index · List index
Message view « Date » · « Thread »
Top « Date » · « Thread »
From Apache Jenkins Server <jenk...@builds.apache.org>
Subject Build failed in Jenkins: HBase-1.1 #191
Date Wed, 18 Feb 2015 01:48:59 GMT
See <https://builds.apache.org/job/HBase-1.1/191/changes>

Changes:

[apurtell] HBASE-13059 Set executable bit for scripts in dev-support (Dima Spivak)

------------------------------------------
[...truncated 1834 lines...]
Running org.apache.hadoop.hbase.client.replication.TestReplicationAdmin
Tests run: 5, Failures: 0, Errors: 0, Skipped: 0, Time elapsed: 0.466 sec - in org.apache.hadoop.hbase.client.replication.TestReplicationAdmin
Running org.apache.hadoop.hbase.client.TestFromClientSideNoCodec
Tests run: 2, Failures: 0, Errors: 0, Skipped: 0, Time elapsed: 2.031 sec - in org.apache.hadoop.hbase.client.TestFromClientSideNoCodec
Running org.apache.hadoop.hbase.client.TestRpcControllerFactory
Tests run: 1, Failures: 0, Errors: 0, Skipped: 0, Time elapsed: 1.285 sec - in org.apache.hadoop.hbase.client.TestRpcControllerFactory
Running org.apache.hadoop.hbase.client.TestHTableMultiplexer
Tests run: 5, Failures: 0, Errors: 0, Skipped: 0, Time elapsed: 88.404 sec - in org.apache.hadoop.hbase.client.TestCloneSnapshotFromClientWithRegionReplicas
Tests run: 1, Failures: 0, Errors: 0, Skipped: 0, Time elapsed: 7.753 sec - in org.apache.hadoop.hbase.client.TestHTableMultiplexer
Running org.apache.hadoop.hbase.client.TestClientPushback
Tests run: 1, Failures: 0, Errors: 0, Skipped: 0, Time elapsed: 1.217 sec - in org.apache.hadoop.hbase.client.TestClientPushback
Running org.apache.hadoop.hbase.client.TestHTablePool$TestHTableThreadLocalPool
Tests run: 9, Failures: 0, Errors: 0, Skipped: 0, Time elapsed: 2.765 sec - in org.apache.hadoop.hbase.client.TestHTablePool$TestHTableThreadLocalPool
Tests run: 5, Failures: 0, Errors: 0, Skipped: 0, Time elapsed: 78.836 sec - in org.apache.hadoop.hbase.client.TestRestoreSnapshotFromClient
Running org.apache.hadoop.hbase.client.TestRestoreSnapshotFromClientWithRegionReplicas
Running org.apache.hadoop.hbase.client.TestTableSnapshotScanner
Running org.apache.hadoop.hbase.client.TestClientScannerRPCTimeout
Tests run: 1, Failures: 0, Errors: 0, Skipped: 0, Time elapsed: 7.804 sec - in org.apache.hadoop.hbase.client.TestClientScannerRPCTimeout
Running org.apache.hadoop.hbase.client.TestAdmin2
Tests run: 14, Failures: 0, Errors: 0, Skipped: 0, Time elapsed: 106.444 sec - in org.apache.hadoop.hbase.client.TestReplicasClient
Tests run: 3, Failures: 0, Errors: 0, Skipped: 0, Time elapsed: 37.84 sec - in org.apache.hadoop.hbase.client.TestTableSnapshotScanner
Running org.apache.hadoop.hbase.client.TestHTableUtil
Tests run: 2, Failures: 0, Errors: 0, Skipped: 0, Time elapsed: 2.48 sec - in org.apache.hadoop.hbase.client.TestHTableUtil
Running org.apache.hadoop.hbase.client.TestUpdateConfiguration
Tests run: 2, Failures: 0, Errors: 0, Skipped: 0, Time elapsed: 0.202 sec - in org.apache.hadoop.hbase.client.TestUpdateConfiguration
Running org.apache.hadoop.hbase.client.TestScannersFromClientSide
Tests run: 5, Failures: 0, Errors: 0, Skipped: 0, Time elapsed: 5.195 sec - in org.apache.hadoop.hbase.client.TestScannersFromClientSide
Running org.apache.hadoop.hbase.client.TestFromClientSide
Running org.apache.hadoop.hbase.client.TestSnapshotFromClientWithRegionReplicas
Tests run: 23, Failures: 0, Errors: 0, Skipped: 0, Time elapsed: 55.192 sec - in org.apache.hadoop.hbase.client.TestAdmin2
Tests run: 5, Failures: 0, Errors: 0, Skipped: 0, Time elapsed: 12.486 sec - in org.apache.hadoop.hbase.client.TestSnapshotFromClientWithRegionReplicas
Tests run: 5, Failures: 0, Errors: 0, Skipped: 0, Time elapsed: 89.95 sec - in org.apache.hadoop.hbase.client.TestRestoreSnapshotFromClientWithRegionReplicas
Running org.apache.hadoop.hbase.client.TestCheckAndMutate
Running org.apache.hadoop.hbase.client.TestSnapshotMetadata
Tests run: 1, Failures: 0, Errors: 0, Skipped: 0, Time elapsed: 1.858 sec - in org.apache.hadoop.hbase.client.TestCheckAndMutate
Tests run: 21, Failures: 0, Errors: 0, Skipped: 3, Time elapsed: 146.879 sec - in org.apache.hadoop.hbase.client.TestHCM
Running org.apache.hadoop.hbase.TestDrainingServer
Tests run: 2, Failures: 0, Errors: 0, Skipped: 0, Time elapsed: 1.835 sec - in org.apache.hadoop.hbase.TestDrainingServer
Running org.apache.hadoop.hbase.client.TestClientOperationInterrupt
Running org.apache.hadoop.hbase.client.TestFromClientSideWithCoprocessor
Tests run: 4, Failures: 0, Errors: 0, Skipped: 0, Time elapsed: 13.758 sec - in org.apache.hadoop.hbase.client.TestSnapshotMetadata
Running org.apache.hadoop.hbase.util.hbck.TestOfflineMetaRebuildBase
Running org.apache.hadoop.hbase.TestMetaTableAccessor
Tests run: 11, Failures: 0, Errors: 0, Skipped: 0, Time elapsed: 10.002 sec - in org.apache.hadoop.hbase.TestMetaTableAccessor
Running org.apache.hadoop.hbase.util.hbck.TestOfflineMetaRebuildOverlap
Tests run: 1, Failures: 0, Errors: 0, Skipped: 0, Time elapsed: 21.437 sec - in org.apache.hadoop.hbase.util.hbck.TestOfflineMetaRebuildBase
Running org.apache.hadoop.hbase.util.hbck.TestOfflineMetaRebuildHole
Tests run: 1, Failures: 0, Errors: 0, Skipped: 0, Time elapsed: 19.892 sec - in org.apache.hadoop.hbase.util.hbck.TestOfflineMetaRebuildOverlap
Running org.apache.hadoop.hbase.util.TestTableName
Tests run: 5, Failures: 0, Errors: 0, Skipped: 0, Time elapsed: 0.554 sec - in org.apache.hadoop.hbase.util.TestTableName
Running org.apache.hadoop.hbase.util.TestCoprocessorScanPolicy
Tests run: 1, Failures: 0, Errors: 0, Skipped: 0, Time elapsed: 20.381 sec - in org.apache.hadoop.hbase.util.hbck.TestOfflineMetaRebuildHole
Running org.apache.hadoop.hbase.util.TestMiniClusterLoadEncoded
Tests run: 81, Failures: 0, Errors: 0, Skipped: 4, Time elapsed: 91.624 sec - in org.apache.hadoop.hbase.client.TestFromClientSide
Tests run: 4, Failures: 0, Errors: 0, Skipped: 0, Time elapsed: 4.724 sec - in org.apache.hadoop.hbase.util.TestCoprocessorScanPolicy
Tests run: 1, Failures: 0, Errors: 0, Skipped: 0, Time elapsed: 54.057 sec - in org.apache.hadoop.hbase.client.TestClientOperationInterrupt
Running org.apache.hadoop.hbase.util.TestIdLock
Running org.apache.hadoop.hbase.util.TestMiniClusterLoadSequential
Running org.apache.hadoop.hbase.util.TestMergeTable
Tests run: 1, Failures: 0, Errors: 0, Skipped: 0, Time elapsed: 15.361 sec - in org.apache.hadoop.hbase.util.TestIdLock
Running org.apache.hadoop.hbase.util.TestHBaseFsckEncryption
Tests run: 1, Failures: 0, Errors: 0, Skipped: 0, Time elapsed: 22.058 sec - in org.apache.hadoop.hbase.util.TestMergeTable
Running org.apache.hadoop.hbase.util.TestMiniClusterLoadParallel
Tests run: 1, Failures: 0, Errors: 0, Skipped: 0, Time elapsed: 13.49 sec - in org.apache.hadoop.hbase.util.TestHBaseFsckEncryption
Tests run: 81, Failures: 0, Errors: 0, Skipped: 4, Time elapsed: 90.767 sec - in org.apache.hadoop.hbase.client.TestFromClientSideWithCoprocessor
Running org.apache.hadoop.hbase.util.TestProcessBasedCluster
Tests run: 1, Failures: 0, Errors: 0, Skipped: 0, Time elapsed: 0.137 sec - in org.apache.hadoop.hbase.util.TestProcessBasedCluster
Tests run: 5, Failures: 0, Errors: 0, Skipped: 0, Time elapsed: 46.45 sec - in org.apache.hadoop.hbase.util.TestMiniClusterLoadEncoded
Tests run: 4, Failures: 0, Errors: 0, Skipped: 0, Time elapsed: 44.231 sec - in org.apache.hadoop.hbase.util.TestMiniClusterLoadSequential
Running org.apache.hadoop.hbase.util.TestMergeTool
Running org.apache.hadoop.hbase.util.TestHBaseFsck
Running org.apache.hadoop.hbase.util.TestFSTableDescriptors
Running org.apache.hadoop.hbase.util.TestFSHDFSUtils
Tests run: 15, Failures: 0, Errors: 0, Skipped: 0, Time elapsed: 2.512 sec - in org.apache.hadoop.hbase.util.TestFSTableDescriptors
Running org.apache.hadoop.hbase.util.TestFSVisitor
Tests run: 3, Failures: 0, Errors: 0, Skipped: 0, Time elapsed: 5.634 sec - in org.apache.hadoop.hbase.util.TestFSHDFSUtils
Running org.apache.hadoop.hbase.util.TestFSUtils
Tests run: 3, Failures: 0, Errors: 0, Skipped: 0, Time elapsed: 4.047 sec - in org.apache.hadoop.hbase.util.TestFSVisitor
Running org.apache.hadoop.hbase.util.TestDefaultEnvironmentEdge
Tests run: 1, Failures: 0, Errors: 0, Skipped: 0, Time elapsed: 0.376 sec - in org.apache.hadoop.hbase.util.TestDefaultEnvironmentEdge
Running org.apache.hadoop.hbase.util.TestRegionSplitter
Tests run: 7, Failures: 0, Errors: 0, Skipped: 0, Time elapsed: 12.653 sec - in org.apache.hadoop.hbase.util.TestFSUtils
Tests run: 1, Failures: 0, Errors: 0, Skipped: 0, Time elapsed: 21.253 sec - in org.apache.hadoop.hbase.util.TestMergeTool
Running org.apache.hadoop.hbase.wal.TestWALFiltering
Tests run: 4, Failures: 0, Errors: 0, Skipped: 0, Time elapsed: 42.722 sec - in org.apache.hadoop.hbase.util.TestMiniClusterLoadParallel
Running org.apache.hadoop.hbase.wal.TestWALReaderOnSecureWAL
Tests run: 6, Failures: 0, Errors: 0, Skipped: 0, Time elapsed: 5.322 sec - in org.apache.hadoop.hbase.util.TestRegionSplitter
Tests run: 2, Failures: 0, Errors: 0, Skipped: 0, Time elapsed: 1.872 sec - in org.apache.hadoop.hbase.wal.TestWALReaderOnSecureWAL
Running org.apache.hadoop.hbase.wal.TestSecureWAL
Running org.apache.hadoop.hbase.wal.TestDefaultWALProviderWithHLogKey
Tests run: 1, Failures: 0, Errors: 0, Skipped: 0, Time elapsed: 1.721 sec - in org.apache.hadoop.hbase.wal.TestSecureWAL
Running org.apache.hadoop.hbase.wal.TestWALSplit
Running org.apache.hadoop.hbase.wal.TestWALSplitCompressed
Tests run: 5, Failures: 0, Errors: 0, Skipped: 0, Time elapsed: 7.392 sec - in org.apache.hadoop.hbase.wal.TestDefaultWALProviderWithHLogKey
Running org.apache.hadoop.hbase.wal.TestDefaultWALProvider
Tests run: 5, Failures: 0, Errors: 0, Skipped: 0, Time elapsed: 6.692 sec - in org.apache.hadoop.hbase.wal.TestDefaultWALProvider
Tests run: 1, Failures: 0, Errors: 0, Skipped: 0, Time elapsed: 25.699 sec - in org.apache.hadoop.hbase.wal.TestWALFiltering
Running org.apache.hadoop.hbase.wal.TestWALFactory
Running org.apache.hadoop.hbase.wal.TestBoundedRegionGroupingProvider
Tests run: 9, Failures: 0, Errors: 0, Skipped: 0, Time elapsed: 15.853 sec - in org.apache.hadoop.hbase.wal.TestWALFactory
Tests run: 5, Failures: 0, Errors: 0, Skipped: 0, Time elapsed: 19.806 sec - in org.apache.hadoop.hbase.wal.TestBoundedRegionGroupingProvider
Running org.apache.hadoop.hbase.constraint.TestConstraint
Running org.apache.hadoop.hbase.TestNamespace
Tests run: 5, Failures: 0, Errors: 0, Skipped: 0, Time elapsed: 6.477 sec - in org.apache.hadoop.hbase.constraint.TestConstraint
Tests run: 9, Failures: 0, Errors: 0, Skipped: 1, Time elapsed: 6.182 sec - in org.apache.hadoop.hbase.TestNamespace
Running org.apache.hadoop.hbase.TestInfoServers
Running org.apache.hadoop.hbase.TestMetaMigrationConvertingToPB
Tests run: 3, Failures: 0, Errors: 0, Skipped: 0, Time elapsed: 2.279 sec - in org.apache.hadoop.hbase.TestInfoServers
Tests run: 3, Failures: 0, Errors: 0, Skipped: 0, Time elapsed: 1.804 sec - in org.apache.hadoop.hbase.TestMetaMigrationConvertingToPB
Running org.apache.hadoop.hbase.TestRegionRebalancing
Running org.apache.hadoop.hbase.filter.TestMultiRowRangeFilter
Tests run: 18, Failures: 0, Errors: 0, Skipped: 0, Time elapsed: 10.077 sec - in org.apache.hadoop.hbase.filter.TestMultiRowRangeFilter
Tests run: 2, Failures: 0, Errors: 0, Skipped: 0, Time elapsed: 30.32 sec - in org.apache.hadoop.hbase.TestRegionRebalancing
Running org.apache.hadoop.hbase.filter.TestScanRowPrefix
Tests run: 1, Failures: 0, Errors: 0, Skipped: 0, Time elapsed: 2.093 sec - in org.apache.hadoop.hbase.filter.TestScanRowPrefix
Running org.apache.hadoop.hbase.filter.TestFilterWrapper
Tests run: 1, Failures: 0, Errors: 0, Skipped: 0, Time elapsed: 2.336 sec - in org.apache.hadoop.hbase.filter.TestFilterWrapper
Running org.apache.hadoop.hbase.filter.TestFuzzyRowAndColumnRangeFilter
Tests run: 1, Failures: 0, Errors: 0, Skipped: 0, Time elapsed: 2.29 sec - in org.apache.hadoop.hbase.filter.TestFuzzyRowAndColumnRangeFilter
Running org.apache.hadoop.hbase.filter.TestColumnRangeFilter
Running org.apache.hadoop.hbase.filter.TestFilterWithScanLimits
Tests run: 1, Failures: 0, Errors: 0, Skipped: 0, Time elapsed: 2.03 sec - in org.apache.hadoop.hbase.filter.TestFilterWithScanLimits
Tests run: 1, Failures: 0, Errors: 0, Skipped: 0, Time elapsed: 6.625 sec - in org.apache.hadoop.hbase.filter.TestColumnRangeFilter
Running org.apache.hadoop.hbase.io.TestFileLink
Running org.apache.hadoop.hbase.io.hfile.TestScannerSelectionUsingTTL
Tests run: 3, Failures: 0, Errors: 0, Skipped: 0, Time elapsed: 14.821 sec - in org.apache.hadoop.hbase.io.TestFileLink
Running org.apache.hadoop.hbase.io.hfile.TestCacheConfig
Tests run: 6, Failures: 0, Errors: 0, Skipped: 0, Time elapsed: 1.656 sec - in org.apache.hadoop.hbase.io.hfile.TestCacheConfig
Running org.apache.hadoop.hbase.io.hfile.TestHFileSeek
Tests run: 1, Failures: 0, Errors: 0, Skipped: 0, Time elapsed: 1.961 sec - in org.apache.hadoop.hbase.io.hfile.TestHFileSeek
Running org.apache.hadoop.hbase.io.hfile.TestForceCacheImportantBlocks
Tests run: 31, Failures: 0, Errors: 0, Skipped: 0, Time elapsed: 184.06 sec - in org.apache.hadoop.hbase.wal.TestWALSplit
Running org.apache.hadoop.hbase.io.hfile.TestCacheOnWrite
Tests run: 4, Failures: 0, Errors: 0, Skipped: 0, Time elapsed: 37.313 sec - in org.apache.hadoop.hbase.io.hfile.TestForceCacheImportantBlocks
Tests run: 31, Failures: 0, Errors: 0, Skipped: 0, Time elapsed: 191.014 sec - in org.apache.hadoop.hbase.wal.TestWALSplitCompressed
Running org.apache.hadoop.hbase.io.hfile.TestHFileBlock
Tests run: 6, Failures: 0, Errors: 0, Skipped: 0, Time elapsed: 62.828 sec - in org.apache.hadoop.hbase.io.hfile.TestScannerSelectionUsingTTL
Running org.apache.hadoop.hbase.io.hfile.TestHFileBlockIndex
Running org.apache.hadoop.hbase.io.encoding.TestLoadAndSwitchEncodeOnDisk
Tests run: 10, Failures: 0, Errors: 0, Skipped: 0, Time elapsed: 13.222 sec - in org.apache.hadoop.hbase.io.hfile.TestHFileBlockIndex
Running org.apache.hadoop.hbase.io.encoding.TestBufferedDataBlockEncoder
Tests run: 1, Failures: 0, Errors: 0, Skipped: 0, Time elapsed: 24.7 sec - in org.apache.hadoop.hbase.io.encoding.TestLoadAndSwitchEncodeOnDisk
Running org.apache.hadoop.hbase.io.encoding.TestEncodedSeekers
Tests run: 1, Failures: 0, Errors: 0, Skipped: 0, Time elapsed: 30.071 sec - in org.apache.hadoop.hbase.io.encoding.TestBufferedDataBlockEncoder
Tests run: 50, Failures: 0, Errors: 0, Skipped: 1, Time elapsed: 278.792 sec - in org.apache.hadoop.hbase.util.TestHBaseFsck
Running org.apache.hadoop.hbase.io.encoding.TestDataBlockEncoders
Running org.apache.hadoop.hbase.io.encoding.TestChangingEncoding
Tests run: 28, Failures: 0, Errors: 0, Skipped: 0, Time elapsed: 95.711 sec - in org.apache.hadoop.hbase.io.hfile.TestHFileBlock
Running org.apache.hadoop.hbase.TestClusterBootOrder
Tests run: 2, Failures: 0, Errors: 0, Skipped: 0, Time elapsed: 27.558 sec - in org.apache.hadoop.hbase.TestClusterBootOrder
Tests run: 20, Failures: 0, Errors: 0, Skipped: 0, Time elapsed: 107.166 sec - in org.apache.hadoop.hbase.io.encoding.TestEncodedSeekers
Tests run: 3, Failures: 0, Errors: 0, Skipped: 0, Time elapsed: 102.243 sec - in org.apache.hadoop.hbase.io.encoding.TestChangingEncoding
Tests run: 28, Failures: 0, Errors: 0, Skipped: 0, Time elapsed: 242.145 sec - in org.apache.hadoop.hbase.io.encoding.TestDataBlockEncoders
Tests run: 216, Failures: 0, Errors: 0, Skipped: 0, Time elapsed: 336.315 sec - in org.apache.hadoop.hbase.io.hfile.TestCacheOnWrite

Results :

Failed tests: 
  TestDistributedLogSplitting.testThreeRSAbort:1063 Timedout



Tests run: 2386, Failures: 1, Errors: 0, Skipped: 18

[INFO] ------------------------------------------------------------------------
[INFO] Reactor Summary:
[INFO] 
[INFO] HBase ............................................. SUCCESS [3.874s]
[INFO] HBase - Checkstyle ................................ SUCCESS [0.794s]
[INFO] HBase - Annotations ............................... SUCCESS [0.932s]
[INFO] HBase - Common .................................... SUCCESS [1:31.874s]
[INFO] HBase - Protocol .................................. SUCCESS [11.799s]
[INFO] HBase - Client .................................... SUCCESS [1:23.162s]
[INFO] HBase - Hadoop Compatibility ...................... SUCCESS [8.024s]
[INFO] HBase - Hadoop Two Compatibility .................. SUCCESS [7.829s]
[INFO] HBase - Prefix Tree ............................... SUCCESS [10.006s]
[INFO] HBase - Server .................................... FAILURE [1:09:29.317s]
[INFO] HBase - Testing Util .............................. SKIPPED
[INFO] HBase - Thrift .................................... SKIPPED
[INFO] HBase - Rest ...................................... SKIPPED
[INFO] HBase - Shell ..................................... SKIPPED
[INFO] HBase - Integration Tests ......................... SKIPPED
[INFO] HBase - Examples .................................. SKIPPED
[INFO] HBase - Assembly .................................. SKIPPED
[INFO] ------------------------------------------------------------------------
[INFO] BUILD FAILURE
[INFO] ------------------------------------------------------------------------
[INFO] Total time: 1:13:08.857s
[INFO] Finished at: Wed Feb 18 01:44:31 UTC 2015
[INFO] Final Memory: 46M/457M
[INFO] ------------------------------------------------------------------------
[ERROR] Failed to execute goal org.apache.maven.plugins:maven-surefire-plugin:2.18:test (secondPartTestsExecution)
on project hbase-server: ExecutionException: java.lang.RuntimeException: The forked VM terminated
without properly saying goodbye. VM crash or System.exit called?
[ERROR] Command was /bin/sh -c cd <https://builds.apache.org/job/HBase-1.1/ws/hbase-server>
&& /home/jenkins/tools/java/jdk1.7.0_25-32/jre/bin/java -enableassertions -XX:MaxDirectMemorySize=1G
-Xmx1900m -XX:MaxPermSize=256m -Djava.security.egd=file:/dev/./urandom -Djava.net.preferIPv4Stack=true
-Djava.awt.headless=true -jar <https://builds.apache.org/job/HBase-1.1/ws/hbase-server/target/surefire/surefirebooter1619705545170222800.jar>
<https://builds.apache.org/job/HBase-1.1/ws/hbase-server/target/surefire/surefire6060930529190584709tmp>
<https://builds.apache.org/job/HBase-1.1/ws/hbase-server/target/surefire/surefire_6639000025473129097875tmp>
[ERROR] -> [Help 1]
[ERROR] 
[ERROR] To see the full stack trace of the errors, re-run Maven with the -e switch.
[ERROR] Re-run Maven using the -X switch to enable full debug logging.
[ERROR] 
[ERROR] For more information about the errors and possible solutions, please read the following
articles:
[ERROR] [Help 1] http://cwiki.apache.org/confluence/display/MAVEN/MojoFailureException
[ERROR] 
[ERROR] After correcting the problems, you can resume the build with the command
[ERROR]   mvn <goals> -rf :hbase-server
Build step 'Invoke top-level Maven targets' marked build as failure
Performing Post build task...
Match found for :.* : True
Logical operation result is TRUE
Running script  :   ZOMBIE_TESTS_COUNT=`jps | grep surefirebooter | wc -l`
  if [[ $ZOMBIE_TESTS_COUNT != 0 ]] ; then
    #It seems sometimes the tests are not dying immediately. Let's give them 10s
    echo "Suspicious java process found - waiting 10s to see if there are just slow to stop"
    sleep 10   
    ZOMBIE_TESTS_COUNT=`jps | grep surefirebooter | wc -l`
    if [[ $ZOMBIE_TESTS_COUNT != 0 ]] ; then
      echo "There are $ZOMBIE_TESTS_COUNT zombie tests, they should have been killed by surefire
but survived"
      echo "************ BEGIN zombies jstack extract"
      ZB_STACK=`jps | grep surefirebooter | cut -d ' ' -f 1 | xargs -n 1 jstack | grep ".test"
| grep "\.java"`
      jps | grep surefirebooter | cut -d ' ' -f 1 | xargs -n 1 jstack
      echo "************ END  zombies jstack extract"
      JIRA_COMMENT="$JIRA_COMMENT

     {color:red}-1 core zombie tests{color}.  There are ${ZOMBIE_TESTS_COUNT} zombie test(s):
${ZB_STACK}"
      BAD=1
      jps | grep surefirebooter | cut -d ' ' -f 1 | xargs kill -9
    else
      echo "We're ok: there is no zombie test, but some tests took some time to stop"
    fi
  else
    echo "We're ok: there is no zombie test"
  fi
[HBase-1.1] $ /bin/bash -xe /tmp/hudson9096513094571641319.sh
++ jps
++ grep surefirebooter
++ wc -l
+ ZOMBIE_TESTS_COUNT=0
+ [[ 0 != 0 ]]
+ echo 'We'\''re ok: there is no zombie test'
We're ok: there is no zombie test
POST BUILD TASK : SUCCESS
END OF POST BUILD TASK : 0
Archiving artifacts
Sending artifact delta relative to HBase-1.1 #163
Archived 1875 artifacts
Archive block size is 32768
Received 27 blocks and 939525932 bytes
Compression is 0.1%
Took 3 min 55 sec
Recording test results
Updating HBASE-13059

Mime
View raw message