hbase-builds mailing list archives

Site index · List index
Message view « Date » · « Thread »
Top « Date » · « Thread »
From Apache Jenkins Server <jenk...@builds.apache.org>
Subject Build failed in Jenkins: HBase-0.98 #860
Date Wed, 18 Feb 2015 18:28:41 GMT
See <https://builds.apache.org/job/HBase-0.98/860/changes>

Changes:

[apurtell] HBASE-12102 Duplicate keys in HBase.RegionServer metrics JSON (Ravi Kishore Valeti)

[stack] HBASE-13065 Increasing -Xmx when running TestDistributedLogSplitting (Zhang Duo)

------------------------------------------
[...truncated 183 lines...]
[INFO] --- jacoco-maven-plugin:0.6.2.201302030002:prepare-agent (prepare-agent) @ hbase-common
---
[INFO] Skipping JaCoCo execution
[INFO] argLine set to 
[INFO] 
[INFO] --- maven-antrun-plugin:1.6:run (generate) @ hbase-common ---
[INFO] Executing tasks

main:
     [exec] ~/jenkins-slave/workspace/HBase-0.98/hbase-common ~/jenkins-slave/workspace/HBase-0.98/hbase-common
     [exec] ~/jenkins-slave/workspace/HBase-0.98/hbase-common
[INFO] Executed tasks
[INFO] 
[INFO] --- build-helper-maven-plugin:1.5:add-source (versionInfo-source) @ hbase-common ---
[INFO] Source directory: <https://builds.apache.org/job/HBase-0.98/ws/hbase-common/target/generated-sources/java>
added.
[INFO] 
[INFO] --- maven-remote-resources-plugin:1.4:process (default) @ hbase-common ---
[INFO] 
[INFO] --- maven-resources-plugin:2.6:resources (default-resources) @ hbase-common ---
[INFO] Using 'UTF-8' encoding to copy filtered resources.
[INFO] Copying 1 resource
[INFO] Copying 3 resources
[INFO] 
[INFO] --- maven-antrun-plugin:1.6:run (default) @ hbase-common ---
[INFO] Executing tasks

main:
    [mkdir] Created dir: <https://builds.apache.org/job/HBase-0.98/ws/hbase-common/target/nativelib>
     [exec] tar: hadoop-snappy-nativelibs.tar: Cannot open: No such file or directory
     [exec] tar: Error is not recoverable: exiting now
     [exec] Result: 2
[INFO] Executed tasks
[INFO] 
[INFO] --- maven-compiler-plugin:2.5.1:compile (default-compile) @ hbase-common ---
[INFO] Compiling 163 source files to <https://builds.apache.org/job/HBase-0.98/ws/hbase-common/target/classes>
[WARNING] <https://builds.apache.org/job/HBase-0.98/ws/hbase-common/src/main/java/org/apache/hadoop/hbase/io/encoding/DataBlockEncoding.java>:[45,64]
Unsafe is internal proprietary API and may be removed in a future release
[WARNING] <https://builds.apache.org/job/HBase-0.98/ws/hbase-common/src/main/java/org/apache/hadoop/hbase/util/Bytes.java>:[1279,19]
Unsafe is internal proprietary API and may be removed in a future release
[WARNING] <https://builds.apache.org/job/HBase-0.98/ws/hbase-common/src/main/java/org/apache/hadoop/hbase/util/Bytes.java>:[1285,21]
Unsafe is internal proprietary API and may be removed in a future release
[WARNING] <https://builds.apache.org/job/HBase-0.98/ws/hbase-common/src/main/java/org/apache/hadoop/hbase/util/Bytes.java>:[1290,28]
Unsafe is internal proprietary API and may be removed in a future release
[INFO] 
[INFO] --- maven-dependency-plugin:2.1:build-classpath (create-mrapp-generated-classpath)
@ hbase-common ---
[INFO] Wrote classpath file '<https://builds.apache.org/job/HBase-0.98/ws/hbase-common/target/test-classes/mrapp-generated-classpath'.>
[INFO] 
[INFO] --- maven-resources-plugin:2.6:testResources (default-testResources) @ hbase-common
---
[INFO] Using 'UTF-8' encoding to copy filtered resources.
[INFO] Copying 1 resource
[INFO] Copying 3 resources
[INFO] 
[INFO] --- maven-compiler-plugin:2.5.1:testCompile (default-testCompile) @ hbase-common ---
[INFO] Compiling 49 source files to <https://builds.apache.org/job/HBase-0.98/ws/hbase-common/target/test-classes>
[INFO] 
[INFO] --- maven-surefire-plugin:2.18:test (default-test) @ hbase-common ---
[INFO] Surefire report directory: <https://builds.apache.org/job/HBase-0.98/ws/hbase-common/target/surefire-reports>
[INFO] Using configured provider org.apache.maven.surefire.junitcore.JUnitCoreProvider
[INFO] parallel='none', perCoreThreadCount=true, threadCount=0, useUnlimitedThreads=false,
threadCountSuites=0, threadCountClasses=0, threadCountMethods=0, parallelOptimized=true

-------------------------------------------------------
 T E S T S
-------------------------------------------------------
Error occurred during initialization of VM
Too small initial heap
Error occurred during initialization of VM
Too small initial heap
Error occurred during initialization of VM
Too small initial heap
Error occurred during initialization of VM
Too small initial heap
Error occurred during initialization of VM
Too small initial heap
Error occurred during initialization of VM
Too small initial heap
Error occurred during initialization of VM
Too small initial heap
Error occurred during initialization of VM
Too small initial heap
Error occurred during initialization of VM
Too small initial heap
Error occurred during initialization of VM
Too small initial heap
Error occurred during initialization of VM
Too small initial heap
Error occurred during initialization of VM
Too small initial heap
Error occurred during initialization of VM
Too small initial heap
Error occurred during initialization of VM
Too small initial heap
Error occurred during initialization of VM
Too small initial heap
Error occurred during initialization of VM
Too small initial heap
Error occurred during initialization of VM
Too small initial heap
Error occurred during initialization of VM
Too small initial heap
Error occurred during initialization of VM
Too small initial heap
Error occurred during initialization of VM
Too small initial heap
Error occurred during initialization of VM
Too small initial heap
Error occurred during initialization of VM
Too small initial heap
Error occurred during initialization of VM
Too small initial heap
Error occurred during initialization of VM
Too small initial heap
Error occurred during initialization of VM
Too small initial heap
Error occurred during initialization of VM
Too small initial heap
Error occurred during initialization of VM
Too small initial heap
Error occurred during initialization of VM
Too small initial heap
Error occurred during initialization of VM
Too small initial heap
Error occurred during initialization of VM
Too small initial heap
Error occurred during initialization of VM
Too small initial heap
Error occurred during initialization of VM
Too small initial heap
Error occurred during initialization of VM
Too small initial heap
Error occurred during initialization of VM
Too small initial heap
Error occurred during initialization of VM
Too small initial heap
Error occurred during initialization of VM
Too small initial heap
Error occurred during initialization of VM
Too small initial heap
Error occurred during initialization of VM
Too small initial heap
Error occurred during initialization of VM
Too small initial heap
Error occurred during initialization of VM
Too small initial heap

Results :




Tests run: 0, Failures: 0, Errors: 0, Skipped: 0

[INFO] ------------------------------------------------------------------------
[INFO] Reactor Summary:
[INFO] 
[INFO] HBase ............................................. SUCCESS [3.048s]
[INFO] HBase - Checkstyle ................................ SUCCESS [0.632s]
[INFO] HBase - Annotations ............................... SUCCESS [0.827s]
[INFO] HBase - Common .................................... FAILURE [7.859s]
[INFO] HBase - Protocol .................................. SKIPPED
[INFO] HBase - Client .................................... SKIPPED
[INFO] HBase - Hadoop Compatibility ...................... SKIPPED
[INFO] HBase - Hadoop Two Compatibility .................. SKIPPED
[INFO] HBase - Prefix Tree ............................... SKIPPED
[INFO] HBase - Server .................................... SKIPPED
[INFO] HBase - Testing Util .............................. SKIPPED
[INFO] HBase - Thrift .................................... SKIPPED
[INFO] HBase - Rest ...................................... SKIPPED
[INFO] HBase - Shell ..................................... SKIPPED
[INFO] HBase - Integration Tests ......................... SKIPPED
[INFO] HBase - Examples .................................. SKIPPED
[INFO] HBase - Assembly .................................. SKIPPED
[INFO] ------------------------------------------------------------------------
[INFO] BUILD FAILURE
[INFO] ------------------------------------------------------------------------
[INFO] Total time: 13.192s
[INFO] Finished at: Wed Feb 18 18:27:39 UTC 2015
[INFO] Final Memory: 42M/408M
[INFO] ------------------------------------------------------------------------
[ERROR] Failed to execute goal org.apache.maven.plugins:maven-surefire-plugin:2.18:test (default-test)
on project hbase-common: ExecutionException: java.lang.RuntimeException: The forked VM terminated
without properly saying goodbye. VM crash or System.exit called?
[ERROR] Command was /bin/sh -c cd <https://builds.apache.org/job/HBase-0.98/ws/hbase-common>
&& /home/jenkins/tools/java/jdk1.7.0_25-32/jre/bin/java -enableassertions -XX:MaxDirectMemorySize=1G
-Xmx2800 -XX:MaxPermSize=256m -Djava.security.egd=file:/dev/./urandom -Djava.net.preferIPv4Stack=true
-Djava.awt.headless=true -jar <https://builds.apache.org/job/HBase-0.98/ws/hbase-common/target/surefire/surefirebooter282644164161785030.jar>
<https://builds.apache.org/job/HBase-0.98/ws/hbase-common/target/surefire/surefire3920428755303596085tmp>
<https://builds.apache.org/job/HBase-0.98/ws/hbase-common/target/surefire/surefire_05718298157955613238tmp>
[ERROR] -> [Help 1]
[ERROR] 
[ERROR] To see the full stack trace of the errors, re-run Maven with the -e switch.
[ERROR] Re-run Maven using the -X switch to enable full debug logging.
[ERROR] 
[ERROR] For more information about the errors and possible solutions, please read the following
articles:
[ERROR] [Help 1] http://cwiki.apache.org/confluence/display/MAVEN/MojoFailureException
[ERROR] 
[ERROR] After correcting the problems, you can resume the build with the command
[ERROR]   mvn <goals> -rf :hbase-common
Build step 'Invoke top-level Maven targets' marked build as failure
Performing Post build task...
Match found for :.* : True
Logical operation result is TRUE
Running script  :   ZOMBIE_TESTS_COUNT=`jps | grep surefirebooter | wc -l`
  if [[ $ZOMBIE_TESTS_COUNT != 0 ]] ; then
    #It seems sometimes the tests are not dying immediately. Let's give them 10s
    echo "Suspicious java process found - waiting 10s to see if there are just slow to stop"
    sleep 10   
    ZOMBIE_TESTS_COUNT=`jps | grep surefirebooter | wc -l`
    if [[ $ZOMBIE_TESTS_COUNT != 0 ]] ; then
      echo "There are $ZOMBIE_TESTS_COUNT zombie tests, they should have been killed by surefire
but survived"
      echo "************ BEGIN zombies jstack extract"
      ZB_STACK=`jps | grep surefirebooter | cut -d ' ' -f 1 | xargs -n 1 jstack | grep ".test"
| grep "\.java"`
      jps | grep surefirebooter | cut -d ' ' -f 1 | xargs -n 1 jstack
      echo "************ END  zombies jstack extract"
      JIRA_COMMENT="$JIRA_COMMENT

     {color:red}-1 core zombie tests{color}.  There are ${ZOMBIE_TESTS_COUNT} zombie test(s):
${ZB_STACK}"
      BAD=1
      jps | grep surefirebooter | cut -d ' ' -f 1 | xargs kill -9
    else
      echo "We're ok: there is no zombie test, but some tests took some time to stop"
    fi
  else
    echo "We're ok: there is no zombie test"
  fi
[HBase-0.98] $ /bin/bash -xe /tmp/hudson6445728775337131228.sh
++ jps
++ grep surefirebooter
++ wc -l
+ ZOMBIE_TESTS_COUNT=1
+ [[ 1 != 0 ]]
+ echo 'Suspicious java process found - waiting 10s to see if there are just slow to stop'
Suspicious java process found - waiting 10s to see if there are just slow to stop
+ sleep 10
++ jps
++ grep surefirebooter
++ wc -l
+ ZOMBIE_TESTS_COUNT=1
+ [[ 1 != 0 ]]
+ echo 'There are 1 zombie tests, they should have been killed by surefire but survived'
There are 1 zombie tests, they should have been killed by surefire but survived
+ echo '************ BEGIN zombies jstack extract'
************ BEGIN zombies jstack extract
++ jps
++ grep surefirebooter
++ grep '\.java'
++ xargs -n 1 jstack
++ grep .test
++ cut -d ' ' -f 1
+ ZB_STACK=
POST BUILD TASK : FAILURE
END OF POST BUILD TASK : 0
Archiving artifacts
Sending artifact delta relative to HBase-0.98 #859
Archived 8 artifacts
Archive block size is 32768
Received 5 blocks and 31998 bytes
Compression is 83.7%
Took 49 sec
Recording test results
Updating HBASE-12102
Updating HBASE-13065

Mime
View raw message