hbase-builds mailing list archives

Site index · List index
Message view « Date » · « Thread »
Top « Date » · « Thread »
From Apache Jenkins Server <jenk...@builds.apache.org>
Subject Build failed in Jenkins: HBase-0.98-on-Hadoop-1.1 #809
Date Fri, 13 Feb 2015 19:20:41 GMT
See <https://builds.apache.org/job/HBase-0.98-on-Hadoop-1.1/809/changes>

Changes:

[matteo.bertozzi] HBASE-13037 LoadIncrementalHFile should try to verify the content of unmatched
families

------------------------------------------
[...truncated 443 lines...]
Tests run: 5, Failures: 0, Errors: 0, Skipped: 1, Time elapsed: 0.818 sec - in org.apache.hadoop.hbase.client.TestClientNoCluster
Running org.apache.hadoop.hbase.client.TestDelayingRunner
Tests run: 1, Failures: 0, Errors: 0, Skipped: 0, Time elapsed: 1.019 sec - in org.apache.hadoop.hbase.client.TestDelayingRunner
Running org.apache.hadoop.hbase.client.TestAttributes
Tests run: 7, Failures: 0, Errors: 0, Skipped: 0, Time elapsed: 0.136 sec - in org.apache.hadoop.hbase.client.TestAttributes
Running org.apache.hadoop.hbase.client.TestPutDotHas
Tests run: 4, Failures: 0, Errors: 0, Skipped: 0, Time elapsed: 0.024 sec - in org.apache.hadoop.hbase.client.TestPutDotHas
Running org.apache.hadoop.hbase.client.TestAsyncProcess
Tests run: 19, Failures: 0, Errors: 0, Skipped: 0, Time elapsed: 30.191 sec - in org.apache.hadoop.hbase.client.TestAsyncProcess
Running org.apache.hadoop.hbase.client.TestClientExponentialBackoff
Tests run: 4, Failures: 0, Errors: 0, Skipped: 0, Time elapsed: 0.035 sec - in org.apache.hadoop.hbase.client.TestClientExponentialBackoff
Running org.apache.hadoop.hbase.client.TestSnapshotFromAdmin
Tests run: 2, Failures: 0, Errors: 0, Skipped: 0, Time elapsed: 4.24 sec - in org.apache.hadoop.hbase.client.TestSnapshotFromAdmin
Running org.apache.hadoop.hbase.client.TestGet
Tests run: 4, Failures: 0, Errors: 0, Skipped: 0, Time elapsed: 0.641 sec - in org.apache.hadoop.hbase.client.TestGet
Running org.apache.hadoop.hbase.client.TestScan
Tests run: 4, Failures: 0, Errors: 0, Skipped: 0, Time elapsed: 0.575 sec - in org.apache.hadoop.hbase.client.TestScan
Running org.apache.hadoop.hbase.security.TestEncryptionUtil
Tests run: 1, Failures: 0, Errors: 0, Skipped: 0, Time elapsed: 0.716 sec - in org.apache.hadoop.hbase.security.TestEncryptionUtil
Running org.apache.hadoop.hbase.ipc.TestPayloadCarryingRpcController
Tests run: 1, Failures: 0, Errors: 0, Skipped: 0, Time elapsed: 0.113 sec - in org.apache.hadoop.hbase.ipc.TestPayloadCarryingRpcController
Running org.apache.hadoop.hbase.ipc.TestIPCUtil
Tests run: 1, Failures: 0, Errors: 0, Skipped: 0, Time elapsed: 0.151 sec - in org.apache.hadoop.hbase.ipc.TestIPCUtil
Running org.apache.hadoop.hbase.filter.TestLongComparator
Tests run: 1, Failures: 0, Errors: 0, Skipped: 0, Time elapsed: 0.115 sec - in org.apache.hadoop.hbase.filter.TestLongComparator

Results :




Tests run: 57, Failures: 0, Errors: 0, Skipped: 1

[INFO] 
[INFO] --- maven-surefire-plugin:2.18:test (secondPartTestsExecution) @ hbase-client ---
[INFO] Tests are skipped.
[INFO] 
[INFO] --- jacoco-maven-plugin:0.6.2.201302030002:report (report) @ hbase-client ---
[INFO] Skipping JaCoCo execution
[INFO] 
[INFO] --- maven-source-plugin:2.2.1:jar-no-fork (attach-sources) @ hbase-client ---
[INFO] Building jar: <https://builds.apache.org/job/HBase-0.98-on-Hadoop-1.1/ws/hbase-client/target/hbase-client-0.98.11-SNAPSHOT-sources.jar>
[INFO] 
[INFO] --- maven-jar-plugin:2.4:test-jar (default) @ hbase-client ---
[INFO] Building jar: <https://builds.apache.org/job/HBase-0.98-on-Hadoop-1.1/ws/hbase-client/target/hbase-client-0.98.11-SNAPSHOT-tests.jar>
[INFO] 
[INFO] --- maven-jar-plugin:2.4:jar (default-jar) @ hbase-client ---
[INFO] Building jar: <https://builds.apache.org/job/HBase-0.98-on-Hadoop-1.1/ws/hbase-client/target/hbase-client-0.98.11-SNAPSHOT.jar>
[INFO] 
[INFO] --- maven-install-plugin:2.3.1:install (default-install) @ hbase-client ---
[INFO] Installing <https://builds.apache.org/job/HBase-0.98-on-Hadoop-1.1/ws/hbase-client/target/hbase-client-0.98.11-SNAPSHOT.jar>
to /home/jenkins/.m2/repository/org/apache/hbase/hbase-client/0.98.11-SNAPSHOT/hbase-client-0.98.11-SNAPSHOT.jar
[INFO] Installing <https://builds.apache.org/job/HBase-0.98-on-Hadoop-1.1/ws/hbase-client/pom.xml>
to /home/jenkins/.m2/repository/org/apache/hbase/hbase-client/0.98.11-SNAPSHOT/hbase-client-0.98.11-SNAPSHOT.pom
[INFO] Installing <https://builds.apache.org/job/HBase-0.98-on-Hadoop-1.1/ws/hbase-client/target/hbase-client-0.98.11-SNAPSHOT-sources.jar>
to /home/jenkins/.m2/repository/org/apache/hbase/hbase-client/0.98.11-SNAPSHOT/hbase-client-0.98.11-SNAPSHOT-sources.jar
[INFO] Installing <https://builds.apache.org/job/HBase-0.98-on-Hadoop-1.1/ws/hbase-client/target/hbase-client-0.98.11-SNAPSHOT-tests.jar>
to /home/jenkins/.m2/repository/org/apache/hbase/hbase-client/0.98.11-SNAPSHOT/hbase-client-0.98.11-SNAPSHOT-tests.jar
[INFO]                                                                         
[INFO] ------------------------------------------------------------------------
[INFO] Building HBase - Hadoop Compatibility 0.98.11-SNAPSHOT
[INFO] ------------------------------------------------------------------------
[INFO] 
[INFO] --- maven-enforcer-plugin:1.0.1:enforce (enforce) @ hbase-hadoop-compat ---
[INFO] 
[INFO] --- jacoco-maven-plugin:0.6.2.201302030002:prepare-agent (prepare-agent) @ hbase-hadoop-compat
---
[INFO] Skipping JaCoCo execution
[INFO] argLine set to 
[INFO] 
[INFO] --- maven-remote-resources-plugin:1.4:process (default) @ hbase-hadoop-compat ---
[INFO] 
[INFO] --- maven-resources-plugin:2.6:resources (default-resources) @ hbase-hadoop-compat
---
[INFO] Using 'UTF-8' encoding to copy filtered resources.
[INFO] skip non existing resourceDirectory <https://builds.apache.org/job/HBase-0.98-on-Hadoop-1.1/ws/hbase-hadoop-compat/src/main/resources>
[INFO] Copying 3 resources
[INFO] 
[INFO] --- maven-compiler-plugin:2.5.1:compile (default-compile) @ hbase-hadoop-compat ---
[INFO] Compiling 31 source files to <https://builds.apache.org/job/HBase-0.98-on-Hadoop-1.1/ws/hbase-hadoop-compat/target/classes>
[INFO] 
[INFO] --- maven-resources-plugin:2.6:testResources (default-testResources) @ hbase-hadoop-compat
---
[INFO] Using 'UTF-8' encoding to copy filtered resources.
[INFO] Copying 1 resource
[INFO] Copying 3 resources
[INFO] 
[INFO] --- maven-compiler-plugin:2.5.1:testCompile (default-testCompile) @ hbase-hadoop-compat
---
[INFO] Compiling 11 source files to <https://builds.apache.org/job/HBase-0.98-on-Hadoop-1.1/ws/hbase-hadoop-compat/target/test-classes>
[INFO] 
[INFO] --- maven-surefire-plugin:2.18:test (default-test) @ hbase-hadoop-compat ---
[INFO] Surefire report directory: <https://builds.apache.org/job/HBase-0.98-on-Hadoop-1.1/ws/hbase-hadoop-compat/target/surefire-reports>
[INFO] Using configured provider org.apache.maven.surefire.junitcore.JUnitCoreProvider
[INFO] parallel='none', perCoreThreadCount=true, threadCount=0, useUnlimitedThreads=false,
threadCountSuites=0, threadCountClasses=0, threadCountMethods=0, parallelOptimized=true

-------------------------------------------------------
 T E S T S
-------------------------------------------------------
Running org.apache.hadoop.hbase.thrift.TestMetricsThriftServerSourceFactory
Tests run: 1, Failures: 0, Errors: 0, Skipped: 0, Time elapsed: 0.039 sec - in org.apache.hadoop.hbase.thrift.TestMetricsThriftServerSourceFactory
Running org.apache.hadoop.hbase.regionserver.wal.TestMetricsHLogSource
Tests run: 1, Failures: 0, Errors: 0, Skipped: 0, Time elapsed: 0.04 sec - in org.apache.hadoop.hbase.regionserver.wal.TestMetricsHLogSource
Running org.apache.hadoop.hbase.regionserver.TestMetricsRegionServerSourceFactory
Tests run: 1, Failures: 0, Errors: 0, Skipped: 0, Time elapsed: 0.04 sec - in org.apache.hadoop.hbase.regionserver.TestMetricsRegionServerSourceFactory
Running org.apache.hadoop.hbase.master.TestMetricsMasterSourceFactory
Tests run: 1, Failures: 0, Errors: 0, Skipped: 0, Time elapsed: 0.039 sec - in org.apache.hadoop.hbase.master.TestMetricsMasterSourceFactory
Running org.apache.hadoop.hbase.TestCompatibilitySingletonFactory
Tests run: 1, Failures: 0, Errors: 0, Skipped: 0, Time elapsed: 4.753 sec - in org.apache.hadoop.hbase.TestCompatibilitySingletonFactory
Running org.apache.hadoop.hbase.rest.TestMetricsRESTSource
Tests run: 1, Failures: 0, Errors: 0, Skipped: 0, Time elapsed: 0.041 sec - in org.apache.hadoop.hbase.rest.TestMetricsRESTSource
Running org.apache.hadoop.hbase.replication.regionserver.TestMetricsReplicationSourceFactory
Tests run: 1, Failures: 0, Errors: 0, Skipped: 0, Time elapsed: 0.04 sec - in org.apache.hadoop.hbase.replication.regionserver.TestMetricsReplicationSourceFactory

Results :




Tests run: 7, Failures: 0, Errors: 0, Skipped: 0

[INFO] 
[INFO] --- maven-surefire-plugin:2.18:test (secondPartTestsExecution) @ hbase-hadoop-compat
---
[INFO] Tests are skipped.
[INFO] 
[INFO] --- jacoco-maven-plugin:0.6.2.201302030002:report (report) @ hbase-hadoop-compat ---
[INFO] Skipping JaCoCo execution
[INFO] 
[INFO] --- maven-source-plugin:2.2.1:jar-no-fork (attach-sources) @ hbase-hadoop-compat ---
[INFO] Building jar: <https://builds.apache.org/job/HBase-0.98-on-Hadoop-1.1/ws/hbase-hadoop-compat/target/hbase-hadoop-compat-0.98.11-SNAPSHOT-sources.jar>
[INFO] 
[INFO] --- maven-jar-plugin:2.4:test-jar (default) @ hbase-hadoop-compat ---
[INFO] Building jar: <https://builds.apache.org/job/HBase-0.98-on-Hadoop-1.1/ws/hbase-hadoop-compat/target/hbase-hadoop-compat-0.98.11-SNAPSHOT-tests.jar>
[INFO] 
[INFO] --- maven-jar-plugin:2.4:jar (default-jar) @ hbase-hadoop-compat ---
[INFO] Building jar: <https://builds.apache.org/job/HBase-0.98-on-Hadoop-1.1/ws/hbase-hadoop-compat/target/hbase-hadoop-compat-0.98.11-SNAPSHOT.jar>
[INFO] 
[INFO] --- maven-install-plugin:2.3.1:install (default-install) @ hbase-hadoop-compat ---
[INFO] Installing <https://builds.apache.org/job/HBase-0.98-on-Hadoop-1.1/ws/hbase-hadoop-compat/target/hbase-hadoop-compat-0.98.11-SNAPSHOT.jar>
to /home/jenkins/.m2/repository/org/apache/hbase/hbase-hadoop-compat/0.98.11-SNAPSHOT/hbase-hadoop-compat-0.98.11-SNAPSHOT.jar
[INFO] Installing <https://builds.apache.org/job/HBase-0.98-on-Hadoop-1.1/ws/hbase-hadoop-compat/pom.xml>
to /home/jenkins/.m2/repository/org/apache/hbase/hbase-hadoop-compat/0.98.11-SNAPSHOT/hbase-hadoop-compat-0.98.11-SNAPSHOT.pom
[INFO] Installing <https://builds.apache.org/job/HBase-0.98-on-Hadoop-1.1/ws/hbase-hadoop-compat/target/hbase-hadoop-compat-0.98.11-SNAPSHOT-sources.jar>
to /home/jenkins/.m2/repository/org/apache/hbase/hbase-hadoop-compat/0.98.11-SNAPSHOT/hbase-hadoop-compat-0.98.11-SNAPSHOT-sources.jar
[INFO] Installing <https://builds.apache.org/job/HBase-0.98-on-Hadoop-1.1/ws/hbase-hadoop-compat/target/hbase-hadoop-compat-0.98.11-SNAPSHOT-tests.jar>
to /home/jenkins/.m2/repository/org/apache/hbase/hbase-hadoop-compat/0.98.11-SNAPSHOT/hbase-hadoop-compat-0.98.11-SNAPSHOT-tests.jar
[INFO]                                                                         
[INFO] ------------------------------------------------------------------------
[INFO] Building HBase - Hadoop One Compatibility 0.98.11-SNAPSHOT
[INFO] ------------------------------------------------------------------------
[INFO] 
[INFO] --- maven-enforcer-plugin:1.0.1:enforce (enforce) @ hbase-hadoop1-compat ---
[INFO] 
[INFO] --- jacoco-maven-plugin:0.6.2.201302030002:prepare-agent (prepare-agent) @ hbase-hadoop1-compat
---
[INFO] Skipping JaCoCo execution
[INFO] argLine set to 
[INFO] 
[INFO] --- maven-remote-resources-plugin:1.4:process (default) @ hbase-hadoop1-compat ---
[INFO] 
[INFO] --- maven-resources-plugin:2.6:resources (default-resources) @ hbase-hadoop1-compat
---
[INFO] Using 'UTF-8' encoding to copy filtered resources.
[INFO] Copying 15 resources
[INFO] Copying 3 resources
[INFO] 
[INFO] --- maven-compiler-plugin:2.5.1:compile (default-compile) @ hbase-hadoop1-compat ---
[INFO] Compiling 32 source files to <https://builds.apache.org/job/HBase-0.98-on-Hadoop-1.1/ws/hbase-hadoop1-compat/target/classes>
[INFO] -------------------------------------------------------------
[ERROR] COMPILATION ERROR : 
[INFO] -------------------------------------------------------------
[ERROR] <https://builds.apache.org/job/HBase-0.98-on-Hadoop-1.1/ws/hbase-hadoop1-compat/src/main/java/org/apache/hadoop/hbase/replication/regionserver/MetricsReplicationGlobalSourceSource.java>:[24,7]
error: MetricsReplicationGlobalSourceSource is not abstract and does not override abstract
method getLastShippedAge() in MetricsReplicationSourceSource
[ERROR] <https://builds.apache.org/job/HBase-0.98-on-Hadoop-1.1/ws/hbase-hadoop1-compat/src/main/java/org/apache/hadoop/hbase/replication/regionserver/MetricsReplicationSourceSourceImpl.java>:[24,7]
error: MetricsReplicationSourceSourceImpl is not abstract and does not override abstract method
getLastShippedAge() in MetricsReplicationSourceSource
[ERROR] <https://builds.apache.org/job/HBase-0.98-on-Hadoop-1.1/ws/hbase-hadoop1-compat/src/main/java/org/apache/hadoop/hbase/replication/regionserver/MetricsReplicationSinkSourceImpl.java>:[24,7]
error: MetricsReplicationSinkSourceImpl is not abstract and does not override abstract method
getLastAppliedOpAge() in MetricsReplicationSinkSource
[INFO] 3 errors 
[INFO] -------------------------------------------------------------
[INFO] ------------------------------------------------------------------------
[INFO] Reactor Summary:
[INFO] 
[INFO] HBase ............................................. SUCCESS [4.569s]
[INFO] HBase - Checkstyle ................................ SUCCESS [0.875s]
[INFO] HBase - Annotations ............................... SUCCESS [0.860s]
[INFO] HBase - Common .................................... SUCCESS [42.355s]
[INFO] HBase - Protocol .................................. SUCCESS [9.271s]
[INFO] HBase - Client .................................... SUCCESS [48.122s]
[INFO] HBase - Hadoop Compatibility ...................... SUCCESS [7.149s]
[INFO] HBase - Hadoop One Compatibility .................. FAILURE [0.646s]
[INFO] HBase - Prefix Tree ............................... SKIPPED
[INFO] HBase - Server .................................... SKIPPED
[INFO] HBase - Testing Util .............................. SKIPPED
[INFO] HBase - Thrift .................................... SKIPPED
[INFO] HBase - Rest ...................................... SKIPPED
[INFO] HBase - Shell ..................................... SKIPPED
[INFO] HBase - Integration Tests ......................... SKIPPED
[INFO] HBase - Examples .................................. SKIPPED
[INFO] HBase - Assembly .................................. SKIPPED
[INFO] ------------------------------------------------------------------------
[INFO] BUILD FAILURE
[INFO] ------------------------------------------------------------------------
[INFO] Total time: 1:54.612s
[INFO] Finished at: Fri Feb 13 19:20:16 UTC 2015
[INFO] Final Memory: 55M/697M
[INFO] ------------------------------------------------------------------------
[ERROR] Failed to execute goal org.apache.maven.plugins:maven-compiler-plugin:2.5.1:compile
(default-compile) on project hbase-hadoop1-compat: Compilation failure: Compilation failure:
[ERROR] <https://builds.apache.org/job/HBase-0.98-on-Hadoop-1.1/ws/hbase-hadoop1-compat/src/main/java/org/apache/hadoop/hbase/replication/regionserver/MetricsReplicationGlobalSourceSource.java>:[24,7]
error: MetricsReplicationGlobalSourceSource is not abstract and does not override abstract
method getLastShippedAge() in MetricsReplicationSourceSource
[ERROR] <https://builds.apache.org/job/HBase-0.98-on-Hadoop-1.1/ws/hbase-hadoop1-compat/src/main/java/org/apache/hadoop/hbase/replication/regionserver/MetricsReplicationSourceSourceImpl.java>:[24,7]
error: MetricsReplicationSourceSourceImpl is not abstract and does not override abstract method
getLastShippedAge() in MetricsReplicationSourceSource
[ERROR] <https://builds.apache.org/job/HBase-0.98-on-Hadoop-1.1/ws/hbase-hadoop1-compat/src/main/java/org/apache/hadoop/hbase/replication/regionserver/MetricsReplicationSinkSourceImpl.java>:[24,7]
error: MetricsReplicationSinkSourceImpl is not abstract and does not override abstract method
getLastAppliedOpAge() in MetricsReplicationSinkSource
[ERROR] -> [Help 1]
[ERROR] 
[ERROR] To see the full stack trace of the errors, re-run Maven with the -e switch.
[ERROR] Re-run Maven using the -X switch to enable full debug logging.
[ERROR] 
[ERROR] For more information about the errors and possible solutions, please read the following
articles:
[ERROR] [Help 1] http://cwiki.apache.org/confluence/display/MAVEN/MojoFailureException
[ERROR] 
[ERROR] After correcting the problems, you can resume the build with the command
[ERROR]   mvn <goals> -rf :hbase-hadoop1-compat
Build step 'Invoke top-level Maven targets' marked build as failure
Performing Post build task...
Match found for :.* : True
Logical operation result is TRUE
Running script  :   ZOMBIE_TESTS_COUNT=`jps | grep surefirebooter | wc -l`
  if [[ $ZOMBIE_TESTS_COUNT != 0 ]] ; then
    #It seems sometimes the tests are not dying immediately. Let's give them 10s
    echo "Suspicious java process found - waiting 10s to see if there are just slow to stop"
    sleep 10
    ZOMBIE_TESTS_COUNT=`jps | grep surefirebooter | wc -l`
    if [[ $ZOMBIE_TESTS_COUNT != 0 ]] ; then
      echo "There are $ZOMBIE_TESTS_COUNT zombie tests, they should have been killed by surefire
but survived"
      echo "************ BEGIN zombies jstack extract"
      ZB_STACK=`jps | grep surefirebooter | cut -d ' ' -f 1 | xargs -n 1 jstack | grep ".test"
| grep "\.java"`
      jps | grep surefirebooter | cut -d ' ' -f 1 | xargs -n 1 jstack
      echo "************ END  zombies jstack extract"
      JIRA_COMMENT="$JIRA_COMMENT

     {color:red}-1 core zombie tests{color}.  There are ${ZOMBIE_TESTS_COUNT} zombie test(s):
${ZB_STACK}"
      BAD=1
      jps | grep surefirebooter | cut -d ' ' -f 1 | xargs kill -9
    else
      echo "We're ok: there is no zombie test, but some tests took some time to stop"
    fi
  else
    echo "We're ok: there is no zombie test"
  fi
[HBase-0.98-on-Hadoop-1.1] $ /bin/bash -xe /tmp/hudson7575232264245170384.sh
++ jps
++ grep surefirebooter
++ wc -l
+ ZOMBIE_TESTS_COUNT=0
+ [[ 0 != 0 ]]
+ echo 'We'\''re ok: there is no zombie test'
We're ok: there is no zombie test
POST BUILD TASK : SUCCESS
END OF POST BUILD TASK : 0
Archiving artifacts
Sending artifact delta relative to HBase-0.98-on-Hadoop-1.1 #797
Archived 179 artifacts
Archive block size is 32768
Received 5 blocks and 616874 bytes
Compression is 21.0%
Took 20 sec
Recording test results
Updating HBASE-13037

Mime
View raw message