hbase-builds mailing list archives

Site index · List index
Message view « Date » · « Thread »
Top « Date » · « Thread »
From Apache Jenkins Server <jenk...@builds.apache.org>
Subject Build failed in Jenkins: HBase-TRUNK #6115
Date Wed, 11 Feb 2015 05:59:52 GMT
See <https://builds.apache.org/job/HBase-TRUNK/6115/changes>

Changes:

[apurtell] HBASE-13009: HBase REST UI inaccessible

[ramkrishna] HBASE-13003 - Get tests in TestHFileBlockIndex back (Zhangduo)

[stack] HBASE-13007 Fix the test timeouts being caused by ChoreService (Jonathan Lawlor)

------------------------------------------
[...truncated 269 lines...]
     [exec] tar: Error is not recoverable: exiting now
     [exec] Result: 2
[INFO] Executed tasks
[INFO] 
[INFO] --- maven-compiler-plugin:3.2:compile (default-compile) @ hbase-common ---
[INFO] Compiling 183 source files to <https://builds.apache.org/job/HBase-TRUNK/ws/hbase-common/target/classes>
[WARNING] <https://builds.apache.org/job/HBase-TRUNK/ws/hbase-common/src/main/java/org/apache/hadoop/hbase/util/Bytes.java>:[54,16]
sun.misc.Unsafe is internal proprietary API and may be removed in a future release
[WARNING] <https://builds.apache.org/job/HBase-TRUNK/ws/hbase-common/src/main/java/org/apache/hadoop/hbase/util/Bytes.java>:[1488,20]
sun.misc.Unsafe is internal proprietary API and may be removed in a future release
[WARNING] <https://builds.apache.org/job/HBase-TRUNK/ws/hbase-common/src/main/java/org/apache/hadoop/hbase/util/Bytes.java>:[1494,22]
sun.misc.Unsafe is internal proprietary API and may be removed in a future release
[WARNING] <https://builds.apache.org/job/HBase-TRUNK/ws/hbase-common/src/main/java/org/apache/hadoop/hbase/util/Bytes.java>:[1499,29]
sun.misc.Unsafe is internal proprietary API and may be removed in a future release
[WARNING] <https://builds.apache.org/job/HBase-TRUNK/ws/hbase-common/src/main/java/org/apache/hadoop/hbase/util/OrderedBytes.java>:[607,7]
[EmptyStatement] Empty statement
    (see http://code.google.com/p/error-prone/wiki/EmptyStatement)
  Did you mean to remove this line?
[WARNING] <https://builds.apache.org/job/HBase-TRUNK/ws/hbase-common/src/main/java/org/apache/hadoop/hbase/util/OrderedBytes.java>:[987,7]
[EmptyStatement] Empty statement
    (see http://code.google.com/p/error-prone/wiki/EmptyStatement)
  Did you mean to remove this line?
[WARNING] <https://builds.apache.org/job/HBase-TRUNK/ws/hbase-common/src/main/java/org/apache/hadoop/hbase/util/OrderedBytes.java>:[1103,7]
[EmptyStatement] Empty statement
    (see http://code.google.com/p/error-prone/wiki/EmptyStatement)
  Did you mean to remove this line?
[WARNING] <https://builds.apache.org/job/HBase-TRUNK/ws/hbase-common/src/main/java/org/apache/hadoop/hbase/util/OrderedBytes.java>:[1737,7]
[EmptyStatement] Empty statement
    (see http://code.google.com/p/error-prone/wiki/EmptyStatement)
  Did you mean to remove this line?
[INFO] <https://builds.apache.org/job/HBase-TRUNK/ws/hbase-common/src/main/java/org/apache/hadoop/hbase/KeyValue.java>:[-1,-1]
Some input files use or override a deprecated API.
[INFO] <https://builds.apache.org/job/HBase-TRUNK/ws/hbase-common/src/main/java/org/apache/hadoop/hbase/KeyValue.java>:[-1,-1]
Recompile with -Xlint:deprecation for details.
[INFO] <https://builds.apache.org/job/HBase-TRUNK/ws/hbase-common/src/main/java/org/apache/hadoop/hbase/CompoundConfiguration.java>:[-1,-1]
<https://builds.apache.org/job/HBase-TRUNK/ws/hbase-common/src/main/java/org/apache/hadoop/hbase/CompoundConfiguration.java>
uses unchecked or unsafe operations.
[INFO] <https://builds.apache.org/job/HBase-TRUNK/ws/hbase-common/src/main/java/org/apache/hadoop/hbase/CompoundConfiguration.java>:[-1,-1]
Recompile with -Xlint:unchecked for details.
[INFO] 
[INFO] --- maven-dependency-plugin:2.1:build-classpath (create-mrapp-generated-classpath)
@ hbase-common ---
[INFO] Wrote classpath file '<https://builds.apache.org/job/HBase-TRUNK/ws/hbase-common/target/test-classes/mrapp-generated-classpath'.>
[INFO] 
[INFO] --- maven-resources-plugin:2.6:testResources (default-testResources) @ hbase-common
---
[INFO] Using 'UTF-8' encoding to copy filtered resources.
[INFO] Copying 1 resource
[INFO] Copying 3 resources
[INFO] 
[INFO] --- maven-compiler-plugin:3.2:testCompile (default-testCompile) @ hbase-common ---
[INFO] Compiling 55 source files to <https://builds.apache.org/job/HBase-TRUNK/ws/hbase-common/target/test-classes>
[WARNING] <https://builds.apache.org/job/HBase-TRUNK/ws/hbase-common/src/test/java/org/apache/hadoop/hbase/io/crypto/KeyProviderForTesting.java>:[40,76]
[EmptyStatement] Empty statement
    (see http://code.google.com/p/error-prone/wiki/EmptyStatement)
  Did you mean 'result[i] = new SecretKeySpec(Encryption.hash128(aliases[i]), "AES");'?
[INFO] <https://builds.apache.org/job/HBase-TRUNK/ws/hbase-common/src/test/java/org/apache/hadoop/hbase/TestCellUtil.java>:[-1,-1]
Some input files use or override a deprecated API.
[INFO] <https://builds.apache.org/job/HBase-TRUNK/ws/hbase-common/src/test/java/org/apache/hadoop/hbase/TestCellUtil.java>:[-1,-1]
Recompile with -Xlint:deprecation for details.
[INFO] <https://builds.apache.org/job/HBase-TRUNK/ws/hbase-common/src/test/java/org/apache/hadoop/hbase/util/TestKeyLocker.java>:[-1,-1]
<https://builds.apache.org/job/HBase-TRUNK/ws/hbase-common/src/test/java/org/apache/hadoop/hbase/util/TestKeyLocker.java>
uses unchecked or unsafe operations.
[INFO] <https://builds.apache.org/job/HBase-TRUNK/ws/hbase-common/src/test/java/org/apache/hadoop/hbase/util/TestKeyLocker.java>:[-1,-1]
Recompile with -Xlint:unchecked for details.
[INFO] 
[INFO] --- maven-surefire-plugin:2.18:test (default-test) @ hbase-common ---
[INFO] Surefire report directory: <https://builds.apache.org/job/HBase-TRUNK/ws/hbase-common/target/surefire-reports>
[INFO] Using configured provider org.apache.maven.surefire.junitcore.JUnitCoreProvider
[INFO] parallel='none', perCoreThreadCount=true, threadCount=0, useUnlimitedThreads=false,
threadCountSuites=0, threadCountClasses=0, threadCountMethods=0, parallelOptimized=true

-------------------------------------------------------
 T E S T S
-------------------------------------------------------
Running org.apache.hadoop.hbase.TestCellUtil
Tests run: 5, Failures: 0, Errors: 0, Skipped: 0, Time elapsed: 0.35 sec - in org.apache.hadoop.hbase.TestCellUtil
Running org.apache.hadoop.hbase.io.crypto.TestEncryption
Tests run: 4, Failures: 0, Errors: 0, Skipped: 0, Time elapsed: 1.961 sec - in org.apache.hadoop.hbase.io.crypto.TestEncryption
Running org.apache.hadoop.hbase.io.crypto.aes.TestAES
Tests run: 2, Failures: 0, Errors: 0, Skipped: 0, Time elapsed: 0.832 sec - in org.apache.hadoop.hbase.io.crypto.aes.TestAES
Running org.apache.hadoop.hbase.io.crypto.TestKeyProvider
Tests run: 1, Failures: 0, Errors: 0, Skipped: 0, Time elapsed: 0.373 sec - in org.apache.hadoop.hbase.io.crypto.TestKeyProvider
Running org.apache.hadoop.hbase.io.crypto.TestKeyStoreKeyProvider
Tests run: 2, Failures: 0, Errors: 0, Skipped: 0, Time elapsed: 0.085 sec - in org.apache.hadoop.hbase.io.crypto.TestKeyStoreKeyProvider
Running org.apache.hadoop.hbase.io.crypto.TestCipherProvider
Tests run: 2, Failures: 0, Errors: 0, Skipped: 0, Time elapsed: 0.703 sec - in org.apache.hadoop.hbase.io.crypto.TestCipherProvider
Running org.apache.hadoop.hbase.io.util.TestLRUDictionary
Tests run: 5, Failures: 0, Errors: 0, Skipped: 0, Time elapsed: 0.471 sec - in org.apache.hadoop.hbase.io.util.TestLRUDictionary
Running org.apache.hadoop.hbase.io.TestTagCompressionContext
Tests run: 2, Failures: 0, Errors: 0, Skipped: 0, Time elapsed: 0.102 sec - in org.apache.hadoop.hbase.io.TestTagCompressionContext
Running org.apache.hadoop.hbase.io.TestByteBufferInputStream
Tests run: 1, Failures: 0, Errors: 0, Skipped: 0, Time elapsed: 0.151 sec - in org.apache.hadoop.hbase.io.TestByteBufferInputStream
Running org.apache.hadoop.hbase.codec.TestCellCodecWithTags
Tests run: 1, Failures: 0, Errors: 0, Skipped: 0, Time elapsed: 0.199 sec - in org.apache.hadoop.hbase.codec.TestCellCodecWithTags
Running org.apache.hadoop.hbase.codec.TestKeyValueCodecWithTags
Tests run: 1, Failures: 0, Errors: 0, Skipped: 0, Time elapsed: 0.185 sec - in org.apache.hadoop.hbase.codec.TestKeyValueCodecWithTags
Running org.apache.hadoop.hbase.codec.TestCellCodec
Tests run: 3, Failures: 0, Errors: 0, Skipped: 0, Time elapsed: 0.25 sec - in org.apache.hadoop.hbase.codec.TestCellCodec
Running org.apache.hadoop.hbase.codec.TestKeyValueCodec
Tests run: 3, Failures: 0, Errors: 0, Skipped: 0, Time elapsed: 0.247 sec - in org.apache.hadoop.hbase.codec.TestKeyValueCodec
Running org.apache.hadoop.hbase.TestChoreService
Tests run: 18, Failures: 0, Errors: 1, Skipped: 0, Time elapsed: 37.85 sec <<< FAILURE!
- in org.apache.hadoop.hbase.TestChoreService
testCorePoolDecrease(org.apache.hadoop.hbase.TestChoreService)  Time elapsed: 20.025 sec 
<<< ERROR!
java.lang.Exception: test timed out after 20000 milliseconds
	at org.apache.hadoop.hbase.ScheduledChore.cancel(ScheduledChore.java:251)
	at org.apache.hadoop.hbase.TestChoreService.testCorePoolDecrease(TestChoreService.java:483)

Running org.apache.hadoop.hbase.util.TestSimplePositionedMutableByteRange
Tests run: 3, Failures: 0, Errors: 0, Skipped: 0, Time elapsed: 0.215 sec - in org.apache.hadoop.hbase.util.TestSimplePositionedMutableByteRange
Running org.apache.hadoop.hbase.util.TestFastLongHistogram
Tests run: 3, Failures: 0, Errors: 0, Skipped: 0, Time elapsed: 0.221 sec - in org.apache.hadoop.hbase.util.TestFastLongHistogram
Running org.apache.hadoop.hbase.util.TestLoadTestKVGenerator
Tests run: 3, Failures: 0, Errors: 0, Skipped: 0, Time elapsed: 0.751 sec - in org.apache.hadoop.hbase.util.TestLoadTestKVGenerator
Running org.apache.hadoop.hbase.util.TestConcatenatedLists
Tests run: 6, Failures: 0, Errors: 0, Skipped: 0, Time elapsed: 0.277 sec - in org.apache.hadoop.hbase.util.TestConcatenatedLists
Running org.apache.hadoop.hbase.util.TestBytes
Tests run: 28, Failures: 0, Errors: 0, Skipped: 0, Time elapsed: 2.233 sec - in org.apache.hadoop.hbase.util.TestBytes
Running org.apache.hadoop.hbase.util.TestBase64
Tests run: 1, Failures: 0, Errors: 0, Skipped: 0, Time elapsed: 0.144 sec - in org.apache.hadoop.hbase.util.TestBase64
Running org.apache.hadoop.hbase.util.TestDynamicClassLoader
Tests run: 2, Failures: 0, Errors: 0, Skipped: 0, Time elapsed: 1.441 sec - in org.apache.hadoop.hbase.util.TestDynamicClassLoader
Running org.apache.hadoop.hbase.util.TestSimpleMutableByteRange
Tests run: 3, Failures: 0, Errors: 0, Skipped: 0, Time elapsed: 0.217 sec - in org.apache.hadoop.hbase.util.TestSimpleMutableByteRange
Running org.apache.hadoop.hbase.util.TestByteRangeWithKVSerialization
Tests run: 1, Failures: 0, Errors: 0, Skipped: 0, Time elapsed: 2.539 sec - in org.apache.hadoop.hbase.util.TestByteRangeWithKVSerialization
Running org.apache.hadoop.hbase.util.TestOrderedBytes
Tests run: 19, Failures: 0, Errors: 0, Skipped: 0, Time elapsed: 0.777 sec - in org.apache.hadoop.hbase.util.TestOrderedBytes
Running org.apache.hadoop.hbase.util.TestThreads
Tests run: 1, Failures: 0, Errors: 0, Skipped: 0, Time elapsed: 3.051 sec - in org.apache.hadoop.hbase.util.TestThreads
Running org.apache.hadoop.hbase.util.TestCounter
Tests run: 2, Failures: 0, Errors: 0, Skipped: 0, Time elapsed: 5.532 sec - in org.apache.hadoop.hbase.util.TestCounter
Running org.apache.hadoop.hbase.util.TestShowProperties
Tests run: 1, Failures: 0, Errors: 0, Skipped: 0, Time elapsed: 0.075 sec - in org.apache.hadoop.hbase.util.TestShowProperties
Running org.apache.hadoop.hbase.util.TestDrainBarrier
Tests run: 6, Failures: 0, Errors: 0, Skipped: 0, Time elapsed: 1.282 sec - in org.apache.hadoop.hbase.util.TestDrainBarrier
Running org.apache.hadoop.hbase.util.TestEnvironmentEdgeManager
Tests run: 2, Failures: 0, Errors: 0, Skipped: 0, Time elapsed: 0.358 sec - in org.apache.hadoop.hbase.util.TestEnvironmentEdgeManager
Running org.apache.hadoop.hbase.util.TestCoprocessorClassLoader
Tests run: 3, Failures: 0, Errors: 0, Skipped: 0, Time elapsed: 1.425 sec - in org.apache.hadoop.hbase.util.TestCoprocessorClassLoader
Running org.apache.hadoop.hbase.util.TestOrder
Tests run: 2, Failures: 0, Errors: 0, Skipped: 0, Time elapsed: 0.084 sec - in org.apache.hadoop.hbase.util.TestOrder
Running org.apache.hadoop.hbase.util.TestKeyLocker
Tests run: 1, Failures: 0, Errors: 0, Skipped: 0, Time elapsed: 0.14 sec - in org.apache.hadoop.hbase.util.TestKeyLocker
Running org.apache.hadoop.hbase.TestHBaseConfiguration
Tests run: 2, Failures: 0, Errors: 0, Skipped: 0, Time elapsed: 0.44 sec - in org.apache.hadoop.hbase.TestHBaseConfiguration
Running org.apache.hadoop.hbase.TestClassFinder
Tests run: 11, Failures: 0, Errors: 0, Skipped: 0, Time elapsed: 3.762 sec - in org.apache.hadoop.hbase.TestClassFinder
Running org.apache.hadoop.hbase.TestCompoundConfiguration
Tests run: 6, Failures: 0, Errors: 0, Skipped: 0, Time elapsed: 0.602 sec - in org.apache.hadoop.hbase.TestCompoundConfiguration
Running org.apache.hadoop.hbase.TestKeyValue
Tests run: 17, Failures: 0, Errors: 0, Skipped: 0, Time elapsed: 0.533 sec - in org.apache.hadoop.hbase.TestKeyValue
Running org.apache.hadoop.hbase.TestCellComparator
Tests run: 2, Failures: 0, Errors: 0, Skipped: 0, Time elapsed: 0.105 sec - in org.apache.hadoop.hbase.TestCellComparator
Running org.apache.hadoop.hbase.types.TestFixedLengthWrapper
Tests run: 4, Failures: 0, Errors: 0, Skipped: 0, Time elapsed: 0.163 sec - in org.apache.hadoop.hbase.types.TestFixedLengthWrapper
Running org.apache.hadoop.hbase.types.TestUnion2
Tests run: 2, Failures: 0, Errors: 0, Skipped: 0, Time elapsed: 0.194 sec - in org.apache.hadoop.hbase.types.TestUnion2
Running org.apache.hadoop.hbase.types.TestStructNullExtension
Tests run: 2, Failures: 0, Errors: 0, Skipped: 0, Time elapsed: 0.208 sec - in org.apache.hadoop.hbase.types.TestStructNullExtension
Running org.apache.hadoop.hbase.types.TestOrderedBlobVar
Tests run: 1, Failures: 0, Errors: 0, Skipped: 0, Time elapsed: 0.058 sec - in org.apache.hadoop.hbase.types.TestOrderedBlobVar
Running org.apache.hadoop.hbase.types.TestRawString
Tests run: 1, Failures: 0, Errors: 0, Skipped: 0, Time elapsed: 0.155 sec - in org.apache.hadoop.hbase.types.TestRawString
Running org.apache.hadoop.hbase.types.TestStruct
Tests run: 2, Failures: 0, Errors: 0, Skipped: 0, Time elapsed: 0.095 sec - in org.apache.hadoop.hbase.types.TestStruct
Running org.apache.hadoop.hbase.types.TestTerminatedWrapper
Tests run: 8, Failures: 0, Errors: 0, Skipped: 0, Time elapsed: 0.259 sec - in org.apache.hadoop.hbase.types.TestTerminatedWrapper
Running org.apache.hadoop.hbase.types.TestOrderedString
Tests run: 1, Failures: 0, Errors: 0, Skipped: 0, Time elapsed: 0.141 sec - in org.apache.hadoop.hbase.types.TestOrderedString
Running org.apache.hadoop.hbase.types.TestOrderedBlob
Tests run: 1, Failures: 0, Errors: 0, Skipped: 0, Time elapsed: 0.053 sec - in org.apache.hadoop.hbase.types.TestOrderedBlob

Results :


Tests in error: 
  TestChoreService.testCorePoolDecrease:483 ยป  test timed out after 20000 millis...


Tests run: 197, Failures: 0, Errors: 1, Skipped: 0

[INFO] ------------------------------------------------------------------------
[INFO] Reactor Summary:
[INFO] 
[INFO] HBase ............................................. SUCCESS [3.338s]
[INFO] HBase - Checkstyle ................................ SUCCESS [0.651s]
[INFO] HBase - Annotations ............................... SUCCESS [0.788s]
[INFO] HBase - Protocol .................................. SUCCESS [12.773s]
[INFO] HBase - Common .................................... FAILURE [1:36.902s]
[INFO] HBase - Client .................................... SKIPPED
[INFO] HBase - Hadoop Compatibility ...................... SKIPPED
[INFO] HBase - Hadoop Two Compatibility .................. SKIPPED
[INFO] HBase - Prefix Tree ............................... SKIPPED
[INFO] HBase - Server .................................... SKIPPED
[INFO] HBase - Testing Util .............................. SKIPPED
[INFO] HBase - Thrift .................................... SKIPPED
[INFO] HBase - Shell ..................................... SKIPPED
[INFO] HBase - Integration Tests ......................... SKIPPED
[INFO] HBase - Examples .................................. SKIPPED
[INFO] HBase - Rest ...................................... SKIPPED
[INFO] HBase - Assembly .................................. SKIPPED
[INFO] ------------------------------------------------------------------------
[INFO] BUILD FAILURE
[INFO] ------------------------------------------------------------------------
[INFO] Total time: 1:55.287s
[INFO] Finished at: Wed Feb 11 05:59:33 UTC 2015
[INFO] Final Memory: 54M/682M
[INFO] ------------------------------------------------------------------------
[ERROR] Failed to execute goal org.apache.maven.plugins:maven-surefire-plugin:2.18:test (default-test)
on project hbase-common: There are test failures.
[ERROR] 
[ERROR] Please refer to <https://builds.apache.org/job/HBase-TRUNK/ws/hbase-common/target/surefire-reports>
for the individual test results.
[ERROR] -> [Help 1]
[ERROR] 
[ERROR] To see the full stack trace of the errors, re-run Maven with the -e switch.
[ERROR] Re-run Maven using the -X switch to enable full debug logging.
[ERROR] 
[ERROR] For more information about the errors and possible solutions, please read the following
articles:
[ERROR] [Help 1] http://cwiki.apache.org/confluence/display/MAVEN/MojoFailureException
[ERROR] 
[ERROR] After correcting the problems, you can resume the build with the command
[ERROR]   mvn <goals> -rf :hbase-common
Build step 'Invoke top-level Maven targets' marked build as failure
[FINDBUGS] Skipping publisher since build result is FAILURE
Performing Post build task...
Match found for :.* : True
Logical operation result is TRUE
Running script  :   ZOMBIE_TESTS_COUNT=`jps | grep surefirebooter | wc -l`
  if [[ $ZOMBIE_TESTS_COUNT != 0 ]] ; then
    #It seems sometimes the tests are not dying immediately. Let's give them 10s
    echo "Suspicious java process found - waiting 10s to see if there are just slow to stop"
    sleep 10   
    ZOMBIE_TESTS_COUNT=`jps | grep surefirebooter | wc -l`
    if [[ $ZOMBIE_TESTS_COUNT != 0 ]] ; then
      echo "There are $ZOMBIE_TESTS_COUNT zombie tests, they should have been killed by surefire
but survived"
      echo "************ BEGIN zombies jstack extract"
      ZB_STACK=`jps | grep surefirebooter | cut -d ' ' -f 1 | xargs -n 1 jstack | grep ".test"
| grep "\.java"`
      jps | grep surefirebooter | cut -d ' ' -f 1 | xargs -n 1 jstack
      echo "************ END  zombies jstack extract"
      JIRA_COMMENT="$JIRA_COMMENT

     {color:red}-1 core zombie tests{color}.  There are ${ZOMBIE_TESTS_COUNT} zombie test(s):
${ZB_STACK}"
      BAD=1
      jps | grep surefirebooter | cut -d ' ' -f 1 | xargs kill -9
    else
      echo "We're ok: there is no zombie test, but some tests took some time to stop"
    fi
  else
    echo "We're ok: there is no zombie test"
  fi
[HBase-TRUNK] $ /bin/bash -xe /tmp/hudson8551820061440183666.sh
++ jps
++ grep surefirebooter
++ wc -l
+ ZOMBIE_TESTS_COUNT=0
+ [[ 0 != 0 ]]
+ echo 'We'\''re ok: there is no zombie test'
We're ok: there is no zombie test
POST BUILD TASK : SUCCESS
END OF POST BUILD TASK : 0
Archiving artifacts
Sending artifact delta relative to HBase-TRUNK #6110
Archived 152 artifacts
Archive block size is 32768
Received 7 blocks and 693988 bytes
Compression is 24.8%
Took 13 sec
Recording test results
Updating HBASE-13003
Updating HBASE-13009
Updating HBASE-13007

Mime
View raw message