hbase-builds mailing list archives

Site index · List index
Message view « Date » · « Thread »
Top « Date » · « Thread »
From Stack <st...@duboce.net>
Subject Re: Build failed in Jenkins: HBase-1.0 #700
Date Sat, 31 Jan 2015 05:03:07 GMT
Tried this locally a few times and it passes for me.
St.Ack

On Fri, Jan 30, 2015 at 8:51 PM, Apache Jenkins Server <
jenkins@builds.apache.org> wrote:

> See <https://builds.apache.org/job/HBase-1.0/700/changes>
>
> Changes:
>
> [stack] HBASE-12782 ITBLL fails for me if generator does anything but 5M
> per maptask
>
> ------------------------------------------
> [...truncated 1819 lines...]
> Running org.apache.hadoop.hbase.security.access.TestTablePermissions
> Running org.apache.hadoop.hbase.security.access.TestNamespaceCommands
> Tests run: 7, Failures: 0, Errors: 0, Skipped: 0, Time elapsed: 11.629 sec
> - in org.apache.hadoop.hbase.security.access.TestNamespaceCommands
> Running org.apache.hadoop.hbase.security.access.TestScanEarlyTermination
> Tests run: 8, Failures: 0, Errors: 0, Skipped: 0, Time elapsed: 28.595 sec
> - in org.apache.hadoop.hbase.security.access.TestCellACLWithMultipleVersions
> Tests run: 1, Failures: 0, Errors: 0, Skipped: 0, Time elapsed: 4.209 sec
> - in org.apache.hadoop.hbase.security.access.TestScanEarlyTermination
> Running org.apache.hadoop.hbase.security.access.TestAccessController2
> Tests run: 7, Failures: 0, Errors: 0, Skipped: 0, Time elapsed: 32.329 sec
> - in org.apache.hadoop.hbase.security.access.TestTablePermissions
> Running org.apache.hadoop.hbase.security.token.TestTokenAuthentication
> Tests run: 3, Failures: 0, Errors: 0, Skipped: 0, Time elapsed: 0.487 sec
> - in org.apache.hadoop.hbase.security.token.TestTokenAuthentication
> Running org.apache.hadoop.hbase.security.access.TestZKPermissionsWatcher
> Running org.apache.hadoop.hbase.security.token.TestZKSecretWatcher
> Tests run: 1, Failures: 0, Errors: 0, Skipped: 0, Time elapsed: 3.126 sec
> - in org.apache.hadoop.hbase.security.access.TestZKPermissionsWatcher
> Tests run: 2, Failures: 0, Errors: 0, Skipped: 0, Time elapsed: 9.625 sec
> - in org.apache.hadoop.hbase.security.access.TestAccessController2
> Running
> org.apache.hadoop.hbase.security.visibility.TestDefaultScanLabelGeneratorStack
> Running
> org.apache.hadoop.hbase.security.visibility.TestVisibilityLabelsWithSLGStack
> Tests run: 1, Failures: 0, Errors: 0, Skipped: 0, Time elapsed: 13.231 sec
> - in org.apache.hadoop.hbase.security.token.TestZKSecretWatcher
> Tests run: 1, Failures: 0, Errors: 0, Skipped: 0, Time elapsed: 2.288 sec
> - in
> org.apache.hadoop.hbase.security.visibility.TestDefaultScanLabelGeneratorStack
> Running
> org.apache.hadoop.hbase.security.visibility.TestVisibilityLabelReplicationWithExpAsString
> Tests run: 1, Failures: 0, Errors: 0, Skipped: 0, Time elapsed: 2.828 sec
> - in
> org.apache.hadoop.hbase.security.visibility.TestVisibilityLabelsWithSLGStack
> Running
> org.apache.hadoop.hbase.security.visibility.TestEnforcingScanLabelGenerator
> Tests run: 1, Failures: 0, Errors: 0, Skipped: 0, Time elapsed: 2.699 sec
> - in
> org.apache.hadoop.hbase.security.visibility.TestEnforcingScanLabelGenerator
> Running
> org.apache.hadoop.hbase.security.visibility.TestVisibilityLabelsWithDeletes
> Tests run: 1, Failures: 0, Errors: 0, Skipped: 0, Time elapsed: 17.748 sec
> - in
> org.apache.hadoop.hbase.security.visibility.TestVisibilityLabelReplicationWithExpAsString
> Running
> org.apache.hadoop.hbase.security.visibility.TestVisibilityLabelsReplication
> Running
> org.apache.hadoop.hbase.security.visibility.TestVisibilityLabelsOpWithDifferentUsersNoACL
> Tests run: 1, Failures: 0, Errors: 0, Skipped: 0, Time elapsed: 2.657 sec
> - in
> org.apache.hadoop.hbase.security.visibility.TestVisibilityLabelsOpWithDifferentUsersNoACL
> Running
> org.apache.hadoop.hbase.security.visibility.TestVisibilityLabelsWithDistributedLogReplay
> Tests run: 1, Failures: 0, Errors: 0, Skipped: 0, Time elapsed: 17.726 sec
> - in
> org.apache.hadoop.hbase.security.visibility.TestVisibilityLabelsReplication
> Running
> org.apache.hadoop.hbase.security.visibility.TestVisibilityLabelsWithCustomVisLabService
> Tests run: 37, Failures: 0, Errors: 0, Skipped: 0, Time elapsed: 50.197
> sec - in
> org.apache.hadoop.hbase.security.visibility.TestVisibilityLabelsWithDeletes
> Tests run: 19, Failures: 0, Errors: 0, Skipped: 0, Time elapsed: 15.572
> sec - in
> org.apache.hadoop.hbase.security.visibility.TestVisibilityLabelsWithCustomVisLabService
> Running
> org.apache.hadoop.hbase.security.visibility.TestVisibilityLabelsWithDefaultVisLabelService
> Tests run: 6, Failures: 0, Errors: 0, Skipped: 0, Time elapsed: 266.9 sec
> - in org.apache.hadoop.hbase.mapred.TestTableSnapshotInputFormat
> Running
> org.apache.hadoop.hbase.security.visibility.TestVisibilityLablesWithGroups
> Tests run: 1, Failures: 0, Errors: 0, Skipped: 0, Time elapsed: 2.057 sec
> - in
> org.apache.hadoop.hbase.security.visibility.TestVisibilityLablesWithGroups
> Running
> org.apache.hadoop.hbase.security.visibility.TestVisibilityLabelsWithACL
> Running
> org.apache.hadoop.hbase.security.visibility.TestVisibilityWithCheckAuths
> Tests run: 23, Failures: 0, Errors: 0, Skipped: 0, Time elapsed: 17.31 sec
> - in
> org.apache.hadoop.hbase.security.visibility.TestVisibilityLabelsWithDefaultVisLabelService
> Tests run: 2, Failures: 0, Errors: 0, Skipped: 0, Time elapsed: 3.415 sec
> - in
> org.apache.hadoop.hbase.security.visibility.TestVisibilityWithCheckAuths
> Running
> org.apache.hadoop.hbase.zookeeper.lock.TestZKInterProcessReadWriteLock
> Tests run: 5, Failures: 0, Errors: 0, Skipped: 0, Time elapsed: 7.451 sec
> - in org.apache.hadoop.hbase.security.visibility.TestVisibilityLabelsWithACL
> Running org.apache.hadoop.hbase.zookeeper.TestHQuorumPeer
> Tests run: 3, Failures: 0, Errors: 0, Skipped: 0, Time elapsed: 1.55 sec -
> in org.apache.hadoop.hbase.zookeeper.TestHQuorumPeer
> Running org.apache.hadoop.hbase.zookeeper.TestZooKeeperNodeTracker
> Tests run: 3, Failures: 0, Errors: 0, Skipped: 0, Time elapsed: 0.834 sec
> - in org.apache.hadoop.hbase.zookeeper.TestZooKeeperNodeTracker
> Running org.apache.hadoop.hbase.zookeeper.TestZKTableStateManager
> Running org.apache.hadoop.hbase.zookeeper.TestZooKeeperACL
> Tests run: 6, Failures: 0, Errors: 0, Skipped: 0, Time elapsed: 0.267 sec
> - in org.apache.hadoop.hbase.zookeeper.TestZooKeeperACL
> Tests run: 1, Failures: 0, Errors: 0, Skipped: 0, Time elapsed: 0.694 sec
> - in org.apache.hadoop.hbase.zookeeper.TestZKTableStateManager
> Running org.apache.hadoop.hbase.zookeeper.TestRecoverableZooKeeper
> Running org.apache.hadoop.hbase.zookeeper.TestZKLeaderManager
> Tests run: 1, Failures: 0, Errors: 0, Skipped: 0, Time elapsed: 0.122 sec
> - in org.apache.hadoop.hbase.zookeeper.TestZKLeaderManager
> Tests run: 1, Failures: 0, Errors: 0, Skipped: 0, Time elapsed: 1.232 sec
> - in org.apache.hadoop.hbase.zookeeper.TestRecoverableZooKeeper
> Running org.apache.hadoop.hbase.zookeeper.TestZKMulti
> Tests run: 6, Failures: 0, Errors: 0, Skipped: 0, Time elapsed: 0.308 sec
> - in org.apache.hadoop.hbase.zookeeper.TestZKMulti
> Running org.apache.hadoop.hbase.TestDrainingServer
> Running org.apache.hadoop.hbase.TestRegionRebalancing
> Tests run: 2, Failures: 0, Errors: 0, Skipped: 0, Time elapsed: 1.484 sec
> - in org.apache.hadoop.hbase.TestDrainingServer
> Running org.apache.hadoop.hbase.TestAcidGuarantees
> Tests run: 6, Failures: 0, Errors: 0, Skipped: 0, Time elapsed: 24.438 sec
> - in org.apache.hadoop.hbase.zookeeper.lock.TestZKInterProcessReadWriteLock
> Running org.apache.hadoop.hbase.migration.TestNamespaceUpgrade
> Tests run: 2, Failures: 0, Errors: 0, Skipped: 0, Time elapsed: 28.861 sec
> - in org.apache.hadoop.hbase.TestRegionRebalancing
> Running org.apache.hadoop.hbase.migration.TestUpgradeTo96
> Tests run: 5, Failures: 0, Errors: 0, Skipped: 0, Time elapsed: 3.535 sec
> - in org.apache.hadoop.hbase.migration.TestUpgradeTo96
> Tests run: 5, Failures: 0, Errors: 0, Skipped: 0, Time elapsed: 16.515 sec
> - in org.apache.hadoop.hbase.migration.TestNamespaceUpgrade
> Running org.apache.hadoop.hbase.TestMultiVersions
> Tests run: 23, Failures: 0, Errors: 0, Skipped: 0, Time elapsed: 121.993
> sec - in
> org.apache.hadoop.hbase.security.visibility.TestVisibilityLabelsWithDistributedLogReplay
> Running org.apache.hadoop.hbase.master.TestHMasterRPCException
> Running org.apache.hadoop.hbase.master.TestAssignmentListener
> Tests run: 1, Failures: 0, Errors: 0, Skipped: 0, Time elapsed: 2.857 sec
> - in org.apache.hadoop.hbase.master.TestHMasterRPCException
> Running org.apache.hadoop.hbase.master.TestDeadServer
> Tests run: 3, Failures: 0, Errors: 0, Skipped: 0, Time elapsed: 0.299 sec
> - in org.apache.hadoop.hbase.master.TestDeadServer
> Tests run: 3, Failures: 0, Errors: 0, Skipped: 0, Time elapsed: 6.682 sec
> - in org.apache.hadoop.hbase.TestMultiVersions
> Running org.apache.hadoop.hbase.master.TestMasterRestartAfterDisablingTable
> Tests run: 2, Failures: 0, Errors: 0, Skipped: 0, Time elapsed: 5.68 sec -
> in org.apache.hadoop.hbase.master.TestAssignmentListener
> Running
> org.apache.hadoop.hbase.master.TestMasterFailoverBalancerPersistence
> Running org.apache.hadoop.hbase.master.TestZKBasedOpenCloseRegion
> Tests run: 1, Failures: 0, Errors: 0, Skipped: 0, Time elapsed: 14.467 sec
> - in org.apache.hadoop.hbase.master.TestMasterRestartAfterDisablingTable
> Tests run: 3, Failures: 0, Errors: 0, Skipped: 0, Time elapsed: 2.848 sec
> - in org.apache.hadoop.hbase.master.TestZKBasedOpenCloseRegion
> Running org.apache.hadoop.hbase.master.TestMasterShutdown
> Tests run: 1, Failures: 0, Errors: 0, Skipped: 0, Time elapsed: 14.937 sec
> - in org.apache.hadoop.hbase.master.TestMasterFailoverBalancerPersistence
> Running org.apache.hadoop.hbase.master.snapshot.TestSnapshotFileCache
> Running org.apache.hadoop.hbase.master.cleaner.TestHFileCleaner
> Tests run: 3, Failures: 0, Errors: 0, Skipped: 0, Time elapsed: 81.296 sec
> - in org.apache.hadoop.hbase.TestAcidGuarantees
> Tests run: 3, Failures: 0, Errors: 0, Skipped: 0, Time elapsed: 1.01 sec -
> in org.apache.hadoop.hbase.master.cleaner.TestHFileCleaner
> Running org.apache.hadoop.hbase.master.cleaner.TestLogsCleaner
> Tests run: 55, Failures: 0, Errors: 0, Skipped: 0, Time elapsed: 249.912
> sec - in org.apache.hadoop.hbase.security.access.TestAccessController
> Tests run: 2, Failures: 0, Errors: 0, Skipped: 0, Time elapsed: 15.244 sec
> - in org.apache.hadoop.hbase.master.TestMasterShutdown
> Running org.apache.hadoop.hbase.master.TestGetInfoPort
> Running org.apache.hadoop.hbase.master.cleaner.TestSnapshotFromMaster
> Tests run: 1, Failures: 0, Errors: 0, Skipped: 0, Time elapsed: 11.121 sec
> - in org.apache.hadoop.hbase.master.cleaner.TestLogsCleaner
> Running org.apache.hadoop.hbase.master.TestMasterStatusServlet
> Running
> org.apache.hadoop.hbase.master.TestMasterOperationsForRegionReplicas
> Tests run: 4, Failures: 0, Errors: 0, Skipped: 0, Time elapsed: 1.556 sec
> - in org.apache.hadoop.hbase.master.TestMasterStatusServlet
> Tests run: 1, Failures: 0, Errors: 0, Skipped: 0, Time elapsed: 9.092 sec
> - in org.apache.hadoop.hbase.master.TestGetInfoPort
> Running org.apache.hadoop.hbase.master.balancer.TestStochasticLoadBalancer
> Running org.apache.hadoop.hbase.master.balancer.TestDefaultLoadBalancer
> Tests run: 4, Failures: 0, Errors: 0, Skipped: 0, Time elapsed: 10.809 sec
> - in org.apache.hadoop.hbase.master.cleaner.TestSnapshotFromMaster
> Tests run: 1, Failures: 0, Errors: 0, Skipped: 0, Time elapsed: 1.783 sec
> - in org.apache.hadoop.hbase.master.balancer.TestDefaultLoadBalancer
> Running org.apache.hadoop.hbase.master.balancer.TestBaseLoadBalancer
> Running org.apache.hadoop.hbase.master.TestMasterFailover
> Tests run: 7, Failures: 0, Errors: 0, Skipped: 0, Time elapsed: 0.55 sec -
> in org.apache.hadoop.hbase.master.balancer.TestBaseLoadBalancer
> Running org.apache.hadoop.hbase.master.TestDistributedLogSplitting
> Tests run: 5, Failures: 0, Errors: 0, Skipped: 0, Time elapsed: 31.243 sec
> - in org.apache.hadoop.hbase.master.snapshot.TestSnapshotFileCache
> Running org.apache.hadoop.hbase.master.TestMasterNoCluster
> Tests run: 2, Failures: 0, Errors: 0, Skipped: 0, Time elapsed: 15.612 sec
> - in org.apache.hadoop.hbase.master.TestMasterOperationsForRegionReplicas
> Running org.apache.hadoop.hbase.master.TestGetLastFlushedSequenceId
> Tests run: 3, Failures: 0, Errors: 0, Skipped: 0, Time elapsed: 13.073 sec
> - in org.apache.hadoop.hbase.master.TestMasterNoCluster
> Running org.apache.hadoop.hbase.master.TestRollingRestart
> Tests run: 1, Failures: 0, Errors: 0, Skipped: 0, Time elapsed: 14.3 sec -
> in org.apache.hadoop.hbase.master.TestGetLastFlushedSequenceId
> Running org.apache.hadoop.hbase.master.TestRegionPlacement2
> Tests run: 2, Failures: 0, Errors: 0, Skipped: 0, Time elapsed: 2.216 sec
> - in org.apache.hadoop.hbase.master.TestRegionPlacement2
> Tests run: 1, Failures: 0, Errors: 0, Skipped: 0, Time elapsed: 21.755 sec
> - in org.apache.hadoop.hbase.master.TestRollingRestart
> Running org.apache.hadoop.hbase.master.TestMaster
> Running org.apache.hadoop.hbase.master.TestMasterMetricsWrapper
> Tests run: 4, Failures: 0, Errors: 0, Skipped: 0, Time elapsed: 6.82 sec -
> in org.apache.hadoop.hbase.master.TestMaster
> Tests run: 1, Failures: 0, Errors: 0, Skipped: 0, Time elapsed: 2.21 sec -
> in org.apache.hadoop.hbase.master.TestMasterMetricsWrapper
> Running org.apache.hadoop.hbase.master.TestActiveMasterManager
> Tests run: 2, Failures: 0, Errors: 0, Skipped: 0, Time elapsed: 1.085 sec
> - in org.apache.hadoop.hbase.master.TestActiveMasterManager
> Running org.apache.hadoop.hbase.master.TestRestartCluster
> Running org.apache.hadoop.hbase.master.TestMasterTransitions
> Tests run: 7, Failures: 0, Errors: 0, Skipped: 0, Time elapsed: 65.99 sec
> - in org.apache.hadoop.hbase.master.TestMasterFailover
> Running org.apache.hadoop.hbase.master.TestOpenedRegionHandler
> Tests run: 3, Failures: 0, Errors: 0, Skipped: 3, Time elapsed: 2.287 sec
> - in org.apache.hadoop.hbase.master.TestMasterTransitions
> Running
> org.apache.hadoop.hbase.master.handler.TestTableDescriptorModification
> Tests run: 3, Failures: 0, Errors: 0, Skipped: 0, Time elapsed: 3.497 sec
> - in org.apache.hadoop.hbase.master.handler.TestTableDescriptorModification
> Tests run: 2, Failures: 0, Errors: 0, Skipped: 0, Time elapsed: 13.76 sec
> - in org.apache.hadoop.hbase.master.TestOpenedRegionHandler
> Running org.apache.hadoop.hbase.master.handler.TestCreateTableHandler
> Tests run: 3, Failures: 0, Errors: 0, Skipped: 0, Time elapsed: 34.608 sec
> - in org.apache.hadoop.hbase.master.TestRestartCluster
> Running org.apache.hadoop.hbase.master.TestSplitLogManager
> Running org.apache.hadoop.hbase.master.handler.TestTableDeleteFamilyHandler
> Tests run: 1, Failures: 0, Errors: 0, Skipped: 0, Time elapsed: 1.913 sec
> - in org.apache.hadoop.hbase.master.handler.TestTableDeleteFamilyHandler
> Tests run: 3, Failures: 0, Errors: 0, Skipped: 0, Time elapsed: 22.452 sec
> - in org.apache.hadoop.hbase.master.handler.TestCreateTableHandler
> Running org.apache.hadoop.hbase.master.TestAssignmentManagerOnCluster
> Running org.apache.hadoop.hbase.master.TestRegionPlacement
> Tests run: 2, Failures: 0, Errors: 0, Skipped: 0, Time elapsed: 17.539 sec
> - in org.apache.hadoop.hbase.master.TestRegionPlacement
> Running org.apache.hadoop.hbase.master.TestClusterStatusPublisher
> Tests run: 3, Failures: 0, Errors: 0, Skipped: 0, Time elapsed: 0.441 sec
> - in org.apache.hadoop.hbase.master.TestClusterStatusPublisher
> Running org.apache.hadoop.hbase.master.TestTableLockManager
> Tests run: 21, Failures: 0, Errors: 0, Skipped: 0, Time elapsed: 35.558
> sec - in org.apache.hadoop.hbase.master.TestAssignmentManagerOnCluster
> Running org.apache.hadoop.hbase.master.TestMasterMetrics
> Tests run: 2, Failures: 0, Errors: 0, Skipped: 0, Time elapsed: 1.041 sec
> - in org.apache.hadoop.hbase.master.TestMasterMetrics
> Running org.apache.hadoop.hbase.master.TestZKLessAMOnCluster
> Tests run: 18, Failures: 0, Errors: 0, Skipped: 0, Time elapsed: 161.213
> sec - in org.apache.hadoop.hbase.master.TestDistributedLogSplitting
> Running org.apache.hadoop.hbase.master.TestMasterFileSystem
> Tests run: 2, Failures: 0, Errors: 0, Skipped: 0, Time elapsed: 1.151 sec
> - in org.apache.hadoop.hbase.master.TestMasterFileSystem
> Running org.apache.hadoop.hbase.master.TestAssignmentManager
> Tests run: 20, Failures: 0, Errors: 0, Skipped: 0, Time elapsed: 4.096 sec
> - in org.apache.hadoop.hbase.master.TestAssignmentManager
> Tests run: 21, Failures: 0, Errors: 0, Skipped: 0, Time elapsed: 33.453
> sec - in org.apache.hadoop.hbase.master.TestZKLessAMOnCluster
> Tests run: 5, Failures: 0, Errors: 0, Skipped: 0, Time elapsed: 74.829 sec
> - in org.apache.hadoop.hbase.master.TestTableLockManager
> Tests run: 15, Failures: 0, Errors: 0, Skipped: 0, Time elapsed: 133.611
> sec - in org.apache.hadoop.hbase.master.TestSplitLogManager
> Tests run: 23, Failures: 0, Errors: 0, Skipped: 0, Time elapsed: 540.969
> sec - in org.apache.hadoop.hbase.master.balancer.TestStochasticLoadBalancer
>
> Results :
>
>
> Tests in error:
>
> TestSplitTransactionOnCluster.testShouldFailSplitIfZNodeDoesNotExistDueToPrevRollBack:200->createTableAndWait:1535
> ยป
>
>
> Tests run: 2306, Failures: 0, Errors: 1, Skipped: 18
>
> [INFO]
> ------------------------------------------------------------------------
> [INFO] Reactor Summary:
> [INFO]
> [INFO] HBase ............................................. SUCCESS [3.402s]
> [INFO] HBase - Checkstyle ................................ SUCCESS [0.670s]
> [INFO] HBase - Annotations ............................... SUCCESS [0.835s]
> [INFO] HBase - Common .................................... SUCCESS
> [59.167s]
> [INFO] HBase - Protocol .................................. SUCCESS [9.127s]
> [INFO] HBase - Client .................................... SUCCESS
> [1:14.288s]
> [INFO] HBase - Hadoop Compatibility ...................... SUCCESS [7.007s]
> [INFO] HBase - Hadoop Two Compatibility .................. SUCCESS [6.248s]
> [INFO] HBase - Prefix Tree ............................... SUCCESS [8.305s]
> [INFO] HBase - Server .................................... FAILURE
> [1:06:32.126s]
> [INFO] HBase - Testing Util .............................. SKIPPED
> [INFO] HBase - Thrift .................................... SKIPPED
> [INFO] HBase - Rest ...................................... SKIPPED
> [INFO] HBase - Shell ..................................... SKIPPED
> [INFO] HBase - Integration Tests ......................... SKIPPED
> [INFO] HBase - Examples .................................. SKIPPED
> [INFO] HBase - Assembly .................................. SKIPPED
> [INFO]
> ------------------------------------------------------------------------
> [INFO] BUILD FAILURE
> [INFO]
> ------------------------------------------------------------------------
> [INFO] Total time: 1:09:22.003s
> [INFO] Finished at: Sat Jan 31 04:49:47 UTC 2015
> [INFO] Final Memory: 46M/562M
> [INFO]
> ------------------------------------------------------------------------
> [ERROR] Failed to execute goal
> org.apache.maven.plugins:maven-surefire-plugin:2.18:test
> (secondPartTestsExecution) on project hbase-server: There are test failures.
> [ERROR]
> [ERROR] Please refer to <
> https://builds.apache.org/job/HBase-1.0/ws/hbase-server/target/surefire-reports>
> for the individual test results.
> [ERROR] -> [Help 1]
> [ERROR]
> [ERROR] To see the full stack trace of the errors, re-run Maven with the
> -e switch.
> [ERROR] Re-run Maven using the -X switch to enable full debug logging.
> [ERROR]
> [ERROR] For more information about the errors and possible solutions,
> please read the following articles:
> [ERROR] [Help 1]
> http://cwiki.apache.org/confluence/display/MAVEN/MojoFailureException
> [ERROR]
> [ERROR] After correcting the problems, you can resume the build with the
> command
> [ERROR]   mvn <goals> -rf :hbase-server
> Build step 'Invoke top-level Maven targets' marked build as failure
> Performing Post build task...
> Match found for :.* : True
> Logical operation result is TRUE
> Running script  :   ZOMBIE_TESTS_COUNT=`jps | grep surefirebooter | wc -l`
>   if [[ $ZOMBIE_TESTS_COUNT != 0 ]] ; then
>     #It seems sometimes the tests are not dying immediately. Let's give
> them 10s
>     echo "Suspicious java process found - waiting 10s to see if there are
> just slow to stop"
>     sleep 10
>     ZOMBIE_TESTS_COUNT=`jps | grep surefirebooter | wc -l`
>     if [[ $ZOMBIE_TESTS_COUNT != 0 ]] ; then
>       echo "There are $ZOMBIE_TESTS_COUNT zombie tests, they should have
> been killed by surefire but survived"
>       echo "************ BEGIN zombies jstack extract"
>       ZB_STACK=`jps | grep surefirebooter | cut -d ' ' -f 1 | xargs -n 1
> jstack | grep ".test" | grep "\.java"`
>       jps | grep surefirebooter | cut -d ' ' -f 1 | xargs -n 1 jstack
>       echo "************ END  zombies jstack extract"
>       JIRA_COMMENT="$JIRA_COMMENT
>
>      {color:red}-1 core zombie tests{color}.  There are
> ${ZOMBIE_TESTS_COUNT} zombie test(s): ${ZB_STACK}"
>       BAD=1
>       jps | grep surefirebooter | cut -d ' ' -f 1 | xargs kill -9
>     else
>       echo "We're ok: there is no zombie test, but some tests took some
> time to stop"
>     fi
>   else
>     echo "We're ok: there is no zombie test"
>   fi
> [HBase-1.0] $ /bin/bash -xe /tmp/hudson3722228402822883722.sh
> ++ jps
> ++ grep surefirebooter
> ++ wc -l
> + ZOMBIE_TESTS_COUNT=0
> + [[ 0 != 0 ]]
> + echo 'We'\''re ok: there is no zombie test'
> We're ok: there is no zombie test
> POST BUILD TASK : SUCCESS
> END OF POST BUILD TASK : 0
> Archiving artifacts
> Sending artifact delta relative to HBase-1.0 #697
> Archived 1851 artifacts
> Archive block size is 32768
> Received 27 blocks and 399236724 bytes
> Compression is 0.2%
> Took 1 min 43 sec
> Recording test results
> Updating HBASE-12782
>

Mime
  • Unnamed multipart/alternative (inline, None, 0 bytes)
View raw message