hbase-builds mailing list archives

Site index · List index
Message view « Date » · « Thread »
Top « Date » · « Thread »
From Apache Jenkins Server <jenk...@builds.apache.org>
Subject Build failed in Jenkins: HBase-TRUNK #6022
Date Wed, 14 Jan 2015 08:32:22 GMT
See <https://builds.apache.org/job/HBase-TRUNK/6022/changes>

Changes:

[stack] HBASE-7541 Convert all tests that use HBaseTestingUtility.createMultiRegions to HBA.createTable
(Jonathan Lawlor)

[mstanleyjones] HBASE-11533 Asciidoc Proof of Concept

------------------------------------------
[...truncated 1883 lines...]
Running org.apache.hadoop.hbase.io.hfile.TestCacheConfig
Running org.apache.hadoop.hbase.io.hfile.TestForceCacheImportantBlocks
Tests run: 1, Failures: 0, Errors: 0, Skipped: 0, Time elapsed: 1.495 sec - in org.apache.hadoop.hbase.io.hfile.TestHFileSeek
Tests run: 6, Failures: 0, Errors: 0, Skipped: 0, Time elapsed: 1.333 sec - in org.apache.hadoop.hbase.io.hfile.TestCacheConfig
Running org.apache.hadoop.hbase.io.hfile.TestCacheOnWrite
Running org.apache.hadoop.hbase.io.hfile.TestScannerSelectionUsingTTL
Tests run: 1, Failures: 0, Errors: 0, Skipped: 0, Time elapsed: 39.262 sec - in org.apache.hadoop.hbase.TestFullLogReconstruction
Running org.apache.hadoop.hbase.io.hfile.TestHFileBlock
Tests run: 4, Failures: 0, Errors: 0, Skipped: 0, Time elapsed: 34.979 sec - in org.apache.hadoop.hbase.io.hfile.TestForceCacheImportantBlocks
Running org.apache.hadoop.hbase.io.TestFileLink
Tests run: 3, Failures: 0, Errors: 0, Skipped: 0, Time elapsed: 20.985 sec - in org.apache.hadoop.hbase.io.TestFileLink
Running org.apache.hadoop.hbase.io.encoding.TestEncodedSeekers
Tests run: 6, Failures: 0, Errors: 0, Skipped: 0, Time elapsed: 62.708 sec - in org.apache.hadoop.hbase.io.hfile.TestScannerSelectionUsingTTL
Running org.apache.hadoop.hbase.io.encoding.TestChangingEncoding
Tests run: 28, Failures: 0, Errors: 0, Skipped: 0, Time elapsed: 93.552 sec - in org.apache.hadoop.hbase.io.hfile.TestHFileBlock
Running org.apache.hadoop.hbase.io.encoding.TestDataBlockEncoders
Tests run: 3, Failures: 0, Errors: 0, Skipped: 0, Time elapsed: 59.518 sec - in org.apache.hadoop.hbase.io.encoding.TestChangingEncoding
Running org.apache.hadoop.hbase.io.encoding.TestBufferedDataBlockEncoder
Tests run: 20, Failures: 0, Errors: 0, Skipped: 0, Time elapsed: 83.219 sec - in org.apache.hadoop.hbase.io.encoding.TestEncodedSeekers
Running org.apache.hadoop.hbase.io.encoding.TestLoadAndSwitchEncodeOnDisk
Tests run: 1, Failures: 0, Errors: 0, Skipped: 0, Time elapsed: 19.037 sec - in org.apache.hadoop.hbase.io.encoding.TestBufferedDataBlockEncoder
Running org.apache.hadoop.hbase.TestRegionRebalancing
Tests run: 1, Failures: 0, Errors: 0, Skipped: 0, Time elapsed: 25.423 sec - in org.apache.hadoop.hbase.io.encoding.TestLoadAndSwitchEncodeOnDisk
Running org.apache.hadoop.hbase.TestHColumnDescriptorDefaultVersions
Tests run: 3, Failures: 0, Errors: 0, Skipped: 0, Time elapsed: 15.624 sec - in org.apache.hadoop.hbase.TestHColumnDescriptorDefaultVersions
Tests run: 2, Failures: 0, Errors: 0, Skipped: 0, Time elapsed: 36.489 sec - in org.apache.hadoop.hbase.TestRegionRebalancing
Running org.apache.hadoop.hbase.mapred.TestTableInputFormat
Tests run: 10, Failures: 0, Errors: 0, Skipped: 0, Time elapsed: 5.07 sec - in org.apache.hadoop.hbase.mapred.TestTableInputFormat
Running org.apache.hadoop.hbase.mapred.TestTableMapReduceUtil
Running org.apache.hadoop.hbase.mapred.TestTableMapReduce
Tests run: 55, Failures: 1, Errors: 0, Skipped: 0, Time elapsed: 336.768 sec <<<
FAILURE! - in org.apache.hadoop.hbase.security.access.TestAccessController
testPermissionList(org.apache.hadoop.hbase.security.access.TestAccessController)  Time elapsed:
7.397 sec  <<< FAILURE!
java.lang.AssertionError: Owner should have all permissions on table
	at org.junit.Assert.fail(Assert.java:88)
	at org.junit.Assert.assertTrue(Assert.java:41)
	at org.apache.hadoop.hbase.security.access.TestAccessController.testPermissionList(TestAccessController.java:1493)

Running org.apache.hadoop.hbase.mapred.TestTableSnapshotInputFormat
Tests run: 28, Failures: 0, Errors: 0, Skipped: 0, Time elapsed: 177.589 sec - in org.apache.hadoop.hbase.io.encoding.TestDataBlockEncoders
Running org.apache.hadoop.hbase.replication.TestReplicationTrackerZKImpl
Tests run: 5, Failures: 0, Errors: 0, Skipped: 0, Time elapsed: 1.282 sec - in org.apache.hadoop.hbase.replication.TestReplicationTrackerZKImpl
Tests run: 4, Failures: 0, Errors: 0, Skipped: 0, Time elapsed: 84.571 sec - in org.apache.hadoop.hbase.mapred.TestTableMapReduceUtil
Running org.apache.hadoop.hbase.replication.TestReplicationEndpoint
Tests run: 3, Failures: 0, Errors: 0, Skipped: 0, Time elapsed: 4.523 sec - in org.apache.hadoop.hbase.replication.TestReplicationEndpoint
Running org.apache.hadoop.hbase.replication.TestReplicationDisableInactivePeer
Tests run: 2, Failures: 0, Errors: 0, Skipped: 0, Time elapsed: 97.138 sec - in org.apache.hadoop.hbase.mapred.TestTableMapReduce
Tests run: 216, Failures: 0, Errors: 0, Skipped: 0, Time elapsed: 337.103 sec - in org.apache.hadoop.hbase.io.hfile.TestCacheOnWrite
Running org.apache.hadoop.hbase.replication.TestReplicationKillMasterRSCompressed
Running org.apache.hadoop.hbase.replication.regionserver.TestReplicationSink
Tests run: 1, Failures: 0, Errors: 0, Skipped: 0, Time elapsed: 25.976 sec - in org.apache.hadoop.hbase.replication.TestReplicationDisableInactivePeer
Tests run: 5, Failures: 0, Errors: 0, Skipped: 0, Time elapsed: 4.626 sec - in org.apache.hadoop.hbase.replication.regionserver.TestReplicationSink
Running org.apache.hadoop.hbase.replication.regionserver.TestRegionReplicaReplicationEndpoint
Tests run: 7, Failures: 0, Errors: 0, Skipped: 7, Time elapsed: 0.006 sec - in org.apache.hadoop.hbase.replication.regionserver.TestRegionReplicaReplicationEndpoint
Running org.apache.hadoop.hbase.replication.TestPerTableCFReplication
Running org.apache.hadoop.hbase.replication.regionserver.TestReplicationSourceManager
Tests run: 4, Failures: 0, Errors: 0, Skipped: 0, Time elapsed: 4.863 sec - in org.apache.hadoop.hbase.replication.regionserver.TestReplicationSourceManager
Running org.apache.hadoop.hbase.replication.regionserver.TestReplicationWALReaderManager
Tests run: 1, Failures: 0, Errors: 0, Skipped: 0, Time elapsed: 23.799 sec - in org.apache.hadoop.hbase.replication.TestReplicationKillMasterRSCompressed
Running org.apache.hadoop.hbase.replication.TestReplicationSource
Tests run: 1, Failures: 0, Errors: 0, Skipped: 0, Time elapsed: 0.289 sec - in org.apache.hadoop.hbase.replication.TestReplicationSource
Running org.apache.hadoop.hbase.replication.regionserver.TestRegionReplicaReplicationEndpointNoMaster
Tests run: 2, Failures: 0, Errors: 0, Skipped: 0, Time elapsed: 31.323 sec - in org.apache.hadoop.hbase.replication.TestPerTableCFReplication
Running org.apache.hadoop.hbase.replication.TestReplicationChangingPeerRegionservers
Tests run: 1, Failures: 0, Errors: 0, Skipped: 0, Time elapsed: 5.854 sec - in org.apache.hadoop.hbase.replication.TestReplicationChangingPeerRegionservers
Running org.apache.hadoop.hbase.replication.TestReplicationSyncUpTool
Tests run: 3, Failures: 0, Errors: 0, Skipped: 0, Time elapsed: 38.276 sec - in org.apache.hadoop.hbase.replication.regionserver.TestRegionReplicaReplicationEndpointNoMaster
Running org.apache.hadoop.hbase.replication.TestMultiSlaveReplication
Running org.apache.hadoop.hbase.replication.TestReplicationKillMasterRS
Tests run: 1, Failures: 0, Errors: 0, Skipped: 0, Time elapsed: 18.119 sec - in org.apache.hadoop.hbase.replication.TestReplicationKillMasterRS
Tests run: 1, Failures: 0, Errors: 0, Skipped: 0, Time elapsed: 27.024 sec - in org.apache.hadoop.hbase.replication.TestMultiSlaveReplication
Running org.apache.hadoop.hbase.replication.TestReplicationWithTags
Tests run: 1, Failures: 0, Errors: 0, Skipped: 0, Time elapsed: 4.579 sec - in org.apache.hadoop.hbase.replication.TestReplicationWithTags
Tests run: 1, Failures: 0, Errors: 0, Skipped: 0, Time elapsed: 53.118 sec - in org.apache.hadoop.hbase.replication.TestReplicationSyncUpTool
Running org.apache.hadoop.hbase.replication.TestReplicationStateZKImpl
Running org.apache.hadoop.hbase.replication.TestReplicationKillSlaveRS
Tests run: 6, Failures: 0, Errors: 0, Skipped: 0, Time elapsed: 3.269 sec - in org.apache.hadoop.hbase.replication.TestReplicationStateZKImpl
Running org.apache.hadoop.hbase.replication.TestMasterReplication
Tests run: 1, Failures: 0, Errors: 0, Skipped: 0, Time elapsed: 15.465 sec - in org.apache.hadoop.hbase.replication.TestReplicationKillSlaveRS
Running org.apache.hadoop.hbase.replication.TestReplicationSmallTests
Running org.apache.hadoop.hbase.util.TestMergeTool
Tests run: 1, Failures: 0, Errors: 0, Skipped: 0, Time elapsed: 21.033 sec - in org.apache.hadoop.hbase.util.TestMergeTool
Running org.apache.hadoop.hbase.util.TestFSTableDescriptors
Tests run: 16, Failures: 0, Errors: 0, Skipped: 0, Time elapsed: 1.887 sec - in org.apache.hadoop.hbase.util.TestFSTableDescriptors
Running org.apache.hadoop.hbase.util.TestHBaseFsckEncryption
Tests run: 1, Failures: 0, Errors: 0, Skipped: 0, Time elapsed: 13.32 sec - in org.apache.hadoop.hbase.util.TestHBaseFsckEncryption
Running org.apache.hadoop.hbase.util.TestIdLock
Tests run: 9, Failures: 0, Errors: 0, Skipped: 0, Time elapsed: 48.183 sec - in org.apache.hadoop.hbase.replication.TestReplicationSmallTests
Running org.apache.hadoop.hbase.util.TestMiniClusterLoadSequential
Tests run: 1, Failures: 0, Errors: 0, Skipped: 0, Time elapsed: 15.29 sec - in org.apache.hadoop.hbase.util.TestIdLock
Running org.apache.hadoop.hbase.util.TestMergeTable
Tests run: 3, Failures: 0, Errors: 0, Skipped: 0, Time elapsed: 73.084 sec - in org.apache.hadoop.hbase.replication.TestMasterReplication
Running org.apache.hadoop.hbase.util.TestMiniClusterLoadParallel
Tests run: 1, Failures: 0, Errors: 0, Skipped: 0, Time elapsed: 21.221 sec - in org.apache.hadoop.hbase.util.TestMergeTable
Running org.apache.hadoop.hbase.util.TestHBaseFsck
Tests run: 4, Failures: 0, Errors: 0, Skipped: 0, Time elapsed: 54.038 sec - in org.apache.hadoop.hbase.util.TestMiniClusterLoadSequential
Running org.apache.hadoop.hbase.util.TestFSUtils
Tests run: 6, Failures: 0, Errors: 0, Skipped: 0, Time elapsed: 307.07 sec - in org.apache.hadoop.hbase.mapred.TestTableSnapshotInputFormat
Tests run: 4, Failures: 0, Errors: 0, Skipped: 0, Time elapsed: 51.364 sec - in org.apache.hadoop.hbase.util.TestMiniClusterLoadParallel
Running org.apache.hadoop.hbase.util.TestProcessBasedCluster
Tests run: 1, Failures: 0, Errors: 0, Skipped: 0, Time elapsed: 0.119 sec - in org.apache.hadoop.hbase.util.TestProcessBasedCluster
Running org.apache.hadoop.hbase.util.TestTableName
Tests run: 5, Failures: 0, Errors: 0, Skipped: 0, Time elapsed: 0.53 sec - in org.apache.hadoop.hbase.util.TestTableName
Running org.apache.hadoop.hbase.util.TestMiniClusterLoadEncoded
Running org.apache.hadoop.hbase.util.TestRegionSplitter
Tests run: 8, Failures: 0, Errors: 0, Skipped: 0, Time elapsed: 239.818 sec - in org.apache.hadoop.hbase.replication.regionserver.TestReplicationWALReaderManager
Tests run: 8, Failures: 0, Errors: 0, Skipped: 0, Time elapsed: 20.081 sec - in org.apache.hadoop.hbase.util.TestFSUtils
Running org.apache.hadoop.hbase.util.TestFSVisitor
Tests run: 6, Failures: 0, Errors: 0, Skipped: 0, Time elapsed: 11.133 sec - in org.apache.hadoop.hbase.util.TestRegionSplitter
Running org.apache.hadoop.hbase.util.hbck.TestOfflineMetaRebuildBase
Tests run: 3, Failures: 0, Errors: 0, Skipped: 0, Time elapsed: 4.115 sec - in org.apache.hadoop.hbase.util.TestFSVisitor
Running org.apache.hadoop.hbase.util.hbck.TestOfflineMetaRebuildOverlap
Running org.apache.hadoop.hbase.util.TestCoprocessorScanPolicy
Tests run: 4, Failures: 0, Errors: 0, Skipped: 0, Time elapsed: 5.888 sec - in org.apache.hadoop.hbase.util.TestCoprocessorScanPolicy
Running org.apache.hadoop.hbase.util.hbck.TestOfflineMetaRebuildHole
Tests run: 1, Failures: 0, Errors: 0, Skipped: 0, Time elapsed: 24.234 sec - in org.apache.hadoop.hbase.util.hbck.TestOfflineMetaRebuildBase
Running org.apache.hadoop.hbase.util.TestDefaultEnvironmentEdge
Tests run: 1, Failures: 0, Errors: 0, Skipped: 0, Time elapsed: 0.348 sec - in org.apache.hadoop.hbase.util.TestDefaultEnvironmentEdge
Tests run: 1, Failures: 0, Errors: 0, Skipped: 0, Time elapsed: 22.337 sec - in org.apache.hadoop.hbase.util.hbck.TestOfflineMetaRebuildOverlap
Running org.apache.hadoop.hbase.util.TestFSHDFSUtils
Tests run: 3, Failures: 0, Errors: 0, Skipped: 0, Time elapsed: 6.64 sec - in org.apache.hadoop.hbase.util.TestFSHDFSUtils
Running org.apache.hadoop.hbase.TestMetaTableAccessorNoCluster
Tests run: 1, Failures: 0, Errors: 0, Skipped: 0, Time elapsed: 22.605 sec - in org.apache.hadoop.hbase.util.hbck.TestOfflineMetaRebuildHole
Tests run: 2, Failures: 0, Errors: 0, Skipped: 0, Time elapsed: 3.246 sec - in org.apache.hadoop.hbase.TestMetaTableAccessorNoCluster
Tests run: 5, Failures: 0, Errors: 0, Skipped: 0, Time elapsed: 58.358 sec - in org.apache.hadoop.hbase.util.TestMiniClusterLoadEncoded
Running org.apache.hadoop.hbase.TestNamespace
Running org.apache.hadoop.hbase.TestMetaTableAccessor
Running org.apache.hadoop.hbase.TestInfoServers
Tests run: 3, Failures: 0, Errors: 0, Skipped: 0, Time elapsed: 3.631 sec - in org.apache.hadoop.hbase.TestInfoServers
Tests run: 8, Failures: 0, Errors: 0, Skipped: 0, Time elapsed: 6.658 sec - in org.apache.hadoop.hbase.TestMetaTableAccessor
Tests run: 9, Failures: 0, Errors: 0, Skipped: 1, Time elapsed: 8.87 sec - in org.apache.hadoop.hbase.TestNamespace
Tests run: 49, Failures: 0, Errors: 0, Skipped: 1, Time elapsed: 329.041 sec - in org.apache.hadoop.hbase.util.TestHBaseFsck

Results :

Failed tests: 
  TestRegionPlacement.testRegionPlacement:163->killRandomServerAndVerifyAssignment:240
Region {ENCODED => 64a02a17cac6cfaf002fdd343c70d457, NAME => 'testRegionAssignment,\x09\x09\x09,1421221685327.64a02a17cac6cfaf002fdd343c70d457.',
STARTKEY => '\x09\x09\x09', ENDKEY => ''} not present on any of the expected servers
  TestAccessController.testPermissionList:1493 Owner should have all permissions on table



Tests run: 2219, Failures: 2, Errors: 0, Skipped: 25

[INFO] ------------------------------------------------------------------------
[INFO] Reactor Summary:
[INFO] 
[INFO] HBase ............................................. SUCCESS [5.260s]
[INFO] HBase - Checkstyle ................................ SUCCESS [4.676s]
[INFO] HBase - Annotations ............................... SUCCESS [2.618s]
[INFO] HBase - Protocol .................................. SUCCESS [10.654s]
[INFO] HBase - Common .................................... SUCCESS [1:03.880s]
[INFO] HBase - Client .................................... SUCCESS [1:13.147s]
[INFO] HBase - Hadoop Compatibility ...................... SUCCESS [7.374s]
[INFO] HBase - Hadoop Two Compatibility .................. SUCCESS [6.444s]
[INFO] HBase - Prefix Tree ............................... SUCCESS [9.002s]
[INFO] HBase - Server .................................... FAILURE [1:06:38.673s]
[INFO] HBase - Testing Util .............................. SKIPPED
[INFO] HBase - Thrift .................................... SKIPPED
[INFO] HBase - Shell ..................................... SKIPPED
[INFO] HBase - Integration Tests ......................... SKIPPED
[INFO] HBase - Examples .................................. SKIPPED
[INFO] HBase - Rest ...................................... SKIPPED
[INFO] HBase - Assembly .................................. SKIPPED
[INFO] ------------------------------------------------------------------------
[INFO] BUILD FAILURE
[INFO] ------------------------------------------------------------------------
[INFO] Total time: 1:09:42.838s
[INFO] Finished at: Wed Jan 14 08:30:06 UTC 2015
[INFO] Final Memory: 57M/713M
[INFO] ------------------------------------------------------------------------
[ERROR] Failed to execute goal org.apache.maven.plugins:maven-surefire-plugin:2.18:test (secondPartTestsExecution)
on project hbase-server: There are test failures.
[ERROR] 
[ERROR] Please refer to /x1/jenkins/jenkins-slave/workspace/HBase-TRUNK/hbase-server/target/surefire-reports
for the individual test results.
[ERROR] -> [Help 1]
[ERROR] 
[ERROR] To see the full stack trace of the errors, re-run Maven with the -e switch.
[ERROR] Re-run Maven using the -X switch to enable full debug logging.
[ERROR] 
[ERROR] For more information about the errors and possible solutions, please read the following
articles:
[ERROR] [Help 1] http://cwiki.apache.org/confluence/display/MAVEN/MojoFailureException
[ERROR] 
[ERROR] After correcting the problems, you can resume the build with the command
[ERROR]   mvn <goals> -rf :hbase-server
Build step 'Invoke top-level Maven targets' marked build as failure
[FINDBUGS] Skipping publisher since build result is FAILURE
Performing Post build task...
Match found for :.* : True
Logical operation result is TRUE
Running script  :   ZOMBIE_TESTS_COUNT=`jps | grep surefirebooter | wc -l`
  if [[ $ZOMBIE_TESTS_COUNT != 0 ]] ; then
    #It seems sometimes the tests are not dying immediately. Let's give them 10s
    echo "Suspicious java process found - waiting 10s to see if there are just slow to stop"
    sleep 10   
    ZOMBIE_TESTS_COUNT=`jps | grep surefirebooter | wc -l`
    if [[ $ZOMBIE_TESTS_COUNT != 0 ]] ; then
      echo "There are $ZOMBIE_TESTS_COUNT zombie tests, they should have been killed by surefire
but survived"
      echo "************ BEGIN zombies jstack extract"
      ZB_STACK=`jps | grep surefirebooter | cut -d ' ' -f 1 | xargs -n 1 jstack | grep ".test"
| grep "\.java"`
      jps | grep surefirebooter | cut -d ' ' -f 1 | xargs -n 1 jstack
      echo "************ END  zombies jstack extract"
      JIRA_COMMENT="$JIRA_COMMENT

     {color:red}-1 core zombie tests{color}.  There are ${ZOMBIE_TESTS_COUNT} zombie test(s):
${ZB_STACK}"
      BAD=1
      jps | grep surefirebooter | cut -d ' ' -f 1 | xargs kill -9
    else
      echo "We're ok: there is no zombie test, but some tests took some time to stop"
    fi
  else
    echo "We're ok: there is no zombie test"
  fi
[HBase-TRUNK] $ /bin/bash -xe /tmp/hudson4139556357608391071.sh
++ jps
++ grep surefirebooter
++ wc -l
+ ZOMBIE_TESTS_COUNT=1
+ [[ 1 != 0 ]]
+ echo 'Suspicious java process found - waiting 10s to see if there are just slow to stop'
Suspicious java process found - waiting 10s to see if there are just slow to stop
+ sleep 10
++ jps
++ grep surefirebooter
++ wc -l
+ ZOMBIE_TESTS_COUNT=1
+ [[ 1 != 0 ]]
+ echo 'There are 1 zombie tests, they should have been killed by surefire but survived'
There are 1 zombie tests, they should have been killed by surefire but survived
+ echo '************ BEGIN zombies jstack extract'
************ BEGIN zombies jstack extract
++ jps
++ grep surefirebooter
++ cut -d ' ' -f 1
++ xargs -n 1 jstack
++ grep .test
++ grep '\.java'
3202: Unable to open socket file: target process not responding or HotSpot VM not loaded
The -F option can be used when the target process is not responding
+ ZB_STACK=
POST BUILD TASK : FAILURE
END OF POST BUILD TASK : 0
Archiving artifacts
Sending artifact delta relative to HBase-TRUNK #6020
Archived 1825 artifacts
Archive block size is 32768
Received 31 blocks and 367164006 bytes
Compression is 0.3%
Took 1 min 50 sec
Recording test results
Updating HBASE-11533
Updating HBASE-7541

Mime
View raw message