hbase-builds mailing list archives

Site index · List index
Message view « Date » · « Thread »
Top « Date » · « Thread »
From Apache Jenkins Server <jenk...@builds.apache.org>
Subject Build failed in Jenkins: HBase-1.0 #558
Date Tue, 09 Dec 2014 17:54:24 GMT
See <https://builds.apache.org/job/HBase-1.0/558/changes>

Changes:

[busbey] HBASE-12661 add missing licenses.

[busbey] HBASE-12655 WALPerformanceEvaluation should only add stat gathering listener once
per WAL.

------------------------------------------
[...truncated 1796 lines...]
Running org.apache.hadoop.hbase.security.visibility.TestDefaultScanLabelGeneratorStack
Tests run: 1, Failures: 0, Errors: 0, Skipped: 0, Time elapsed: 1.535 sec - in org.apache.hadoop.hbase.security.visibility.TestDefaultScanLabelGeneratorStack
Tests run: 21, Failures: 0, Errors: 0, Skipped: 0, Time elapsed: 15.952 sec - in org.apache.hadoop.hbase.security.visibility.TestVisibilityLabelsWithDefaultVisLabelService
Running org.apache.hadoop.hbase.security.visibility.TestEnforcingScanLabelGenerator
Tests run: 1, Failures: 0, Errors: 0, Skipped: 0, Time elapsed: 1.75 sec - in org.apache.hadoop.hbase.security.visibility.TestEnforcingScanLabelGenerator
Running org.apache.hadoop.hbase.security.visibility.TestVisibilityLabelsWithDeletes
Running org.apache.hadoop.hbase.security.visibility.TestVisibilityLabelsOpWithDifferentUsersNoACL
Tests run: 1, Failures: 0, Errors: 0, Skipped: 0, Time elapsed: 2.458 sec - in org.apache.hadoop.hbase.security.visibility.TestVisibilityLabelsOpWithDifferentUsersNoACL
Running org.apache.hadoop.hbase.security.visibility.TestVisibilityWithCheckAuths
Tests run: 2, Failures: 0, Errors: 0, Skipped: 0, Time elapsed: 3.34 sec - in org.apache.hadoop.hbase.security.visibility.TestVisibilityWithCheckAuths
Running org.apache.hadoop.hbase.security.visibility.TestVisibilityLabelReplicationWithExpAsString
Tests run: 52, Failures: 0, Errors: 0, Skipped: 0, Time elapsed: 214.967 sec - in org.apache.hadoop.hbase.security.access.TestAccessController
Running org.apache.hadoop.hbase.TestGlobalMemStoreSize
Tests run: 1, Failures: 0, Errors: 0, Skipped: 0, Time elapsed: 19.517 sec - in org.apache.hadoop.hbase.security.visibility.TestVisibilityLabelReplicationWithExpAsString
Tests run: 1, Failures: 0, Errors: 0, Skipped: 0, Time elapsed: 11.552 sec - in org.apache.hadoop.hbase.TestGlobalMemStoreSize
Tests run: 37, Failures: 0, Errors: 0, Skipped: 0, Time elapsed: 44.127 sec - in org.apache.hadoop.hbase.security.visibility.TestVisibilityLabelsWithDeletes
Tests run: 9, Failures: 0, Errors: 0, Skipped: 0, Time elapsed: 281.709 sec - in org.apache.hadoop.hbase.snapshot.TestSecureExportSnapshot
Running org.apache.hadoop.hbase.TestNamespace
Running org.apache.hadoop.hbase.constraint.TestConstraint
Running org.apache.hadoop.hbase.filter.TestFuzzyRowAndColumnRangeFilter
Tests run: 1, Failures: 0, Errors: 0, Skipped: 0, Time elapsed: 2.696 sec - in org.apache.hadoop.hbase.filter.TestFuzzyRowAndColumnRangeFilter
Tests run: 5, Failures: 0, Errors: 0, Skipped: 0, Time elapsed: 5.357 sec - in org.apache.hadoop.hbase.constraint.TestConstraint
Tests run: 9, Failures: 0, Errors: 0, Skipped: 1, Time elapsed: 6.05 sec - in org.apache.hadoop.hbase.TestNamespace
Running org.apache.hadoop.hbase.filter.TestFilterWrapper
Tests run: 1, Failures: 0, Errors: 0, Skipped: 0, Time elapsed: 2.341 sec - in org.apache.hadoop.hbase.filter.TestFilterWrapper
Running org.apache.hadoop.hbase.TestHBaseTestingUtility
Running org.apache.hadoop.hbase.filter.TestColumnRangeFilter
Running org.apache.hadoop.hbase.filter.TestScanRowPrefix
Tests run: 1, Failures: 0, Errors: 0, Skipped: 0, Time elapsed: 2.382 sec - in org.apache.hadoop.hbase.filter.TestScanRowPrefix
Running org.apache.hadoop.hbase.io.encoding.TestDataBlockEncoders
Running org.apache.hadoop.hbase.filter.TestFilterWithScanLimits
Tests run: 1, Failures: 0, Errors: 0, Skipped: 0, Time elapsed: 1.84 sec - in org.apache.hadoop.hbase.filter.TestFilterWithScanLimits
Tests run: 1, Failures: 0, Errors: 0, Skipped: 0, Time elapsed: 7.622 sec - in org.apache.hadoop.hbase.filter.TestColumnRangeFilter
Running org.apache.hadoop.hbase.io.encoding.TestEncodedSeekers
Running org.apache.hadoop.hbase.io.encoding.TestChangingEncoding
Tests run: 9, Failures: 0, Errors: 0, Skipped: 0, Time elapsed: 275.968 sec - in org.apache.hadoop.hbase.snapshot.TestExportSnapshot
Running org.apache.hadoop.hbase.io.encoding.TestPrefixTree
Tests run: 1, Failures: 0, Errors: 0, Skipped: 0, Time elapsed: 1.893 sec - in org.apache.hadoop.hbase.io.encoding.TestPrefixTree
Running org.apache.hadoop.hbase.io.encoding.TestBufferedDataBlockEncoder
Tests run: 7, Failures: 0, Errors: 0, Skipped: 0, Time elapsed: 37.17 sec - in org.apache.hadoop.hbase.TestHBaseTestingUtility
Running org.apache.hadoop.hbase.io.encoding.TestLoadAndSwitchEncodeOnDisk
Tests run: 1, Failures: 0, Errors: 0, Skipped: 0, Time elapsed: 27.221 sec - in org.apache.hadoop.hbase.io.encoding.TestBufferedDataBlockEncoder
Tests run: 1, Failures: 0, Errors: 0, Skipped: 0, Time elapsed: 21.834 sec - in org.apache.hadoop.hbase.io.encoding.TestLoadAndSwitchEncodeOnDisk
Running org.apache.hadoop.hbase.io.hfile.TestScannerSelectionUsingTTL
Running org.apache.hadoop.hbase.io.hfile.TestHFileBlock
Tests run: 20, Failures: 0, Errors: 0, Skipped: 0, Time elapsed: 95.281 sec - in org.apache.hadoop.hbase.io.encoding.TestEncodedSeekers
Running org.apache.hadoop.hbase.io.hfile.TestCacheOnWrite
Tests run: 3, Failures: 0, Errors: 0, Skipped: 0, Time elapsed: 100.532 sec - in org.apache.hadoop.hbase.io.encoding.TestChangingEncoding
Running org.apache.hadoop.hbase.io.hfile.TestHFileBlockIndex
Tests run: 2, Failures: 0, Errors: 0, Skipped: 0, Time elapsed: 0.905 sec - in org.apache.hadoop.hbase.io.hfile.TestHFileBlockIndex
Running org.apache.hadoop.hbase.io.hfile.TestHFileSeek
Tests run: 6, Failures: 0, Errors: 0, Skipped: 0, Time elapsed: 63.694 sec - in org.apache.hadoop.hbase.io.hfile.TestScannerSelectionUsingTTL
Tests run: 1, Failures: 0, Errors: 0, Skipped: 0, Time elapsed: 2.285 sec - in org.apache.hadoop.hbase.io.hfile.TestHFileSeek
Running org.apache.hadoop.hbase.io.hfile.TestCacheConfig
Tests run: 6, Failures: 0, Errors: 0, Skipped: 0, Time elapsed: 1.915 sec - in org.apache.hadoop.hbase.io.hfile.TestCacheConfig
Running org.apache.hadoop.hbase.io.hfile.TestForceCacheImportantBlocks
Running org.apache.hadoop.hbase.io.TestFileLink
Tests run: 3, Failures: 0, Errors: 0, Skipped: 0, Time elapsed: 16.118 sec - in org.apache.hadoop.hbase.io.TestFileLink
Running org.apache.hadoop.hbase.procedure.TestZKProcedure
Tests run: 4, Failures: 0, Errors: 0, Skipped: 0, Time elapsed: 3 sec - in org.apache.hadoop.hbase.procedure.TestZKProcedure
Tests run: 28, Failures: 0, Errors: 0, Skipped: 0, Time elapsed: 93.229 sec - in org.apache.hadoop.hbase.io.hfile.TestHFileBlock
Running org.apache.hadoop.hbase.procedure.TestZKProcedureControllers
Running org.apache.hadoop.hbase.ipc.TestHBaseClient
Tests run: 1, Failures: 0, Errors: 0, Skipped: 0, Time elapsed: 0.386 sec - in org.apache.hadoop.hbase.ipc.TestHBaseClient
Tests run: 4, Failures: 0, Errors: 0, Skipped: 0, Time elapsed: 1.536 sec - in org.apache.hadoop.hbase.procedure.TestZKProcedureControllers
Running org.apache.hadoop.hbase.ipc.TestDelayedRpc
Running org.apache.hadoop.hbase.ipc.TestProtoBufRpc
Tests run: 1, Failures: 0, Errors: 0, Skipped: 0, Time elapsed: 1.544 sec - in org.apache.hadoop.hbase.ipc.TestProtoBufRpc
Running org.apache.hadoop.hbase.TestLocalHBaseCluster
Tests run: 4, Failures: 0, Errors: 0, Skipped: 0, Time elapsed: 3.513 sec - in org.apache.hadoop.hbase.ipc.TestDelayedRpc
Running org.apache.hadoop.hbase.TestAcidGuarantees
Tests run: 1, Failures: 0, Errors: 0, Skipped: 0, Time elapsed: 8.35 sec - in org.apache.hadoop.hbase.TestLocalHBaseCluster
Tests run: 4, Failures: 0, Errors: 0, Skipped: 0, Time elapsed: 38.778 sec - in org.apache.hadoop.hbase.io.hfile.TestForceCacheImportantBlocks
Running org.apache.hadoop.hbase.zookeeper.TestRecoverableZooKeeper
Tests run: 1, Failures: 0, Errors: 0, Skipped: 0, Time elapsed: 1.317 sec - in org.apache.hadoop.hbase.zookeeper.TestRecoverableZooKeeper
Running org.apache.hadoop.hbase.zookeeper.TestZooKeeperNodeTracker
Tests run: 3, Failures: 0, Errors: 0, Skipped: 0, Time elapsed: 1.168 sec - in org.apache.hadoop.hbase.zookeeper.TestZooKeeperNodeTracker
Running org.apache.hadoop.hbase.zookeeper.TestZKTableStateManager
Tests run: 1, Failures: 0, Errors: 0, Skipped: 0, Time elapsed: 0.804 sec - in org.apache.hadoop.hbase.zookeeper.TestZKTableStateManager
Running org.apache.hadoop.hbase.zookeeper.TestZooKeeperACL
Tests run: 6, Failures: 0, Errors: 0, Skipped: 0, Time elapsed: 0.305 sec - in org.apache.hadoop.hbase.zookeeper.TestZooKeeperACL
Running org.apache.hadoop.hbase.zookeeper.TestHQuorumPeer
Tests run: 3, Failures: 0, Errors: 0, Skipped: 0, Time elapsed: 1.697 sec - in org.apache.hadoop.hbase.zookeeper.TestHQuorumPeer
Running org.apache.hadoop.hbase.zookeeper.TestZKLeaderManager
Tests run: 1, Failures: 0, Errors: 0, Skipped: 0, Time elapsed: 0.14 sec - in org.apache.hadoop.hbase.zookeeper.TestZKLeaderManager
Running org.apache.hadoop.hbase.zookeeper.TestZKMulti
Tests run: 6, Failures: 0, Errors: 0, Skipped: 0, Time elapsed: 0.352 sec - in org.apache.hadoop.hbase.zookeeper.TestZKMulti
Running org.apache.hadoop.hbase.zookeeper.lock.TestZKInterProcessReadWriteLock
Running org.apache.hadoop.hbase.TestJMXListener
Tests run: 6, Failures: 0, Errors: 0, Skipped: 0, Time elapsed: 24.458 sec - in org.apache.hadoop.hbase.zookeeper.lock.TestZKInterProcessReadWriteLock
Tests run: 2, Failures: 0, Errors: 0, Skipped: 0, Time elapsed: 16.526 sec - in org.apache.hadoop.hbase.TestJMXListener
Running org.apache.hadoop.hbase.TestMetaTableAccessorNoCluster
Tests run: 2, Failures: 0, Errors: 0, Skipped: 0, Time elapsed: 3.837 sec - in org.apache.hadoop.hbase.TestMetaTableAccessorNoCluster
Running org.apache.hadoop.hbase.TestZooKeeper
Running org.apache.hadoop.hbase.replication.regionserver.TestReplicationWALReaderManager
Tests run: 72, Failures: 0, Errors: 0, Skipped: 0, Time elapsed: 119.194 sec - in org.apache.hadoop.hbase.io.hfile.TestCacheOnWrite
Running org.apache.hadoop.hbase.replication.regionserver.TestReplicationSink
Tests run: 5, Failures: 0, Errors: 0, Skipped: 0, Time elapsed: 2.414 sec - in org.apache.hadoop.hbase.replication.regionserver.TestReplicationSink
Running org.apache.hadoop.hbase.replication.regionserver.TestReplicationSourceManager
Tests run: 4, Failures: 0, Errors: 0, Skipped: 0, Time elapsed: 3.473 sec - in org.apache.hadoop.hbase.replication.regionserver.TestReplicationSourceManager
Running org.apache.hadoop.hbase.replication.TestReplicationTrackerZKImpl
Tests run: 5, Failures: 0, Errors: 0, Skipped: 0, Time elapsed: 1.129 sec - in org.apache.hadoop.hbase.replication.TestReplicationTrackerZKImpl
Tests run: 3, Failures: 0, Errors: 0, Skipped: 0, Time elapsed: 96.568 sec - in org.apache.hadoop.hbase.TestAcidGuarantees
Running org.apache.hadoop.hbase.replication.TestReplicationKillMasterRSCompressed
Tests run: 28, Failures: 0, Errors: 0, Skipped: 0, Time elapsed: 260.95 sec - in org.apache.hadoop.hbase.io.encoding.TestDataBlockEncoders
Running org.apache.hadoop.hbase.replication.TestMultiSlaveReplication
Running org.apache.hadoop.hbase.replication.TestReplicationKillMasterRS
Tests run: 1, Failures: 0, Errors: 0, Skipped: 0, Time elapsed: 13.768 sec - in org.apache.hadoop.hbase.replication.TestReplicationKillMasterRSCompressed
Tests run: 1, Failures: 0, Errors: 0, Skipped: 0, Time elapsed: 18.519 sec - in org.apache.hadoop.hbase.replication.TestReplicationKillMasterRS
Running org.apache.hadoop.hbase.replication.TestReplicationChangingPeerRegionservers
Tests run: 1, Failures: 0, Errors: 0, Skipped: 0, Time elapsed: 26.908 sec - in org.apache.hadoop.hbase.replication.TestMultiSlaveReplication
Tests run: 1, Failures: 0, Errors: 0, Skipped: 0, Time elapsed: 5.458 sec - in org.apache.hadoop.hbase.replication.TestReplicationChangingPeerRegionservers
Running org.apache.hadoop.hbase.replication.TestReplicationKillSlaveRS
Running org.apache.hadoop.hbase.replication.TestPerTableCFReplication
Running org.apache.hadoop.hbase.replication.TestReplicationDisableInactivePeer
Tests run: 1, Failures: 0, Errors: 0, Skipped: 0, Time elapsed: 14.144 sec - in org.apache.hadoop.hbase.replication.TestReplicationKillSlaveRS
Running org.apache.hadoop.hbase.replication.TestMasterReplication
Tests run: 1, Failures: 0, Errors: 0, Skipped: 0, Time elapsed: 20.458 sec - in org.apache.hadoop.hbase.replication.TestReplicationDisableInactivePeer
Tests run: 2, Failures: 0, Errors: 0, Skipped: 0, Time elapsed: 25.427 sec - in org.apache.hadoop.hbase.replication.TestPerTableCFReplication
Running org.apache.hadoop.hbase.replication.TestReplicationWithTags
Tests run: 1, Failures: 0, Errors: 0, Skipped: 0, Time elapsed: 2.655 sec - in org.apache.hadoop.hbase.replication.TestReplicationWithTags
Running org.apache.hadoop.hbase.replication.TestReplicationEndpoint
Tests run: 3, Failures: 0, Errors: 0, Skipped: 0, Time elapsed: 2.765 sec - in org.apache.hadoop.hbase.replication.TestReplicationEndpoint
Running org.apache.hadoop.hbase.replication.TestReplicationSource
Tests run: 1, Failures: 0, Errors: 0, Skipped: 0, Time elapsed: 0.436 sec - in org.apache.hadoop.hbase.replication.TestReplicationSource
Running org.apache.hadoop.hbase.replication.TestReplicationSmallTests
Tests run: 11, Failures: 0, Errors: 0, Skipped: 0, Time elapsed: 157.83 sec - in org.apache.hadoop.hbase.TestZooKeeper
Running org.apache.hadoop.hbase.replication.TestReplicationStateZKImpl
Tests run: 6, Failures: 0, Errors: 0, Skipped: 0, Time elapsed: 0.831 sec - in org.apache.hadoop.hbase.replication.TestReplicationStateZKImpl
Running org.apache.hadoop.hbase.fs.TestBlockReorder
Running org.apache.hadoop.hbase.replication.TestReplicationSyncUpTool
Tests run: 3, Failures: 0, Errors: 0, Skipped: 0, Time elapsed: 57.895 sec - in org.apache.hadoop.hbase.replication.TestMasterReplication
Running org.apache.hadoop.hbase.trace.TestHTraceHooks
Tests run: 1, Failures: 0, Errors: 0, Skipped: 0, Time elapsed: 2.273 sec - in org.apache.hadoop.hbase.trace.TestHTraceHooks
Tests run: 3, Failures: 0, Errors: 0, Skipped: 0, Time elapsed: 19.132 sec - in org.apache.hadoop.hbase.fs.TestBlockReorder
Running org.apache.hadoop.hbase.TestMetaTableLocator
Tests run: 7, Failures: 0, Errors: 0, Skipped: 0, Time elapsed: 3.307 sec - in org.apache.hadoop.hbase.TestMetaTableLocator
Running org.apache.hadoop.hbase.mapred.TestTableSnapshotInputFormat
Tests run: 9, Failures: 0, Errors: 0, Skipped: 0, Time elapsed: 43.452 sec - in org.apache.hadoop.hbase.replication.TestReplicationSmallTests
Running org.apache.hadoop.hbase.mapred.TestTableInputFormat
Running org.apache.hadoop.hbase.mapred.TestTableMapReduceUtil
Tests run: 10, Failures: 0, Errors: 0, Skipped: 0, Time elapsed: 5.733 sec - in org.apache.hadoop.hbase.mapred.TestTableInputFormat
Tests run: 1, Failures: 0, Errors: 0, Skipped: 0, Time elapsed: 46.886 sec - in org.apache.hadoop.hbase.replication.TestReplicationSyncUpTool
Tests run: 8, Failures: 0, Errors: 0, Skipped: 0, Time elapsed: 214.015 sec - in org.apache.hadoop.hbase.replication.regionserver.TestReplicationWALReaderManager
Running org.apache.hadoop.hbase.TestMetaMigrationConvertingToPB
Tests run: 3, Failures: 0, Errors: 0, Skipped: 0, Time elapsed: 2.149 sec - in org.apache.hadoop.hbase.TestMetaMigrationConvertingToPB
Running org.apache.hadoop.hbase.TestMultiVersions
Tests run: 3, Failures: 0, Errors: 0, Skipped: 0, Time elapsed: 4.876 sec - in org.apache.hadoop.hbase.TestMultiVersions
Running org.apache.hadoop.hbase.mapred.TestTableMapReduce
Tests run: 4, Failures: 0, Errors: 0, Skipped: 0, Time elapsed: 90.905 sec - in org.apache.hadoop.hbase.mapred.TestTableMapReduceUtil
Tests run: 2, Failures: 0, Errors: 0, Skipped: 0, Time elapsed: 79.183 sec - in org.apache.hadoop.hbase.mapred.TestTableMapReduce
Tests run: 6, Failures: 0, Errors: 0, Skipped: 0, Time elapsed: 271.687 sec - in org.apache.hadoop.hbase.mapred.TestTableSnapshotInputFormat

Results :


Tests in error: 
  TestDefaultLoadBalancer.testBalanceCluster:118 ยป  test timed out after 60000 m...


Tests run: 2111, Failures: 0, Errors: 1, Skipped: 18

[INFO] ------------------------------------------------------------------------
[INFO] Reactor Summary:
[INFO] 
[INFO] HBase ............................................. SUCCESS [3.044s]
[INFO] HBase - Checkstyle ................................ SUCCESS [0.590s]
[INFO] HBase - Annotations ............................... SUCCESS [0.803s]
[INFO] HBase - Common .................................... SUCCESS [55.555s]
[INFO] HBase - Protocol .................................. SUCCESS [9.055s]
[INFO] HBase - Client .................................... SUCCESS [1:12.270s]
[INFO] HBase - Hadoop Compatibility ...................... SUCCESS [6.891s]
[INFO] HBase - Hadoop Two Compatibility .................. SUCCESS [5.960s]
[INFO] HBase - Prefix Tree ............................... SUCCESS [8.387s]
[INFO] HBase - Server .................................... FAILURE [1:01:55.293s]
[INFO] HBase - Testing Util .............................. SKIPPED
[INFO] HBase - Thrift .................................... SKIPPED
[INFO] HBase - Rest ...................................... SKIPPED
[INFO] HBase - Shell ..................................... SKIPPED
[INFO] HBase - Integration Tests ......................... SKIPPED
[INFO] HBase - Examples .................................. SKIPPED
[INFO] HBase - Assembly .................................. SKIPPED
[INFO] ------------------------------------------------------------------------
[INFO] BUILD FAILURE
[INFO] ------------------------------------------------------------------------
[INFO] Total time: 1:04:38.676s
[INFO] Finished at: Tue Dec 09 17:52:37 UTC 2014
[INFO] Final Memory: 46M/575M
[INFO] ------------------------------------------------------------------------
[ERROR] Failed to execute goal org.apache.maven.plugins:maven-surefire-plugin:2.18:test (secondPartTestsExecution)
on project hbase-server: There are test failures.
[ERROR] 
[ERROR] Please refer to <https://builds.apache.org/job/HBase-1.0/ws/hbase-server/target/surefire-reports>
for the individual test results.
[ERROR] -> [Help 1]
[ERROR] 
[ERROR] To see the full stack trace of the errors, re-run Maven with the -e switch.
[ERROR] Re-run Maven using the -X switch to enable full debug logging.
[ERROR] 
[ERROR] For more information about the errors and possible solutions, please read the following
articles:
[ERROR] [Help 1] http://cwiki.apache.org/confluence/display/MAVEN/MojoFailureException
[ERROR] 
[ERROR] After correcting the problems, you can resume the build with the command
[ERROR]   mvn <goals> -rf :hbase-server
Build step 'Invoke top-level Maven targets' marked build as failure
Performing Post build task...
Match found for :.* : True
Logical operation result is TRUE
Running script  :   ZOMBIE_TESTS_COUNT=`jps | grep surefirebooter | wc -l`
  if [[ $ZOMBIE_TESTS_COUNT != 0 ]] ; then
    #It seems sometimes the tests are not dying immediately. Let's give them 10s
    echo "Suspicious java process found - waiting 10s to see if there are just slow to stop"
    sleep 10   
    ZOMBIE_TESTS_COUNT=`jps | grep surefirebooter | wc -l`
    if [[ $ZOMBIE_TESTS_COUNT != 0 ]] ; then
      echo "There are $ZOMBIE_TESTS_COUNT zombie tests, they should have been killed by surefire
but survived"
      echo "************ BEGIN zombies jstack extract"
      ZB_STACK=`jps | grep surefirebooter | cut -d ' ' -f 1 | xargs -n 1 jstack | grep ".test"
| grep "\.java"`
      jps | grep surefirebooter | cut -d ' ' -f 1 | xargs -n 1 jstack
      echo "************ END  zombies jstack extract"
      JIRA_COMMENT="$JIRA_COMMENT

     {color:red}-1 core zombie tests{color}.  There are ${ZOMBIE_TESTS_COUNT} zombie test(s):
${ZB_STACK}"
      BAD=1
      jps | grep surefirebooter | cut -d ' ' -f 1 | xargs kill -9
    else
      echo "We're ok: there is no zombie test, but some tests took some time to stop"
    fi
  else
    echo "We're ok: there is no zombie test"
  fi
[HBase-1.0] $ /bin/bash -xe /tmp/hudson6457267235693110336.sh
++ jps
++ grep surefirebooter
++ wc -l
+ ZOMBIE_TESTS_COUNT=0
+ [[ 0 != 0 ]]
+ echo 'We'\''re ok: there is no zombie test'
We're ok: there is no zombie test
POST BUILD TASK : SUCCESS
END OF POST BUILD TASK : 0
Archiving artifacts
Sending artifact delta relative to HBase-1.0 #556
Archived 1825 artifacts
Archive block size is 32768
Received 26 blocks and 356757179 bytes
Compression is 0.2%
Took 1 min 19 sec
Recording test results
Updating HBASE-12661
Updating HBASE-12655

Mime
View raw message