hbase-builds mailing list archives

Site index · List index
Message view « Date » · « Thread »
Top « Date » · « Thread »
From Apache Jenkins Server <jenk...@builds.apache.org>
Subject Build failed in Jenkins: HBase-1.0 #596
Date Thu, 18 Dec 2014 03:01:41 GMT
See <https://builds.apache.org/job/HBase-1.0/596/changes>

Changes:

[jxiang] HBASE-12640 Add Thrift-over-HTTPS and doAs support for Thrift Server -- ADDENDUM

------------------------------------------
[...truncated 1938 lines...]
[INFO] 
[INFO] --- maven-jar-plugin:2.4:test-jar (default) @ hbase-server ---
[INFO] Building jar: <https://builds.apache.org/job/HBase-1.0/ws/hbase-server/target/hbase-server-1.0.0-SNAPSHOT-tests.jar>
[INFO] 
[INFO] --- maven-source-plugin:2.2.1:jar-no-fork (attach-sources) @ hbase-server ---
[INFO] Building jar: <https://builds.apache.org/job/HBase-1.0/ws/hbase-server/target/hbase-server-1.0.0-SNAPSHOT-sources.jar>
[INFO] 
[INFO] --- jacoco-maven-plugin:0.6.2.201302030002:report (report) @ hbase-server ---
[INFO] Skipping JaCoCo execution
[INFO] 
[INFO] --- maven-jar-plugin:2.4:jar (default-jar) @ hbase-server ---
[INFO] Building jar: <https://builds.apache.org/job/HBase-1.0/ws/hbase-server/target/hbase-server-1.0.0-SNAPSHOT.jar>
[INFO] 
[INFO] --- maven-install-plugin:2.3.1:install (default-install) @ hbase-server ---
[INFO] Installing <https://builds.apache.org/job/HBase-1.0/ws/hbase-server/target/hbase-server-1.0.0-SNAPSHOT.jar>
to /home/jenkins/.m2/repository/org/apache/hbase/hbase-server/1.0.0-SNAPSHOT/hbase-server-1.0.0-SNAPSHOT.jar
[INFO] Installing <https://builds.apache.org/job/HBase-1.0/ws/hbase-server/pom.xml>
to /home/jenkins/.m2/repository/org/apache/hbase/hbase-server/1.0.0-SNAPSHOT/hbase-server-1.0.0-SNAPSHOT.pom
[INFO] Installing <https://builds.apache.org/job/HBase-1.0/ws/hbase-server/target/hbase-server-1.0.0-SNAPSHOT-tests.jar>
to /home/jenkins/.m2/repository/org/apache/hbase/hbase-server/1.0.0-SNAPSHOT/hbase-server-1.0.0-SNAPSHOT-tests.jar
[INFO] Installing <https://builds.apache.org/job/HBase-1.0/ws/hbase-server/target/hbase-server-1.0.0-SNAPSHOT-sources.jar>
to /home/jenkins/.m2/repository/org/apache/hbase/hbase-server/1.0.0-SNAPSHOT/hbase-server-1.0.0-SNAPSHOT-sources.jar
[INFO]                                                                         
[INFO] ------------------------------------------------------------------------
[INFO] Building HBase - Testing Util 1.0.0-SNAPSHOT
[INFO] ------------------------------------------------------------------------
[INFO] 
[INFO] --- maven-enforcer-plugin:1.0.1:enforce (enforce) @ hbase-testing-util ---
[INFO] 
[INFO] --- jacoco-maven-plugin:0.6.2.201302030002:prepare-agent (prepare-agent) @ hbase-testing-util
---
[INFO] Skipping JaCoCo execution
[INFO] argLine set to 
[INFO] 
[INFO] --- maven-remote-resources-plugin:1.4:process (default) @ hbase-testing-util ---
[INFO] 
[INFO] --- maven-resources-plugin:2.6:resources (default-resources) @ hbase-testing-util ---
[INFO] Using 'UTF-8' encoding to copy filtered resources.
[INFO] skip non existing resourceDirectory <https://builds.apache.org/job/HBase-1.0/ws/hbase-testing-util/src/main/resources>
[INFO] Copying 3 resources
[INFO] 
[INFO] --- maven-compiler-plugin:2.5.1:compile (default-compile) @ hbase-testing-util ---
[INFO] No sources to compile
[INFO] 
[INFO] --- maven-resources-plugin:2.6:testResources (default-testResources) @ hbase-testing-util
---
[INFO] Using 'UTF-8' encoding to copy filtered resources.
[INFO] skip non existing resourceDirectory <https://builds.apache.org/job/HBase-1.0/ws/hbase-testing-util/src/test/resources>
[INFO] Copying 3 resources
[INFO] 
[INFO] --- maven-compiler-plugin:2.5.1:testCompile (default-testCompile) @ hbase-testing-util
---
[INFO] No sources to compile
[INFO] 
[INFO] --- maven-surefire-plugin:2.18:test (default-test) @ hbase-testing-util ---
[INFO] 
[INFO] --- maven-surefire-plugin:2.18:test (secondPartTestsExecution) @ hbase-testing-util
---
[INFO] 
[INFO] --- jacoco-maven-plugin:0.6.2.201302030002:report (report) @ hbase-testing-util ---
[INFO] Skipping JaCoCo execution
[INFO] 
[INFO] --- maven-jar-plugin:2.4:test-jar (default) @ hbase-testing-util ---
[INFO] Building jar: <https://builds.apache.org/job/HBase-1.0/ws/hbase-testing-util/target/hbase-testing-util-1.0.0-SNAPSHOT-tests.jar>
[INFO] 
[INFO] --- maven-jar-plugin:2.4:jar (default-jar) @ hbase-testing-util ---
[INFO] Building jar: <https://builds.apache.org/job/HBase-1.0/ws/hbase-testing-util/target/hbase-testing-util-1.0.0-SNAPSHOT.jar>
[INFO] 
[INFO] --- maven-install-plugin:2.3.1:install (default-install) @ hbase-testing-util ---
[INFO] Installing <https://builds.apache.org/job/HBase-1.0/ws/hbase-testing-util/target/hbase-testing-util-1.0.0-SNAPSHOT.jar>
to /home/jenkins/.m2/repository/org/apache/hbase/hbase-testing-util/1.0.0-SNAPSHOT/hbase-testing-util-1.0.0-SNAPSHOT.jar
[INFO] Installing <https://builds.apache.org/job/HBase-1.0/ws/hbase-testing-util/pom.xml>
to /home/jenkins/.m2/repository/org/apache/hbase/hbase-testing-util/1.0.0-SNAPSHOT/hbase-testing-util-1.0.0-SNAPSHOT.pom
[INFO] Installing <https://builds.apache.org/job/HBase-1.0/ws/hbase-testing-util/target/hbase-testing-util-1.0.0-SNAPSHOT-tests.jar>
to /home/jenkins/.m2/repository/org/apache/hbase/hbase-testing-util/1.0.0-SNAPSHOT/hbase-testing-util-1.0.0-SNAPSHOT-tests.jar
[INFO]                                                                         
[INFO] ------------------------------------------------------------------------
[INFO] Building HBase - Thrift 1.0.0-SNAPSHOT
[INFO] ------------------------------------------------------------------------
[INFO] 
[INFO] --- maven-enforcer-plugin:1.0.1:enforce (enforce) @ hbase-thrift ---
[INFO] 
[INFO] --- jacoco-maven-plugin:0.6.2.201302030002:prepare-agent (prepare-agent) @ hbase-thrift
---
[INFO] Skipping JaCoCo execution
[INFO] argLine set to 
[INFO] 
[INFO] --- maven-antrun-plugin:1.6:run (generate) @ hbase-thrift ---
[INFO] Executing tasks

main:
    [mkdir] Created dir: <https://builds.apache.org/job/HBase-1.0/ws/hbase-thrift/target/hbase-webapps>
     [copy] Copying 17 files to <https://builds.apache.org/job/HBase-1.0/ws/hbase-thrift/target/hbase-webapps>
log4j:WARN No appenders could be found for logger (org.mortbay.log).
log4j:WARN Please initialize the log4j system properly.
log4j:WARN See http://logging.apache.org/log4j/1.2/faq.html#noconfig for more info.
    [mkdir] Created dir: <https://builds.apache.org/job/HBase-1.0/ws/hbase-thrift/target/hbase-webapps/thrift/WEB-INF>
[INFO] Executed tasks
[INFO] 
[INFO] --- build-helper-maven-plugin:1.9.1:add-source (jspcSource-packageInfo-source) @ hbase-thrift
---
[INFO] Source directory: <https://builds.apache.org/job/HBase-1.0/ws/hbase-thrift/target/generated-sources/java>
added.
[INFO] 
[INFO] --- maven-remote-resources-plugin:1.4:process (default) @ hbase-thrift ---
[INFO] 
[INFO] --- maven-resources-plugin:2.6:resources (default-resources) @ hbase-thrift ---
[INFO] Using 'UTF-8' encoding to copy filtered resources.
[INFO] Copying 18 resources
[INFO] Copying 3 resources
[INFO] 
[INFO] --- maven-compiler-plugin:2.5.1:compile (default-compile) @ hbase-thrift ---
[INFO] Compiling 50 source files to <https://builds.apache.org/job/HBase-1.0/ws/hbase-thrift/target/classes>
[INFO] 
[INFO] --- maven-dependency-plugin:2.1:build-classpath (create-mrapp-generated-classpath)
@ hbase-thrift ---
[INFO] Wrote classpath file '<https://builds.apache.org/job/HBase-1.0/ws/hbase-thrift/target/test-classes/mrapp-generated-classpath'.>
[INFO] 
[INFO] --- maven-resources-plugin:2.6:testResources (default-testResources) @ hbase-thrift
---
[INFO] Using 'UTF-8' encoding to copy filtered resources.
[INFO] skip non existing resourceDirectory <https://builds.apache.org/job/HBase-1.0/ws/hbase-thrift/src/test/resources>
[INFO] Copying 3 resources
[INFO] 
[INFO] --- maven-compiler-plugin:2.5.1:testCompile (default-testCompile) @ hbase-thrift ---
[INFO] Compiling 6 source files to <https://builds.apache.org/job/HBase-1.0/ws/hbase-thrift/target/test-classes>
[INFO] 
[INFO] --- maven-surefire-plugin:2.18:test (default-test) @ hbase-thrift ---
[INFO] Surefire report directory: <https://builds.apache.org/job/HBase-1.0/ws/hbase-thrift/target/surefire-reports>
[INFO] Using configured provider org.apache.maven.surefire.junitcore.JUnitCoreProvider
[INFO] parallel='none', perCoreThreadCount=true, threadCount=0, useUnlimitedThreads=false,
threadCountSuites=0, threadCountClasses=0, threadCountMethods=0, parallelOptimized=true

-------------------------------------------------------
 T E S T S
-------------------------------------------------------
Running org.apache.hadoop.hbase.thrift2.TestThriftHBaseServiceHandler
Tests run: 21, Failures: 0, Errors: 0, Skipped: 0, Time elapsed: 8.95 sec - in org.apache.hadoop.hbase.thrift2.TestThriftHBaseServiceHandler
Running org.apache.hadoop.hbase.thrift2.TestThriftHBaseServiceHandlerWithLabels
Tests run: 6, Failures: 0, Errors: 0, Skipped: 0, Time elapsed: 8.572 sec - in org.apache.hadoop.hbase.thrift2.TestThriftHBaseServiceHandlerWithLabels
Running org.apache.hadoop.hbase.thrift.TestCallQueue
Tests run: 18, Failures: 0, Errors: 0, Skipped: 0, Time elapsed: 0.292 sec - in org.apache.hadoop.hbase.thrift.TestCallQueue
Running org.apache.hadoop.hbase.thrift.TestThriftHttpServer
Tests run: 1, Failures: 0, Errors: 1, Skipped: 0, Time elapsed: 9.556 sec <<< FAILURE!
- in org.apache.hadoop.hbase.thrift.TestThriftHttpServer
testRunThriftServer(org.apache.hadoop.hbase.thrift.TestThriftHttpServer)  Time elapsed: 1.051
sec  <<< ERROR!
java.lang.Exception: IOError(message:org.apache.hadoop.hbase.DoNotRetryIOException: Table
should have at least one column family Set hbase.table.sanity.checks at conf or table descriptor
if you want to bypass sanity checks
	at org.apache.hadoop.hbase.master.HMaster.sanityCheckTableDescriptor(HMaster.java:1346)
	at org.apache.hadoop.hbase.master.HMaster.createTable(HMaster.java:1267)
	at org.apache.hadoop.hbase.master.MasterRpcServices.createTable(MasterRpcServices.java:399)
	at org.apache.hadoop.hbase.protobuf.generated.MasterProtos$MasterService$2.callBlockingMethod(MasterProtos.java:42436)
	at org.apache.hadoop.hbase.ipc.RpcServer.call(RpcServer.java:2028)
	at org.apache.hadoop.hbase.ipc.CallRunner.run(CallRunner.java:108)
	at org.apache.hadoop.hbase.ipc.RpcExecutor.consumerLoop(RpcExecutor.java:112)
	at org.apache.hadoop.hbase.ipc.RpcExecutor$1.run(RpcExecutor.java:92)
	at java.lang.Thread.run(Thread.java:724)
)
	at org.apache.hadoop.hbase.thrift.generated.Hbase$createTable_result$createTable_resultStandardScheme.read(Hbase.java:12335)
	at org.apache.hadoop.hbase.thrift.generated.Hbase$createTable_result$createTable_resultStandardScheme.read(Hbase.java:12321)
	at org.apache.hadoop.hbase.thrift.generated.Hbase$createTable_result.read(Hbase.java:12255)
	at org.apache.thrift.TServiceClient.receiveBase(TServiceClient.java:78)
	at org.apache.hadoop.hbase.thrift.generated.Hbase$Client.recv_createTable(Hbase.java:982)
	at org.apache.hadoop.hbase.thrift.generated.Hbase$Client.createTable(Hbase.java:968)
	at org.apache.hadoop.hbase.thrift.TestThriftServer.createTestTables(TestThriftServer.java:235)
	at org.apache.hadoop.hbase.thrift.TestThriftHttpServer.talkToThriftServer(TestThriftHttpServer.java:142)
	at org.apache.hadoop.hbase.thrift.TestThriftHttpServer.testRunThriftServer(TestThriftHttpServer.java:118)

Running org.apache.hadoop.hbase.thrift.TestThriftServer
Tests run: 1, Failures: 0, Errors: 0, Skipped: 0, Time elapsed: 49.536 sec - in org.apache.hadoop.hbase.thrift.TestThriftServer
Running org.apache.hadoop.hbase.thrift.TestThriftServerCmdLine
Tests run: 32, Failures: 0, Errors: 0, Skipped: 0, Time elapsed: 58.618 sec - in org.apache.hadoop.hbase.thrift.TestThriftServerCmdLine

Results :


Tests in error: 
  TestThriftHttpServer.testRunThriftServer:127  IOError(message:org.apache.hadoo...


Tests run: 79, Failures: 0, Errors: 1, Skipped: 0

[INFO] ------------------------------------------------------------------------
[INFO] Reactor Summary:
[INFO] 
[INFO] HBase ............................................. SUCCESS [2.959s]
[INFO] HBase - Checkstyle ................................ SUCCESS [0.599s]
[INFO] HBase - Annotations ............................... SUCCESS [0.802s]
[INFO] HBase - Common .................................... SUCCESS [56.838s]
[INFO] HBase - Protocol .................................. SUCCESS [8.952s]
[INFO] HBase - Client .................................... SUCCESS [1:13.447s]
[INFO] HBase - Hadoop Compatibility ...................... SUCCESS [6.942s]
[INFO] HBase - Hadoop Two Compatibility .................. SUCCESS [5.899s]
[INFO] HBase - Prefix Tree ............................... SUCCESS [8.142s]
[INFO] HBase - Server .................................... SUCCESS [1:04:06.526s]
[INFO] HBase - Testing Util .............................. SUCCESS [0.934s]
[INFO] HBase - Thrift .................................... FAILURE [3:06.857s]
[INFO] HBase - Rest ...................................... SKIPPED
[INFO] HBase - Shell ..................................... SKIPPED
[INFO] HBase - Integration Tests ......................... SKIPPED
[INFO] HBase - Examples .................................. SKIPPED
[INFO] HBase - Assembly .................................. SKIPPED
[INFO] ------------------------------------------------------------------------
[INFO] BUILD FAILURE
[INFO] ------------------------------------------------------------------------
[INFO] Total time: 1:09:59.671s
[INFO] Finished at: Thu Dec 18 02:59:33 UTC 2014
[INFO] Final Memory: 62M/1057M
[INFO] ------------------------------------------------------------------------
[ERROR] Failed to execute goal org.apache.maven.plugins:maven-surefire-plugin:2.18:test (default-test)
on project hbase-thrift: There are test failures.
[ERROR] 
[ERROR] Please refer to <https://builds.apache.org/job/HBase-1.0/ws/hbase-thrift/target/surefire-reports>
for the individual test results.
[ERROR] -> [Help 1]
[ERROR] 
[ERROR] To see the full stack trace of the errors, re-run Maven with the -e switch.
[ERROR] Re-run Maven using the -X switch to enable full debug logging.
[ERROR] 
[ERROR] For more information about the errors and possible solutions, please read the following
articles:
[ERROR] [Help 1] http://cwiki.apache.org/confluence/display/MAVEN/MojoFailureException
[ERROR] 
[ERROR] After correcting the problems, you can resume the build with the command
[ERROR]   mvn <goals> -rf :hbase-thrift
Build step 'Invoke top-level Maven targets' marked build as failure
Performing Post build task...
Match found for :.* : True
Logical operation result is TRUE
Running script  :   ZOMBIE_TESTS_COUNT=`jps | grep surefirebooter | wc -l`
  if [[ $ZOMBIE_TESTS_COUNT != 0 ]] ; then
    #It seems sometimes the tests are not dying immediately. Let's give them 10s
    echo "Suspicious java process found - waiting 10s to see if there are just slow to stop"
    sleep 10   
    ZOMBIE_TESTS_COUNT=`jps | grep surefirebooter | wc -l`
    if [[ $ZOMBIE_TESTS_COUNT != 0 ]] ; then
      echo "There are $ZOMBIE_TESTS_COUNT zombie tests, they should have been killed by surefire
but survived"
      echo "************ BEGIN zombies jstack extract"
      ZB_STACK=`jps | grep surefirebooter | cut -d ' ' -f 1 | xargs -n 1 jstack | grep ".test"
| grep "\.java"`
      jps | grep surefirebooter | cut -d ' ' -f 1 | xargs -n 1 jstack
      echo "************ END  zombies jstack extract"
      JIRA_COMMENT="$JIRA_COMMENT

     {color:red}-1 core zombie tests{color}.  There are ${ZOMBIE_TESTS_COUNT} zombie test(s):
${ZB_STACK}"
      BAD=1
      jps | grep surefirebooter | cut -d ' ' -f 1 | xargs kill -9
    else
      echo "We're ok: there is no zombie test, but some tests took some time to stop"
    fi
  else
    echo "We're ok: there is no zombie test"
  fi
[HBase-1.0] $ /bin/bash -xe /tmp/hudson4497450814499332096.sh
++ jps
++ grep surefirebooter
++ wc -l
+ ZOMBIE_TESTS_COUNT=0
+ [[ 0 != 0 ]]
+ echo 'We'\''re ok: there is no zombie test'
We're ok: there is no zombie test
POST BUILD TASK : SUCCESS
END OF POST BUILD TASK : 0
Archiving artifacts
Sending artifact delta relative to HBase-1.0 #593
Archived 1844 artifacts
Archive block size is 32768
Received 26 blocks and 386810523 bytes
Compression is 0.2%
Took 1 min 40 sec
Recording test results
Updating HBASE-12640

Mime
View raw message