hbase-builds mailing list archives

Site index · List index
Message view « Date » · « Thread »
Top « Date » · « Thread »
From Apache Jenkins Server <jenk...@builds.apache.org>
Subject Build failed in Jenkins: HBase-0.98 #738
Date Sat, 13 Dec 2014 02:09:19 GMT
See <https://builds.apache.org/job/HBase-0.98/738/changes>

Changes:

[stack] HBASE-12373 Provide a command to list visibility labels (Jerry He)

------------------------------------------
[...truncated 1834 lines...]
[ERROR] To see the full stack trace of the errors, re-run Maven with the -e switch.
[ERROR] Re-run Maven using the -X switch to enable full debug logging.
[ERROR] 
[ERROR] For more information about the errors and possible solutions, please read the following
articles:
[ERROR] [Help 1] http://cwiki.apache.org/confluence/display/MAVEN/MojoFailureException
[ERROR] 
[ERROR] After correcting the problems, you can resume the build with the command
[ERROR]   mvn <goals> -rf :hbase-server
Build step 'Invoke top-level Maven targets' marked build as failure
Performing Post build task...
Match found for :.* : True
Logical operation result is TRUE
Running script  :   ZOMBIE_TESTS_COUNT=`jps | grep surefirebooter | wc -l`
  if [[ $ZOMBIE_TESTS_COUNT != 0 ]] ; then
    #It seems sometimes the tests are not dying immediately. Let's give them 10s
    echo "Suspicious java process found - waiting 10s to see if there are just slow to stop"
    sleep 10   
    ZOMBIE_TESTS_COUNT=`jps | grep surefirebooter | wc -l`
    if [[ $ZOMBIE_TESTS_COUNT != 0 ]] ; then
      echo "There are $ZOMBIE_TESTS_COUNT zombie tests, they should have been killed by surefire
but survived"
      echo "************ BEGIN zombies jstack extract"
      ZB_STACK=`jps | grep surefirebooter | cut -d ' ' -f 1 | xargs -n 1 jstack | grep ".test"
| grep "\.java"`
      jps | grep surefirebooter | cut -d ' ' -f 1 | xargs -n 1 jstack
      echo "************ END  zombies jstack extract"
      JIRA_COMMENT="$JIRA_COMMENT

     {color:red}-1 core zombie tests{color}.  There are ${ZOMBIE_TESTS_COUNT} zombie test(s):
${ZB_STACK}"
      BAD=1
      jps | grep surefirebooter | cut -d ' ' -f 1 | xargs kill -9
    else
      echo "We're ok: there is no zombie test, but some tests took some time to stop"
    fi
  else
    echo "We're ok: there is no zombie test"
  fi
[HBase-0.98] $ /bin/bash -xe /tmp/hudson2974478520110557552.sh
++ jps
++ grep surefirebooter
++ wc -l
+ ZOMBIE_TESTS_COUNT=1
+ [[ 1 != 0 ]]
+ echo 'Suspicious java process found - waiting 10s to see if there are just slow to stop'
Suspicious java process found - waiting 10s to see if there are just slow to stop
+ sleep 10
++ jps
++ grep surefirebooter
++ wc -l
+ ZOMBIE_TESTS_COUNT=1
+ [[ 1 != 0 ]]
+ echo 'There are 1 zombie tests, they should have been killed by surefire but survived'
There are 1 zombie tests, they should have been killed by surefire but survived
+ echo '************ BEGIN zombies jstack extract'
************ BEGIN zombies jstack extract
++ jps
++ grep surefirebooter
++ xargs -n 1 jstack
++ grep '\.java'
++ grep .test
++ cut -d ' ' -f 1
+ ZB_STACK='	at org.apache.ambari.server.agent.TestHeartbeatHandler.testLiveStatusUpdateAfterStopFailed(TestHeartbeatHandler.java:711)'
+ jps
+ grep surefirebooter
+ cut -d ' ' -f 1
+ xargs -n 1 jstack
2014-12-13 02:07:40
Full thread dump Java HotSpot(TM) Server VM (23.25-b01 mixed mode):

"Attach Listener" daemon prio=10 tid=0xaa500800 nid=0x5d2 waiting on condition [0x00000000]
   java.lang.Thread.State: RUNNABLE

"derby.rawStoreDaemon" daemon prio=10 tid=0xa63cc000 nid=0x1c5 in Object.wait() [0xa9d7d000]
   java.lang.Thread.State: TIMED_WAITING (on object monitor)
	at java.lang.Object.wait(Native Method)
	- waiting on <0xb3cfe330> (a org.apache.derby.impl.services.daemon.BasicDaemon)
	at org.apache.derby.impl.services.daemon.BasicDaemon.rest(Unknown Source)
	- locked <0xb3cfe330> (a org.apache.derby.impl.services.daemon.BasicDaemon)
	at org.apache.derby.impl.services.daemon.BasicDaemon.run(Unknown Source)
	at java.lang.Thread.run(Thread.java:724)

"Timer-0" daemon prio=10 tid=0xa637d400 nid=0x1b9 in Object.wait() [0xa9f7d000]
   java.lang.Thread.State: WAITING (on object monitor)
	at java.lang.Object.wait(Native Method)
	- waiting on <0xb3ea2728> (a java.util.TaskQueue)
	at java.lang.Object.wait(Object.java:503)
	at java.util.TimerThread.mainLoop(Timer.java:526)
	- locked <0xb3ea2728> (a java.util.TaskQueue)
	at java.util.TimerThread.run(Timer.java:505)

"com.google.inject.internal.util.$Finalizer" daemon prio=10 tid=0xa8fb2c00 nid=0x7f20 in Object.wait()
[0xaa168000]
   java.lang.Thread.State: WAITING (on object monitor)
	at java.lang.Object.wait(Native Method)
	- waiting on <0xb3903f38> (a java.lang.ref.ReferenceQueue$Lock)
	at java.lang.ref.ReferenceQueue.remove(ReferenceQueue.java:135)
	- locked <0xb3903f38> (a java.lang.ref.ReferenceQueue$Lock)
	at java.lang.ref.ReferenceQueue.remove(ReferenceQueue.java:151)
	at com.google.inject.internal.util.$Finalizer.run(Finalizer.java:114)

"Service Thread" daemon prio=10 tid=0xaa9f7800 nid=0x7ee4 runnable [0x00000000]
   java.lang.Thread.State: RUNNABLE

"C2 CompilerThread1" daemon prio=10 tid=0xaa9f5c00 nid=0x7ee3 waiting on condition [0x00000000]
   java.lang.Thread.State: RUNNABLE

"C2 CompilerThread0" daemon prio=10 tid=0xaa9f3c00 nid=0x7ee2 waiting on condition [0x00000000]
   java.lang.Thread.State: RUNNABLE

"Signal Dispatcher" daemon prio=10 tid=0xaa9f2000 nid=0x7ee1 runnable [0x00000000]
   java.lang.Thread.State: RUNNABLE

"Finalizer" daemon prio=10 tid=0xaa9b7000 nid=0x7eda in Object.wait() [0xaeb7d000]
   java.lang.Thread.State: WAITING (on object monitor)
	at java.lang.Object.wait(Native Method)
	- waiting on <0xb37e14c8> (a java.lang.ref.ReferenceQueue$Lock)
	at java.lang.ref.ReferenceQueue.remove(ReferenceQueue.java:135)
	- locked <0xb37e14c8> (a java.lang.ref.ReferenceQueue$Lock)
	at java.lang.ref.ReferenceQueue.remove(ReferenceQueue.java:151)
	at java.lang.ref.Finalizer$FinalizerThread.run(Finalizer.java:189)

"Reference Handler" daemon prio=10 tid=0xaa9b5400 nid=0x7ed9 in Object.wait() [0xaed7d000]
   java.lang.Thread.State: WAITING (on object monitor)
	at java.lang.Object.wait(Native Method)
	- waiting on <0xb380ee10> (a java.lang.ref.Reference$Lock)
	at java.lang.Object.wait(Object.java:503)
	at java.lang.ref.Reference$ReferenceHandler.run(Reference.java:133)
	- locked <0xb380ee10> (a java.lang.ref.Reference$Lock)

"main" prio=10 tid=0xf6806800 nid=0x7ec6 runnable [0xf695a000]
   java.lang.Thread.State: RUNNABLE
	at java.io.UnixFileSystem.getBooleanAttributes0(Native Method)
	at java.io.UnixFileSystem.getBooleanAttributes(UnixFileSystem.java:242)
	at java.io.File.isDirectory(File.java:799)
	at org.eclipse.persistence.internal.jpa.deployment.DirectoryArchive.init(DirectoryArchive.java:80)
	at org.eclipse.persistence.internal.jpa.deployment.DirectoryArchive.init(DirectoryArchive.java:96)
	at org.eclipse.persistence.internal.jpa.deployment.DirectoryArchive.init(DirectoryArchive.java:96)
	at org.eclipse.persistence.internal.jpa.deployment.DirectoryArchive.init(DirectoryArchive.java:96)
	at org.eclipse.persistence.internal.jpa.deployment.DirectoryArchive.init(DirectoryArchive.java:96)
	at org.eclipse.persistence.internal.jpa.deployment.DirectoryArchive.init(DirectoryArchive.java:96)
	at org.eclipse.persistence.internal.jpa.deployment.DirectoryArchive.init(DirectoryArchive.java:96)
	at org.eclipse.persistence.internal.jpa.deployment.DirectoryArchive.<init>(DirectoryArchive.java:74)
	at org.eclipse.persistence.internal.jpa.deployment.DirectoryArchive.<init>(DirectoryArchive.java:54)
	at org.eclipse.persistence.internal.jpa.deployment.ArchiveFactoryImpl.createArchive(ArchiveFactoryImpl.java:89)
	at org.eclipse.persistence.internal.jpa.deployment.ArchiveFactoryImpl.createArchive(ArchiveFactoryImpl.java:58)
	at org.eclipse.persistence.internal.jpa.metadata.MetadataProcessor.loadStandardMappingFiles(MetadataProcessor.java:420)
	at org.eclipse.persistence.internal.jpa.metadata.MetadataProcessor.loadMappingFiles(MetadataProcessor.java:361)
	at org.eclipse.persistence.internal.jpa.deployment.PersistenceUnitProcessor.processORMetadata(PersistenceUnitProcessor.java:540)
	at org.eclipse.persistence.internal.jpa.EntityManagerSetupImpl.predeploy(EntityManagerSetupImpl.java:1484)
	- locked <0xeb0afd58> (a org.eclipse.persistence.internal.jpa.EntityManagerSetupImpl)
	at org.eclipse.persistence.internal.jpa.deployment.JPAInitializer.callPredeploy(JPAInitializer.java:98)
	at org.eclipse.persistence.jpa.PersistenceProvider.createEntityManagerFactory(PersistenceProvider.java:108)
	- locked <0xb474fe48> (a java.util.HashMap)
	at javax.persistence.Persistence.createEntityManagerFactory(Persistence.java:78)
	at com.google.inject.persist.jpa.JpaPersistService.start(JpaPersistService.java:91)
	- locked <0xe9fc5c18> (a com.google.inject.persist.jpa.AmbariJpaPersistService)
	at com.google.inject.persist.jpa.AmbariJpaPersistService.start(AmbariJpaPersistService.java:29)
	at org.apache.ambari.server.orm.GuiceJpaInitializer.<init>(GuiceJpaInitializer.java:31)
	at org.apache.ambari.server.orm.GuiceJpaInitializer$$FastClassByGuice$$80f28a2b.newInstance(<generated>)
	at com.google.inject.internal.cglib.reflect.$FastConstructor.newInstance(FastConstructor.java:40)
	at com.google.inject.internal.DefaultConstructionProxyFactory$1.newInstance(DefaultConstructionProxyFactory.java:60)
	at com.google.inject.internal.ConstructorInjector.construct(ConstructorInjector.java:85)
	at com.google.inject.internal.ConstructorBindingImpl$Factory.get(ConstructorBindingImpl.java:254)
	at com.google.inject.internal.InjectorImpl$4$1.call(InjectorImpl.java:978)
	at com.google.inject.internal.InjectorImpl.callInContext(InjectorImpl.java:1024)
	at com.google.inject.internal.InjectorImpl$4.get(InjectorImpl.java:974)
	at com.google.inject.internal.InjectorImpl.getInstance(InjectorImpl.java:1013)
	at org.apache.ambari.server.agent.TestHeartbeatHandler.setup(TestHeartbeatHandler.java:132)
	at sun.reflect.NativeMethodAccessorImpl.invoke0(Native Method)
	at sun.reflect.NativeMethodAccessorImpl.invoke(NativeMethodAccessorImpl.java:57)
	at sun.reflect.DelegatingMethodAccessorImpl.invoke(DelegatingMethodAccessorImpl.java:43)
	at java.lang.reflect.Method.invoke(Method.java:606)
	at org.junit.runners.model.FrameworkMethod$1.runReflectiveCall(FrameworkMethod.java:45)
	at org.junit.internal.runners.model.ReflectiveCallable.run(ReflectiveCallable.java:15)
	at org.junit.runners.model.FrameworkMethod.invokeExplosively(FrameworkMethod.java:42)
	at org.junit.internal.runners.statements.RunBefores.evaluate(RunBefores.java:27)
	at org.junit.internal.runners.statements.RunAfters.evaluate(RunAfters.java:30)
	at org.junit.runners.ParentRunner.runLeaf(ParentRunner.java:263)
	at org.junit.runners.BlockJUnit4ClassRunner.runChild(BlockJUnit4ClassRunner.java:68)
	at org.junit.runners.BlockJUnit4ClassRunner.runChild(BlockJUnit4ClassRunner.java:47)
	at org.junit.runners.ParentRunner$3.run(ParentRunner.java:231)
	at org.junit.runners.ParentRunner$1.schedule(ParentRunner.java:60)
	at org.junit.runners.ParentRunner.runChildren(ParentRunner.java:229)
	at org.junit.runners.ParentRunner.access$000(ParentRunner.java:50)
	at org.junit.runners.ParentRunner$2.evaluate(ParentRunner.java:222)
	at org.junit.runners.ParentRunner.run(ParentRunner.java:300)
	at org.apache.maven.surefire.junit4.JUnit4Provider.execute(JUnit4Provider.java:236)
	at org.apache.maven.surefire.junit4.JUnit4Provider.executeTestSet(JUnit4Provider.java:134)
	at org.apache.maven.surefire.junit4.JUnit4Provider.invoke(JUnit4Provider.java:113)
	at sun.reflect.NativeMethodAccessorImpl.invoke0(Native Method)
	at sun.reflect.NativeMethodAccessorImpl.invoke(NativeMethodAccessorImpl.java:57)
	at sun.reflect.DelegatingMethodAccessorImpl.invoke(DelegatingMethodAccessorImpl.java:43)
	at java.lang.reflect.Method.invoke(Method.java:606)
	at org.apache.maven.surefire.util.ReflectionUtils.invokeMethodWithArray(ReflectionUtils.java:189)
	at org.apache.maven.surefire.booter.ProviderFactory$ProviderProxy.invoke(ProviderFactory.java:165)
	at org.apache.maven.surefire.booter.ProviderFactory.invokeProvider(ProviderFactory.java:85)
	at org.apache.maven.surefire.booter.ForkedBooter.runSuitesInProcess(ForkedBooter.java:103)
	at org.apache.maven.surefire.booter.ForkedBooter.main(ForkedBooter.java:74)

"VM Thread" prio=10 tid=0xaa8f8800 nid=0x7ed8 runnable 

"GC task thread#0 (ParallelGC)" prio=10 tid=0xf6810800 nid=0x7ec7 runnable 

"GC task thread#1 (ParallelGC)" prio=10 tid=0xf6812000 nid=0x7ec8 runnable 

"GC task thread#2 (ParallelGC)" prio=10 tid=0xf6813400 nid=0x7ec9 runnable 

"GC task thread#3 (ParallelGC)" prio=10 tid=0xf6814c00 nid=0x7eca runnable 

"GC task thread#4 (ParallelGC)" prio=10 tid=0xf6816400 nid=0x7ecb runnable 

"GC task thread#5 (ParallelGC)" prio=10 tid=0xf6817800 nid=0x7ecc runnable 

"GC task thread#6 (ParallelGC)" prio=10 tid=0xf6819000 nid=0x7ecd runnable 

"GC task thread#7 (ParallelGC)" prio=10 tid=0xf681a800 nid=0x7ece runnable 

"GC task thread#8 (ParallelGC)" prio=10 tid=0xf681bc00 nid=0x7ecf runnable 

"GC task thread#9 (ParallelGC)" prio=10 tid=0xf681d400 nid=0x7ed0 runnable 

"GC task thread#10 (ParallelGC)" prio=10 tid=0xf681ec00 nid=0x7ed1 runnable 

"GC task thread#11 (ParallelGC)" prio=10 tid=0xf6820400 nid=0x7ed2 runnable 

"GC task thread#12 (ParallelGC)" prio=10 tid=0xf6821800 nid=0x7ed3 runnable 

"VM Periodic Task Thread" prio=10 tid=0xaa9f9800 nid=0x7ee5 waiting on condition 

JNI global references: 239

+ echo '************ END  zombies jstack extract'
************ END  zombies jstack extract
+ JIRA_COMMENT='

     {color:red}-1 core zombie tests{color}.  There are 1 zombie test(s): 	at org.apache.ambari.server.agent.TestHeartbeatHandler.testLiveStatusUpdateAfterStopFailed(TestHeartbeatHandler.java:711)'
+ BAD=1
+ jps
+ grep surefirebooter
+ cut -d ' ' -f 1
+ xargs kill -9
POST BUILD TASK : SUCCESS
END OF POST BUILD TASK : 0
Archiving artifacts
Sending artifact delta relative to HBase-0.98 #735
Archived 1662 artifacts
Archive block size is 32768
Received 19 blocks and 272894587 bytes
Compression is 0.2%
Took 1 min 15 sec
Recording test results
Updating HBASE-12373

Mime
View raw message