hbase-builds mailing list archives

Site index · List index
Message view « Date » · « Thread »
Top « Date » · « Thread »
From Apache Jenkins Server <jenk...@builds.apache.org>
Subject Build failed in Jenkins: HBase-TRUNK #5940
Date Thu, 18 Dec 2014 02:15:21 GMT
See <https://builds.apache.org/job/HBase-TRUNK/5940/changes>

Changes:

[jxiang] Thrift Http implementation

[jxiang] Adding demo client

[jxiang] Revert "Thrift Http implementation"

[jxiang] Revert "Adding demo client"

[jxiang] HBASE-12640 Add Thrift-over-HTTPS and doAs support for Thrift Server

[jxiang] HBASE-12704 Add demo client which uses doAs functionality on Thrift-over-HTTPS

[jxiang] HBASE-12640 Add Thrift-over-HTTPS and doAs support for Thrift Server -- ADDENDUM

------------------------------------------
[...truncated 2168 lines...]
[WARNING] <https://builds.apache.org/job/HBase-TRUNK/ws/hbase-thrift/src/main/java/org/apache/hadoop/hbase/thrift2/generated/THBaseService.java>:[7198,1]
[EmptyStatement] Empty statement
    (see http://code.google.com/p/error-prone/wiki/EmptyStatement)
  Did you mean to remove this line?
[WARNING] <https://builds.apache.org/job/HBase-TRUNK/ws/hbase-thrift/src/main/java/org/apache/hadoop/hbase/thrift2/generated/THBaseService.java>:[8104,1]
[EmptyStatement] Empty statement
    (see http://code.google.com/p/error-prone/wiki/EmptyStatement)
  Did you mean to remove this line?
[WARNING] <https://builds.apache.org/job/HBase-TRUNK/ws/hbase-thrift/src/main/java/org/apache/hadoop/hbase/thrift2/generated/THBaseService.java>:[8963,1]
[EmptyStatement] Empty statement
    (see http://code.google.com/p/error-prone/wiki/EmptyStatement)
  Did you mean to remove this line?
[WARNING] <https://builds.apache.org/job/HBase-TRUNK/ws/hbase-thrift/src/main/java/org/apache/hadoop/hbase/thrift2/generated/THBaseService.java>:[10092,1]
[EmptyStatement] Empty statement
    (see http://code.google.com/p/error-prone/wiki/EmptyStatement)
  Did you mean to remove this line?
[WARNING] <https://builds.apache.org/job/HBase-TRUNK/ws/hbase-thrift/src/main/java/org/apache/hadoop/hbase/thrift2/generated/THBaseService.java>:[10096,1]
[EmptyStatement] Empty statement
    (see http://code.google.com/p/error-prone/wiki/EmptyStatement)
  Did you mean to remove this line?
[WARNING] <https://builds.apache.org/job/HBase-TRUNK/ws/hbase-thrift/src/main/java/org/apache/hadoop/hbase/thrift2/generated/THBaseService.java>:[10100,1]
[EmptyStatement] Empty statement
    (see http://code.google.com/p/error-prone/wiki/EmptyStatement)
  Did you mean to remove this line?
[WARNING] <https://builds.apache.org/job/HBase-TRUNK/ws/hbase-thrift/src/main/java/org/apache/hadoop/hbase/thrift2/generated/THBaseService.java>:[10104,1]
[EmptyStatement] Empty statement
    (see http://code.google.com/p/error-prone/wiki/EmptyStatement)
  Did you mean to remove this line?
[WARNING] <https://builds.apache.org/job/HBase-TRUNK/ws/hbase-thrift/src/main/java/org/apache/hadoop/hbase/thrift2/generated/THBaseService.java>:[10108,1]
[EmptyStatement] Empty statement
    (see http://code.google.com/p/error-prone/wiki/EmptyStatement)
  Did you mean to remove this line?
[WARNING] <https://builds.apache.org/job/HBase-TRUNK/ws/hbase-thrift/src/main/java/org/apache/hadoop/hbase/thrift2/generated/THBaseService.java>:[11502,1]
[EmptyStatement] Empty statement
    (see http://code.google.com/p/error-prone/wiki/EmptyStatement)
  Did you mean to remove this line?
[WARNING] <https://builds.apache.org/job/HBase-TRUNK/ws/hbase-thrift/src/main/java/org/apache/hadoop/hbase/thrift2/generated/THBaseService.java>:[12470,1]
[EmptyStatement] Empty statement
    (see http://code.google.com/p/error-prone/wiki/EmptyStatement)
  Did you mean to remove this line?
[WARNING] <https://builds.apache.org/job/HBase-TRUNK/ws/hbase-thrift/src/main/java/org/apache/hadoop/hbase/thrift2/generated/THBaseService.java>:[13438,1]
[EmptyStatement] Empty statement
    (see http://code.google.com/p/error-prone/wiki/EmptyStatement)
  Did you mean to remove this line?
[WARNING] <https://builds.apache.org/job/HBase-TRUNK/ws/hbase-thrift/src/main/java/org/apache/hadoop/hbase/thrift2/generated/THBaseService.java>:[16370,1]
[EmptyStatement] Empty statement
    (see http://code.google.com/p/error-prone/wiki/EmptyStatement)
  Did you mean to remove this line?
[WARNING] <https://builds.apache.org/job/HBase-TRUNK/ws/hbase-thrift/src/main/java/org/apache/hadoop/hbase/thrift2/generated/THBaseService.java>:[17249,1]
[EmptyStatement] Empty statement
    (see http://code.google.com/p/error-prone/wiki/EmptyStatement)
  Did you mean to remove this line?
[WARNING] <https://builds.apache.org/job/HBase-TRUNK/ws/hbase-thrift/src/main/java/org/apache/hadoop/hbase/thrift2/generated/TGet.java>:[201,1]
[EmptyStatement] Empty statement
    (see http://code.google.com/p/error-prone/wiki/EmptyStatement)
  Did you mean to remove this line?
[WARNING] <https://builds.apache.org/job/HBase-TRUNK/ws/hbase-thrift/src/main/java/org/apache/hadoop/hbase/thrift2/generated/TGet.java>:[217,1]
[EmptyStatement] Empty statement
    (see http://code.google.com/p/error-prone/wiki/EmptyStatement)
  Did you mean to remove this line?
[WARNING] <https://builds.apache.org/job/HBase-TRUNK/ws/hbase-thrift/src/main/java/org/apache/hadoop/hbase/thrift2/generated/TGet.java>:[227,1]
[EmptyStatement] Empty statement
    (see http://code.google.com/p/error-prone/wiki/EmptyStatement)
  Did you mean to remove this line?
[WARNING] <https://builds.apache.org/job/HBase-TRUNK/ws/hbase-thrift/src/main/java/org/apache/hadoop/hbase/thrift2/generated/TGet.java>:[230,1]
[EmptyStatement] Empty statement
    (see http://code.google.com/p/error-prone/wiki/EmptyStatement)
  Did you mean to remove this line?
[WARNING] <https://builds.apache.org/job/HBase-TRUNK/ws/hbase-thrift/src/main/java/org/apache/hadoop/hbase/thrift2/generated/TIncrement.java>:[180,1]
[EmptyStatement] Empty statement
    (see http://code.google.com/p/error-prone/wiki/EmptyStatement)
  Did you mean to remove this line?
[WARNING] <https://builds.apache.org/job/HBase-TRUNK/ws/hbase-thrift/src/main/java/org/apache/hadoop/hbase/thrift2/generated/TIncrement.java>:[197,1]
[EmptyStatement] Empty statement
    (see http://code.google.com/p/error-prone/wiki/EmptyStatement)
  Did you mean to remove this line?
[WARNING] <https://builds.apache.org/job/HBase-TRUNK/ws/hbase-thrift/src/main/java/org/apache/hadoop/hbase/thrift2/generated/TIncrement.java>:[200,1]
[EmptyStatement] Empty statement
    (see http://code.google.com/p/error-prone/wiki/EmptyStatement)
  Did you mean to remove this line?
[WARNING] <https://builds.apache.org/job/HBase-TRUNK/ws/hbase-thrift/src/main/java/org/apache/hadoop/hbase/thrift2/generated/TAppend.java>:[173,1]
[EmptyStatement] Empty statement
    (see http://code.google.com/p/error-prone/wiki/EmptyStatement)
  Did you mean to remove this line?
[WARNING] <https://builds.apache.org/job/HBase-TRUNK/ws/hbase-thrift/src/main/java/org/apache/hadoop/hbase/thrift2/generated/TAppend.java>:[190,1]
[EmptyStatement] Empty statement
    (see http://code.google.com/p/error-prone/wiki/EmptyStatement)
  Did you mean to remove this line?
[WARNING] <https://builds.apache.org/job/HBase-TRUNK/ws/hbase-thrift/src/main/java/org/apache/hadoop/hbase/thrift2/generated/TAppend.java>:[193,1]
[EmptyStatement] Empty statement
    (see http://code.google.com/p/error-prone/wiki/EmptyStatement)
  Did you mean to remove this line?
[WARNING] <https://builds.apache.org/job/HBase-TRUNK/ws/hbase-thrift/src/main/java/org/apache/hadoop/hbase/thrift2/generated/TScan.java>:[210,1]
[EmptyStatement] Empty statement
    (see http://code.google.com/p/error-prone/wiki/EmptyStatement)
  Did you mean to remove this line?
[WARNING] <https://builds.apache.org/job/HBase-TRUNK/ws/hbase-thrift/src/main/java/org/apache/hadoop/hbase/thrift2/generated/TScan.java>:[214,1]
[EmptyStatement] Empty statement
    (see http://code.google.com/p/error-prone/wiki/EmptyStatement)
  Did you mean to remove this line?
[WARNING] <https://builds.apache.org/job/HBase-TRUNK/ws/hbase-thrift/src/main/java/org/apache/hadoop/hbase/thrift2/generated/TScan.java>:[230,1]
[EmptyStatement] Empty statement
    (see http://code.google.com/p/error-prone/wiki/EmptyStatement)
  Did you mean to remove this line?
[WARNING] <https://builds.apache.org/job/HBase-TRUNK/ws/hbase-thrift/src/main/java/org/apache/hadoop/hbase/thrift2/generated/TScan.java>:[241,1]
[EmptyStatement] Empty statement
    (see http://code.google.com/p/error-prone/wiki/EmptyStatement)
  Did you mean to remove this line?
[WARNING] <https://builds.apache.org/job/HBase-TRUNK/ws/hbase-thrift/src/main/java/org/apache/hadoop/hbase/thrift2/generated/TScan.java>:[244,1]
[EmptyStatement] Empty statement
    (see http://code.google.com/p/error-prone/wiki/EmptyStatement)
  Did you mean to remove this line?
[INFO] <https://builds.apache.org/job/HBase-TRUNK/ws/hbase-thrift/src/main/java/org/apache/hadoop/hbase/thrift2/ThriftHBaseServiceHandler.java>:[-1,-1]
Some input files use or override a deprecated API.
[INFO] <https://builds.apache.org/job/HBase-TRUNK/ws/hbase-thrift/src/main/java/org/apache/hadoop/hbase/thrift2/ThriftHBaseServiceHandler.java>:[-1,-1]
Recompile with -Xlint:deprecation for details.
[INFO] <https://builds.apache.org/job/HBase-TRUNK/ws/hbase-thrift/src/main/java/org/apache/hadoop/hbase/thrift2/generated/TPut.java>:[-1,-1]
Some input files use unchecked or unsafe operations.
[INFO] <https://builds.apache.org/job/HBase-TRUNK/ws/hbase-thrift/src/main/java/org/apache/hadoop/hbase/thrift2/generated/TPut.java>:[-1,-1]
Recompile with -Xlint:unchecked for details.
[INFO] 
[INFO] --- maven-dependency-plugin:2.1:build-classpath (create-mrapp-generated-classpath)
@ hbase-thrift ---
[INFO] Wrote classpath file '<https://builds.apache.org/job/HBase-TRUNK/ws/hbase-thrift/target/test-classes/mrapp-generated-classpath'.>
[INFO] 
[INFO] --- maven-resources-plugin:2.6:testResources (default-testResources) @ hbase-thrift
---
[INFO] Using 'UTF-8' encoding to copy filtered resources.
[INFO] skip non existing resourceDirectory <https://builds.apache.org/job/HBase-TRUNK/ws/hbase-thrift/src/test/resources>
[INFO] Copying 3 resources
[INFO] 
[INFO] --- maven-compiler-plugin:3.2:testCompile (default-testCompile) @ hbase-thrift ---
[INFO] Compiling 7 source files to <https://builds.apache.org/job/HBase-TRUNK/ws/hbase-thrift/target/test-classes>
[WARNING] <https://builds.apache.org/job/HBase-TRUNK/ws/hbase-thrift/src/test/java/org/apache/hadoop/hbase/thrift/TestThriftServer.java>:[200,29]
[EmptyStatement] Empty statement
    (see http://code.google.com/p/error-prone/wiki/EmptyStatement)
  Did you mean 'dropTestTables(handler);'?
[INFO] <https://builds.apache.org/job/HBase-TRUNK/ws/hbase-thrift/src/test/java/org/apache/hadoop/hbase/thrift2/TestHTablePool.java>:[-1,-1]
Some input files use or override a deprecated API.
[INFO] <https://builds.apache.org/job/HBase-TRUNK/ws/hbase-thrift/src/test/java/org/apache/hadoop/hbase/thrift2/TestHTablePool.java>:[-1,-1]
Recompile with -Xlint:deprecation for details.
[INFO] 
[INFO] --- maven-surefire-plugin:2.18:test (default-test) @ hbase-thrift ---
[INFO] Surefire report directory: <https://builds.apache.org/job/HBase-TRUNK/ws/hbase-thrift/target/surefire-reports>
[INFO] Using configured provider org.apache.maven.surefire.junitcore.JUnitCoreProvider
[INFO] parallel='none', perCoreThreadCount=true, threadCount=0, useUnlimitedThreads=false,
threadCountSuites=0, threadCountClasses=0, threadCountMethods=0, parallelOptimized=true

-------------------------------------------------------
 T E S T S
-------------------------------------------------------
Running org.apache.hadoop.hbase.thrift.TestThriftHttpServer
Tests run: 1, Failures: 0, Errors: 1, Skipped: 0, Time elapsed: 9.545 sec <<< FAILURE!
- in org.apache.hadoop.hbase.thrift.TestThriftHttpServer
testRunThriftServer(org.apache.hadoop.hbase.thrift.TestThriftHttpServer)  Time elapsed: 1.192
sec  <<< ERROR!
java.lang.Exception: IOError(message:org.apache.hadoop.hbase.DoNotRetryIOException: Table
should have at least one column family Set hbase.table.sanity.checks at conf or table descriptor
if you want to bypass sanity checks
	at org.apache.hadoop.hbase.master.HMaster.sanityCheckTableDescriptor(HMaster.java:1324)
	at org.apache.hadoop.hbase.master.HMaster.createTable(HMaster.java:1245)
	at org.apache.hadoop.hbase.master.MasterRpcServices.createTable(MasterRpcServices.java:406)
	at org.apache.hadoop.hbase.protobuf.generated.MasterProtos$MasterService$2.callBlockingMethod(MasterProtos.java:45381)
	at org.apache.hadoop.hbase.ipc.RpcServer.call(RpcServer.java:2032)
	at org.apache.hadoop.hbase.ipc.CallRunner.run(CallRunner.java:108)
	at org.apache.hadoop.hbase.ipc.RpcExecutor.consumerLoop(RpcExecutor.java:112)
	at org.apache.hadoop.hbase.ipc.RpcExecutor$1.run(RpcExecutor.java:92)
	at java.lang.Thread.run(Thread.java:724)
)
	at org.apache.hadoop.hbase.thrift.generated.Hbase$createTable_result$createTable_resultStandardScheme.read(Hbase.java:12335)
	at org.apache.hadoop.hbase.thrift.generated.Hbase$createTable_result$createTable_resultStandardScheme.read(Hbase.java:12321)
	at org.apache.hadoop.hbase.thrift.generated.Hbase$createTable_result.read(Hbase.java:12255)
	at org.apache.thrift.TServiceClient.receiveBase(TServiceClient.java:78)
	at org.apache.hadoop.hbase.thrift.generated.Hbase$Client.recv_createTable(Hbase.java:982)
	at org.apache.hadoop.hbase.thrift.generated.Hbase$Client.createTable(Hbase.java:968)
	at org.apache.hadoop.hbase.thrift.TestThriftServer.createTestTables(TestThriftServer.java:236)
	at org.apache.hadoop.hbase.thrift.TestThriftHttpServer.talkToThriftServer(TestThriftHttpServer.java:143)
	at org.apache.hadoop.hbase.thrift.TestThriftHttpServer.testRunThriftServer(TestThriftHttpServer.java:119)

Running org.apache.hadoop.hbase.thrift.TestThriftServerCmdLine
Tests run: 32, Failures: 0, Errors: 0, Skipped: 0, Time elapsed: 49.694 sec - in org.apache.hadoop.hbase.thrift.TestThriftServerCmdLine
Running org.apache.hadoop.hbase.thrift.TestThriftServer
Tests run: 1, Failures: 0, Errors: 0, Skipped: 0, Time elapsed: 49.493 sec - in org.apache.hadoop.hbase.thrift.TestThriftServer
Running org.apache.hadoop.hbase.thrift.TestCallQueue
Tests run: 18, Failures: 0, Errors: 0, Skipped: 0, Time elapsed: 0.312 sec - in org.apache.hadoop.hbase.thrift.TestCallQueue
Running org.apache.hadoop.hbase.thrift2.TestHTablePool$TestHTableReusablePool
Tests run: 9, Failures: 0, Errors: 0, Skipped: 0, Time elapsed: 11.454 sec - in org.apache.hadoop.hbase.thrift2.TestHTablePool$TestHTableReusablePool
Running org.apache.hadoop.hbase.thrift2.TestHTablePool$TestHTableThreadLocalPool
Tests run: 9, Failures: 0, Errors: 0, Skipped: 0, Time elapsed: 9.765 sec - in org.apache.hadoop.hbase.thrift2.TestHTablePool$TestHTableThreadLocalPool
Running org.apache.hadoop.hbase.thrift2.TestThriftHBaseServiceHandlerWithLabels
Tests run: 6, Failures: 0, Errors: 0, Skipped: 0, Time elapsed: 8.531 sec - in org.apache.hadoop.hbase.thrift2.TestThriftHBaseServiceHandlerWithLabels
Running org.apache.hadoop.hbase.thrift2.TestThriftHBaseServiceHandler
Tests run: 21, Failures: 0, Errors: 0, Skipped: 0, Time elapsed: 8.952 sec - in org.apache.hadoop.hbase.thrift2.TestThriftHBaseServiceHandler

Results :


Tests in error: 
  TestThriftHttpServer.testRunThriftServer:128  IOError(message:org.apache.hadoo...


Tests run: 97, Failures: 0, Errors: 1, Skipped: 0

[INFO] ------------------------------------------------------------------------
[INFO] Reactor Summary:
[INFO] 
[INFO] HBase ............................................. SUCCESS [3.112s]
[INFO] HBase - Checkstyle ................................ SUCCESS [0.833s]
[INFO] HBase - Annotations ............................... SUCCESS [0.894s]
[INFO] HBase - Protocol .................................. SUCCESS [12.478s]
[INFO] HBase - Common .................................... SUCCESS [1:06.692s]
[INFO] HBase - Client .................................... SUCCESS [1:15.307s]
[INFO] HBase - Hadoop Compatibility ...................... SUCCESS [6.977s]
[INFO] HBase - Hadoop Two Compatibility .................. SUCCESS [6.250s]
[INFO] HBase - Prefix Tree ............................... SUCCESS [8.169s]
[INFO] HBase - Server .................................... SUCCESS [1:00:48.262s]
[INFO] HBase - Testing Util .............................. SUCCESS [1.361s]
[INFO] HBase - Thrift .................................... FAILURE [3:26.793s]
[INFO] HBase - Shell ..................................... SKIPPED
[INFO] HBase - Integration Tests ......................... SKIPPED
[INFO] HBase - Examples .................................. SKIPPED
[INFO] HBase - Rest ...................................... SKIPPED
[INFO] HBase - Assembly .................................. SKIPPED
[INFO] ------------------------------------------------------------------------
[INFO] BUILD FAILURE
[INFO] ------------------------------------------------------------------------
[INFO] Total time: 1:07:17.952s
[INFO] Finished at: Thu Dec 18 02:12:53 UTC 2014
[INFO] Final Memory: 71M/932M
[INFO] ------------------------------------------------------------------------
[ERROR] Failed to execute goal org.apache.maven.plugins:maven-surefire-plugin:2.18:test (default-test)
on project hbase-thrift: There are test failures.
[ERROR] 
[ERROR] Please refer to <https://builds.apache.org/job/HBase-TRUNK/ws/hbase-thrift/target/surefire-reports>
for the individual test results.
[ERROR] -> [Help 1]
[ERROR] 
[ERROR] To see the full stack trace of the errors, re-run Maven with the -e switch.
[ERROR] Re-run Maven using the -X switch to enable full debug logging.
[ERROR] 
[ERROR] For more information about the errors and possible solutions, please read the following
articles:
[ERROR] [Help 1] http://cwiki.apache.org/confluence/display/MAVEN/MojoFailureException
[ERROR] 
[ERROR] After correcting the problems, you can resume the build with the command
[ERROR]   mvn <goals> -rf :hbase-thrift
Build step 'Invoke top-level Maven targets' marked build as failure
[FINDBUGS] Skipping publisher since build result is FAILURE
Performing Post build task...
Match found for :.* : True
Logical operation result is TRUE
Running script  :   ZOMBIE_TESTS_COUNT=`jps | grep surefirebooter | wc -l`
  if [[ $ZOMBIE_TESTS_COUNT != 0 ]] ; then
    #It seems sometimes the tests are not dying immediately. Let's give them 10s
    echo "Suspicious java process found - waiting 10s to see if there are just slow to stop"
    sleep 10   
    ZOMBIE_TESTS_COUNT=`jps | grep surefirebooter | wc -l`
    if [[ $ZOMBIE_TESTS_COUNT != 0 ]] ; then
      echo "There are $ZOMBIE_TESTS_COUNT zombie tests, they should have been killed by surefire
but survived"
      echo "************ BEGIN zombies jstack extract"
      ZB_STACK=`jps | grep surefirebooter | cut -d ' ' -f 1 | xargs -n 1 jstack | grep ".test"
| grep "\.java"`
      jps | grep surefirebooter | cut -d ' ' -f 1 | xargs -n 1 jstack
      echo "************ END  zombies jstack extract"
      JIRA_COMMENT="$JIRA_COMMENT

     {color:red}-1 core zombie tests{color}.  There are ${ZOMBIE_TESTS_COUNT} zombie test(s):
${ZB_STACK}"
      BAD=1
      jps | grep surefirebooter | cut -d ' ' -f 1 | xargs kill -9
    else
      echo "We're ok: there is no zombie test, but some tests took some time to stop"
    fi
  else
    echo "We're ok: there is no zombie test"
  fi
[HBase-TRUNK] $ /bin/bash -xe /tmp/hudson7974868046038230038.sh
++ jps
++ wc -l
++ grep surefirebooter
+ ZOMBIE_TESTS_COUNT=0
+ [[ 0 != 0 ]]
+ echo 'We'\''re ok: there is no zombie test'
We're ok: there is no zombie test
POST BUILD TASK : SUCCESS
END OF POST BUILD TASK : 0
Archiving artifacts
Sending artifact delta relative to HBase-TRUNK #5939
Archived 1836 artifacts
Archive block size is 32768
Received 31 blocks and 340654625 bytes
Compression is 0.3%
Took 1 min 55 sec
Recording test results
Updating HBASE-12640
Updating HBASE-12704

Mime
View raw message