hbase-builds mailing list archives

Site index · List index
Message view « Date » · « Thread »
Top « Date » · « Thread »
From Apache Jenkins Server <jenk...@builds.apache.org>
Subject Build failed in Jenkins: HBase-TRUNK #5871
Date Fri, 05 Dec 2014 20:11:58 GMT
See <https://builds.apache.org/job/HBase-TRUNK/5871/changes>

Changes:

[stack] HBASE-12565 Race condition in HRegion.batchMutate() causes partial data to be written
when region closes

------------------------------------------
[...truncated 1828 lines...]
Running org.apache.hadoop.hbase.TestRegionRebalancing
Tests run: 1, Failures: 0, Errors: 0, Skipped: 0, Time elapsed: 12.878 sec - in org.apache.hadoop.hbase.TestGlobalMemStoreSize
Running org.apache.hadoop.hbase.security.access.TestScanEarlyTermination
Tests run: 1, Failures: 0, Errors: 0, Skipped: 0, Time elapsed: 4.379 sec - in org.apache.hadoop.hbase.security.access.TestScanEarlyTermination
Tests run: 2, Failures: 0, Errors: 0, Skipped: 0, Time elapsed: 29.501 sec - in org.apache.hadoop.hbase.TestRegionRebalancing
Running org.apache.hadoop.hbase.security.access.TestZKPermissionsWatcher
Tests run: 1, Failures: 0, Errors: 0, Skipped: 0, Time elapsed: 3.151 sec - in org.apache.hadoop.hbase.security.access.TestZKPermissionsWatcher
Running org.apache.hadoop.hbase.security.access.TestAccessControlFilter
Tests run: 1, Failures: 0, Errors: 0, Skipped: 0, Time elapsed: 3.361 sec - in org.apache.hadoop.hbase.security.access.TestAccessControlFilter
Running org.apache.hadoop.hbase.security.access.TestCellACLs
Running org.apache.hadoop.hbase.security.access.TestTablePermissions
Tests run: 2, Failures: 0, Errors: 0, Skipped: 0, Time elapsed: 10.018 sec - in org.apache.hadoop.hbase.security.access.TestCellACLs
Running org.apache.hadoop.hbase.security.access.TestCellACLWithMultipleVersions
Tests run: 21, Failures: 0, Errors: 0, Skipped: 3, Time elapsed: 144.734 sec - in org.apache.hadoop.hbase.client.TestHCM
Running org.apache.hadoop.hbase.security.access.TestNamespaceCommands
Tests run: 5, Failures: 0, Errors: 0, Skipped: 0, Time elapsed: 6.139 sec - in org.apache.hadoop.hbase.security.access.TestNamespaceCommands
Tests run: 7, Failures: 0, Errors: 0, Skipped: 0, Time elapsed: 32.292 sec - in org.apache.hadoop.hbase.security.access.TestTablePermissions
Running org.apache.hadoop.hbase.security.access.TestAccessController
Tests run: 8, Failures: 0, Errors: 0, Skipped: 0, Time elapsed: 27.5 sec - in org.apache.hadoop.hbase.security.access.TestCellACLWithMultipleVersions
Running org.apache.hadoop.hbase.security.token.TestZKSecretWatcher
Running org.apache.hadoop.hbase.security.access.TestAccessController2
Tests run: 2, Failures: 0, Errors: 0, Skipped: 0, Time elapsed: 9.829 sec - in org.apache.hadoop.hbase.security.access.TestAccessController2
Running org.apache.hadoop.hbase.security.token.TestTokenAuthentication
Tests run: 2, Failures: 0, Errors: 0, Skipped: 0, Time elapsed: 0.406 sec - in org.apache.hadoop.hbase.security.token.TestTokenAuthentication
Tests run: 1, Failures: 0, Errors: 0, Skipped: 0, Time elapsed: 13.249 sec - in org.apache.hadoop.hbase.security.token.TestZKSecretWatcher
Running org.apache.hadoop.hbase.security.visibility.TestVisibilityWithCheckAuths
Running org.apache.hadoop.hbase.security.visibility.TestEnforcingScanLabelGenerator
Tests run: 1, Failures: 0, Errors: 0, Skipped: 0, Time elapsed: 2.242 sec - in org.apache.hadoop.hbase.security.visibility.TestEnforcingScanLabelGenerator
Tests run: 2, Failures: 0, Errors: 0, Skipped: 0, Time elapsed: 3.312 sec - in org.apache.hadoop.hbase.security.visibility.TestVisibilityWithCheckAuths
Running org.apache.hadoop.hbase.security.visibility.TestVisibilityLabelsWithSLGStack
Tests run: 1, Failures: 0, Errors: 0, Skipped: 0, Time elapsed: 2.131 sec - in org.apache.hadoop.hbase.security.visibility.TestVisibilityLabelsWithSLGStack
Running org.apache.hadoop.hbase.security.visibility.TestVisibilityLabelsWithACL
Tests run: 5, Failures: 0, Errors: 0, Skipped: 0, Time elapsed: 6.393 sec - in org.apache.hadoop.hbase.security.visibility.TestVisibilityLabelsWithACL
Running org.apache.hadoop.hbase.security.visibility.TestVisibilityLabelsOpWithDifferentUsersNoACL
Tests run: 1, Failures: 0, Errors: 0, Skipped: 0, Time elapsed: 2.247 sec - in org.apache.hadoop.hbase.security.visibility.TestVisibilityLabelsOpWithDifferentUsersNoACL
Running org.apache.hadoop.hbase.security.visibility.TestVisibilityLabelsWithDistributedLogReplay
Running org.apache.hadoop.hbase.security.visibility.TestDefaultScanLabelGeneratorStack
Tests run: 1, Failures: 0, Errors: 0, Skipped: 0, Time elapsed: 2.237 sec - in org.apache.hadoop.hbase.security.visibility.TestDefaultScanLabelGeneratorStack
Tests run: 21, Failures: 0, Errors: 0, Skipped: 0, Time elapsed: 16.268 sec - in org.apache.hadoop.hbase.security.visibility.TestVisibilityLabelsWithDistributedLogReplay
Running org.apache.hadoop.hbase.security.visibility.TestVisibilityLabelsWithDefaultVisLabelService
Running org.apache.hadoop.hbase.security.visibility.TestVisibilityLabelsWithDeletes
Tests run: 21, Failures: 0, Errors: 0, Skipped: 0, Time elapsed: 14.727 sec - in org.apache.hadoop.hbase.security.visibility.TestVisibilityLabelsWithDefaultVisLabelService
Running org.apache.hadoop.hbase.security.visibility.TestVisibilityLabelsWithCustomVisLabService
Tests run: 19, Failures: 0, Errors: 0, Skipped: 0, Time elapsed: 12.963 sec - in org.apache.hadoop.hbase.security.visibility.TestVisibilityLabelsWithCustomVisLabService
Running org.apache.hadoop.hbase.security.visibility.TestVisibilityLabelsReplication
Tests run: 1, Failures: 0, Errors: 0, Skipped: 0, Time elapsed: 15.926 sec - in org.apache.hadoop.hbase.security.visibility.TestVisibilityLabelsReplication
Tests run: 37, Failures: 0, Errors: 0, Skipped: 0, Time elapsed: 47.358 sec - in org.apache.hadoop.hbase.security.visibility.TestVisibilityLabelsWithDeletes
Running org.apache.hadoop.hbase.security.visibility.TestVisibilityLabelReplicationWithExpAsString
Running org.apache.hadoop.hbase.fs.TestBlockReorder
Tests run: 1, Failures: 0, Errors: 0, Skipped: 0, Time elapsed: 16.145 sec - in org.apache.hadoop.hbase.security.visibility.TestVisibilityLabelReplicationWithExpAsString
Tests run: 3, Failures: 0, Errors: 0, Skipped: 0, Time elapsed: 18.864 sec - in org.apache.hadoop.hbase.fs.TestBlockReorder
Running org.apache.hadoop.hbase.wal.TestWALFactory
Running org.apache.hadoop.hbase.TestInfoServers
Tests run: 3, Failures: 0, Errors: 0, Skipped: 0, Time elapsed: 2.21 sec - in org.apache.hadoop.hbase.TestInfoServers
Running org.apache.hadoop.hbase.wal.TestDefaultWALProviderWithHLogKey
Tests run: 9, Failures: 0, Errors: 0, Skipped: 0, Time elapsed: 11.319 sec - in org.apache.hadoop.hbase.wal.TestWALFactory
Running org.apache.hadoop.hbase.wal.TestWALReaderOnSecureWAL
Tests run: 2, Failures: 0, Errors: 0, Skipped: 0, Time elapsed: 1.565 sec - in org.apache.hadoop.hbase.wal.TestWALReaderOnSecureWAL
Tests run: 4, Failures: 0, Errors: 0, Skipped: 0, Time elapsed: 6.017 sec - in org.apache.hadoop.hbase.wal.TestDefaultWALProviderWithHLogKey
Running org.apache.hadoop.hbase.wal.TestSecureWAL
Tests run: 1, Failures: 0, Errors: 0, Skipped: 0, Time elapsed: 1.202 sec - in org.apache.hadoop.hbase.wal.TestSecureWAL
Running org.apache.hadoop.hbase.wal.TestWALFiltering
Running org.apache.hadoop.hbase.wal.TestWALSplit
Tests run: 9, Failures: 0, Errors: 0, Skipped: 0, Time elapsed: 286.6 sec - in org.apache.hadoop.hbase.snapshot.TestExportSnapshot
Tests run: 9, Failures: 0, Errors: 0, Skipped: 0, Time elapsed: 281.608 sec - in org.apache.hadoop.hbase.snapshot.TestSecureExportSnapshot
Running org.apache.hadoop.hbase.wal.TestDefaultWALProvider
Running org.apache.hadoop.hbase.wal.TestWALSplitCompressed
Tests run: 4, Failures: 0, Errors: 0, Skipped: 0, Time elapsed: 6.736 sec - in org.apache.hadoop.hbase.wal.TestDefaultWALProvider
Tests run: 1, Failures: 0, Errors: 0, Skipped: 0, Time elapsed: 22.564 sec - in org.apache.hadoop.hbase.wal.TestWALFiltering
Running org.apache.hadoop.hbase.backup.example.TestZooKeeperTableArchiveClient
Running org.apache.hadoop.hbase.backup.TestHFileArchiving
Tests run: 3, Failures: 0, Errors: 0, Skipped: 0, Time elapsed: 3.779 sec - in org.apache.hadoop.hbase.backup.example.TestZooKeeperTableArchiveClient
Running org.apache.hadoop.hbase.zookeeper.TestHQuorumPeer
Tests run: 3, Failures: 0, Errors: 0, Skipped: 0, Time elapsed: 1.454 sec - in org.apache.hadoop.hbase.zookeeper.TestHQuorumPeer
Running org.apache.hadoop.hbase.zookeeper.lock.TestZKInterProcessReadWriteLock
Tests run: 53, Failures: 0, Errors: 0, Skipped: 0, Time elapsed: 220.004 sec - in org.apache.hadoop.hbase.security.access.TestAccessController
Running org.apache.hadoop.hbase.zookeeper.TestRecoverableZooKeeper
Tests run: 1, Failures: 0, Errors: 0, Skipped: 0, Time elapsed: 1.263 sec - in org.apache.hadoop.hbase.zookeeper.TestRecoverableZooKeeper
Running org.apache.hadoop.hbase.zookeeper.TestZKLeaderManager
Tests run: 1, Failures: 0, Errors: 0, Skipped: 0, Time elapsed: 0.134 sec - in org.apache.hadoop.hbase.zookeeper.TestZKLeaderManager
Tests run: 6, Failures: 0, Errors: 0, Skipped: 0, Time elapsed: 24.493 sec - in org.apache.hadoop.hbase.zookeeper.lock.TestZKInterProcessReadWriteLock
Running org.apache.hadoop.hbase.zookeeper.TestZooKeeperNodeTracker
Tests run: 3, Failures: 0, Errors: 0, Skipped: 0, Time elapsed: 0.923 sec - in org.apache.hadoop.hbase.zookeeper.TestZooKeeperNodeTracker
Running org.apache.hadoop.hbase.zookeeper.TestZooKeeperACL
Tests run: 6, Failures: 0, Errors: 0, Skipped: 0, Time elapsed: 0.274 sec - in org.apache.hadoop.hbase.zookeeper.TestZooKeeperACL
Running org.apache.hadoop.hbase.zookeeper.TestZKMulti
Tests run: 6, Failures: 0, Errors: 0, Skipped: 0, Time elapsed: 0.344 sec - in org.apache.hadoop.hbase.zookeeper.TestZKMulti
Tests run: 5, Failures: 0, Errors: 0, Skipped: 0, Time elapsed: 40.976 sec - in org.apache.hadoop.hbase.backup.TestHFileArchiving
Running org.apache.hadoop.hbase.mapreduce.TestHLogRecordReader
Tests run: 2, Failures: 0, Errors: 0, Skipped: 0, Time elapsed: 0.902 sec - in org.apache.hadoop.hbase.mapreduce.TestHLogRecordReader
Running org.apache.hadoop.hbase.mapreduce.TestTableInputFormatScan2
Running org.apache.hadoop.hbase.mapreduce.TestTableMapReduce
Running org.apache.hadoop.hbase.mapreduce.TestImportExport
Tests run: 31, Failures: 0, Errors: 0, Skipped: 0, Time elapsed: 188.363 sec - in org.apache.hadoop.hbase.wal.TestWALSplit
Tests run: 31, Failures: 0, Errors: 0, Skipped: 0, Time elapsed: 189.946 sec - in org.apache.hadoop.hbase.wal.TestWALSplitCompressed
Running org.apache.hadoop.hbase.mapreduce.TestWALPlayer
Running org.apache.hadoop.hbase.mapreduce.TestCopyTable
Tests run: 2, Failures: 0, Errors: 0, Skipped: 0, Time elapsed: 150.799 sec - in org.apache.hadoop.hbase.mapreduce.TestTableMapReduce
Running org.apache.hadoop.hbase.mapreduce.TestImportTSVWithOperationAttributes
Tests run: 4, Failures: 0, Errors: 0, Skipped: 0, Time elapsed: 52.02 sec - in org.apache.hadoop.hbase.mapreduce.TestWALPlayer
Running org.apache.hadoop.hbase.mapreduce.TestRowCounter
Tests run: 7, Failures: 0, Errors: 0, Skipped: 0, Time elapsed: 235.88 sec - in org.apache.hadoop.hbase.mapreduce.TestTableInputFormatScan2
Tests run: 2, Failures: 0, Errors: 0, Skipped: 0, Time elapsed: 77.785 sec - in org.apache.hadoop.hbase.mapreduce.TestImportTSVWithOperationAttributes
Running org.apache.hadoop.hbase.mapreduce.TestImportTsv
Running org.apache.hadoop.hbase.mapreduce.TestLoadIncrementalHFilesUseSecurityEndPoint
Tests run: 5, Failures: 0, Errors: 0, Skipped: 0, Time elapsed: 124.867 sec - in org.apache.hadoop.hbase.mapreduce.TestCopyTable
Running org.apache.hadoop.hbase.mapreduce.TestSecureLoadIncrementalHFiles
Tests run: 14, Failures: 0, Errors: 0, Skipped: 0, Time elapsed: 32.579 sec - in org.apache.hadoop.hbase.mapreduce.TestLoadIncrementalHFilesUseSecurityEndPoint
Running org.apache.hadoop.hbase.mapreduce.TestTimeRangeMapRed
Tests run: 14, Failures: 0, Errors: 0, Skipped: 0, Time elapsed: 35.295 sec - in org.apache.hadoop.hbase.mapreduce.TestSecureLoadIncrementalHFiles
Running org.apache.hadoop.hbase.mapreduce.TestTableSnapshotInputFormat
Tests run: 1, Failures: 0, Errors: 0, Skipped: 0, Time elapsed: 65.89 sec - in org.apache.hadoop.hbase.mapreduce.TestTimeRangeMapRed
Running org.apache.hadoop.hbase.mapreduce.TestLoadIncrementalHFiles
Tests run: 12, Failures: 0, Errors: 0, Skipped: 0, Time elapsed: 387.053 sec - in org.apache.hadoop.hbase.mapreduce.TestImportExport
Tests run: 14, Failures: 0, Errors: 0, Skipped: 0, Time elapsed: 28.334 sec - in org.apache.hadoop.hbase.mapreduce.TestLoadIncrementalHFiles
Tests run: 6, Failures: 0, Errors: 0, Skipped: 0, Time elapsed: 205.607 sec - in org.apache.hadoop.hbase.mapreduce.TestRowCounter
Running org.apache.hadoop.hbase.mapreduce.TestLoadIncrementalHFilesSplitRecovery
Running org.apache.hadoop.hbase.mapreduce.TestHRegionPartitioner
Tests run: 1, Failures: 0, Errors: 0, Skipped: 0, Time elapsed: 3.407 sec - in org.apache.hadoop.hbase.mapreduce.TestHRegionPartitioner
Running org.apache.hadoop.hbase.mapreduce.TestHFileOutputFormat
Tests run: 5, Failures: 0, Errors: 0, Skipped: 0, Time elapsed: 14.273 sec - in org.apache.hadoop.hbase.mapreduce.TestLoadIncrementalHFilesSplitRecovery
Running org.apache.hadoop.hbase.mapreduce.TestImportTSVWithVisibilityLabels
Running org.apache.hadoop.hbase.mapreduce.TestMultithreadedTableMapper
Tests run: 10, Failures: 0, Errors: 0, Skipped: 0, Time elapsed: 229.835 sec - in org.apache.hadoop.hbase.mapreduce.TestImportTsv
Running org.apache.hadoop.hbase.mapreduce.TestHFileOutputFormat2
Tests run: 1, Failures: 0, Errors: 0, Skipped: 0, Time elapsed: 93.969 sec - in org.apache.hadoop.hbase.mapreduce.TestMultithreadedTableMapper
Tests run: 7, Failures: 0, Errors: 0, Skipped: 0, Time elapsed: 262.149 sec - in org.apache.hadoop.hbase.mapreduce.TestTableSnapshotInputFormat
Running org.apache.hadoop.hbase.mapreduce.TestTableInputFormatScan1
Running org.apache.hadoop.hbase.mapreduce.TestCellCounter
Tests run: 5, Failures: 0, Errors: 0, Skipped: 0, Time elapsed: 174.677 sec - in org.apache.hadoop.hbase.mapreduce.TestImportTSVWithVisibilityLabels
Running org.apache.hadoop.hbase.mapreduce.TestWALRecordReader
Tests run: 2, Failures: 0, Errors: 0, Skipped: 0, Time elapsed: 1.01 sec - in org.apache.hadoop.hbase.mapreduce.TestWALRecordReader
Running org.apache.hadoop.hbase.mapreduce.TestMultiTableInputFormat
Tests run: 13, Failures: 0, Errors: 0, Skipped: 1, Time elapsed: 252.746 sec - in org.apache.hadoop.hbase.mapreduce.TestHFileOutputFormat
Running org.apache.hadoop.hbase.mapreduce.TestSecureLoadIncrementalHFilesSplitRecovery
Tests run: 5, Failures: 0, Errors: 0, Skipped: 0, Time elapsed: 23.914 sec - in org.apache.hadoop.hbase.mapreduce.TestSecureLoadIncrementalHFilesSplitRecovery
Running org.apache.hadoop.hbase.filter.TestScanRowPrefix
Tests run: 1, Failures: 0, Errors: 0, Skipped: 0, Time elapsed: 3.474 sec - in org.apache.hadoop.hbase.filter.TestScanRowPrefix
Tests run: 13, Failures: 0, Errors: 0, Skipped: 1, Time elapsed: 260.611 sec - in org.apache.hadoop.hbase.mapreduce.TestHFileOutputFormat2
Running org.apache.hadoop.hbase.filter.TestFilterWithScanLimits
Tests run: 1, Failures: 0, Errors: 0, Skipped: 0, Time elapsed: 2.821 sec - in org.apache.hadoop.hbase.filter.TestFilterWithScanLimits
Running org.apache.hadoop.hbase.filter.TestFuzzyRowAndColumnRangeFilter
Tests run: 1, Failures: 0, Errors: 0, Skipped: 0, Time elapsed: 3 sec - in org.apache.hadoop.hbase.filter.TestFuzzyRowAndColumnRangeFilter
Running org.apache.hadoop.hbase.filter.TestColumnRangeFilter
Running org.apache.hadoop.hbase.filter.TestFilterWrapper
Tests run: 1, Failures: 0, Errors: 0, Skipped: 0, Time elapsed: 1.967 sec - in org.apache.hadoop.hbase.filter.TestFilterWrapper
Tests run: 1, Failures: 0, Errors: 0, Skipped: 0, Time elapsed: 7.433 sec - in org.apache.hadoop.hbase.filter.TestColumnRangeFilter
Running org.apache.hadoop.hbase.TestMetaTableAccessor
Tests run: 7, Failures: 0, Errors: 0, Skipped: 0, Time elapsed: 193.917 sec - in org.apache.hadoop.hbase.mapreduce.TestCellCounter
Tests run: 8, Failures: 0, Errors: 0, Skipped: 0, Time elapsed: 5.716 sec - in org.apache.hadoop.hbase.TestMetaTableAccessor
Tests run: 5, Failures: 0, Errors: 0, Skipped: 0, Time elapsed: 221.127 sec - in org.apache.hadoop.hbase.mapreduce.TestTableInputFormatScan1
Tests run: 4, Failures: 0, Errors: 0, Skipped: 0, Time elapsed: 159.694 sec - in org.apache.hadoop.hbase.mapreduce.TestMultiTableInputFormat

Results :

Failed tests: 
  TestRestartCluster.testRetainAssignmentOnRestart:210 Values should be different. Actual:
1417807700987



Tests run: 2016, Failures: 1, Errors: 0, Skipped: 25

[INFO] ------------------------------------------------------------------------
[INFO] Reactor Summary:
[INFO] 
[INFO] HBase ............................................. SUCCESS [3.842s]
[INFO] HBase - Checkstyle ................................ SUCCESS [1.034s]
[INFO] HBase - Annotations ............................... SUCCESS [0.979s]
[INFO] HBase - Common .................................... SUCCESS [1:03.478s]
[INFO] HBase - Protocol .................................. SUCCESS [12.313s]
[INFO] HBase - Client .................................... SUCCESS [1:23.236s]
[INFO] HBase - Hadoop Compatibility ...................... SUCCESS [7.022s]
[INFO] HBase - Hadoop Two Compatibility .................. SUCCESS [6.175s]
[INFO] HBase - Prefix Tree ............................... SUCCESS [8.453s]
[INFO] HBase - Server .................................... FAILURE [59:28.047s]
[INFO] HBase - Testing Util .............................. SKIPPED
[INFO] HBase - Thrift .................................... SKIPPED
[INFO] HBase - Shell ..................................... SKIPPED
[INFO] HBase - Integration Tests ......................... SKIPPED
[INFO] HBase - Examples .................................. SKIPPED
[INFO] HBase - Rest ...................................... SKIPPED
[INFO] HBase - Assembly .................................. SKIPPED
[INFO] ------------------------------------------------------------------------
[INFO] BUILD FAILURE
[INFO] ------------------------------------------------------------------------
[INFO] Total time: 1:02:35.538s
[INFO] Finished at: Fri Dec 05 20:08:17 UTC 2014
[INFO] Final Memory: 56M/779M
[INFO] ------------------------------------------------------------------------
[ERROR] Failed to execute goal org.apache.maven.plugins:maven-surefire-plugin:2.18:test (secondPartTestsExecution)
on project hbase-server: There are test failures.
[ERROR] 
[ERROR] Please refer to <https://builds.apache.org/job/HBase-TRUNK/ws/hbase-server/target/surefire-reports>
for the individual test results.
[ERROR] -> [Help 1]
[ERROR] 
[ERROR] To see the full stack trace of the errors, re-run Maven with the -e switch.
[ERROR] Re-run Maven using the -X switch to enable full debug logging.
[ERROR] 
[ERROR] For more information about the errors and possible solutions, please read the following
articles:
[ERROR] [Help 1] http://cwiki.apache.org/confluence/display/MAVEN/MojoFailureException
[ERROR] 
[ERROR] After correcting the problems, you can resume the build with the command
[ERROR]   mvn <goals> -rf :hbase-server
Build step 'Invoke top-level Maven targets' marked build as failure
[FINDBUGS] Skipping publisher since build result is FAILURE
Performing Post build task...
Match found for :.* : True
Logical operation result is TRUE
Running script  :   ZOMBIE_TESTS_COUNT=`jps | grep surefirebooter | wc -l`
  if [[ $ZOMBIE_TESTS_COUNT != 0 ]] ; then
    #It seems sometimes the tests are not dying immediately. Let's give them 10s
    echo "Suspicious java process found - waiting 10s to see if there are just slow to stop"
    sleep 10   
    ZOMBIE_TESTS_COUNT=`jps | grep surefirebooter | wc -l`
    if [[ $ZOMBIE_TESTS_COUNT != 0 ]] ; then
      echo "There are $ZOMBIE_TESTS_COUNT zombie tests, they should have been killed by surefire
but survived"
      echo "************ BEGIN zombies jstack extract"
      ZB_STACK=`jps | grep surefirebooter | cut -d ' ' -f 1 | xargs -n 1 jstack | grep ".test"
| grep "\.java"`
      jps | grep surefirebooter | cut -d ' ' -f 1 | xargs -n 1 jstack
      echo "************ END  zombies jstack extract"
      JIRA_COMMENT="$JIRA_COMMENT

     {color:red}-1 core zombie tests{color}.  There are ${ZOMBIE_TESTS_COUNT} zombie test(s):
${ZB_STACK}"
      BAD=1
      jps | grep surefirebooter | cut -d ' ' -f 1 | xargs kill -9
    else
      echo "We're ok: there is no zombie test, but some tests took some time to stop"
    fi
  else
    echo "We're ok: there is no zombie test"
  fi
[HBase-TRUNK] $ /bin/bash -xe /tmp/hudson4401172794812644660.sh
++ jps
++ grep surefirebooter
++ wc -l
+ ZOMBIE_TESTS_COUNT=0
+ [[ 0 != 0 ]]
+ echo 'We'\''re ok: there is no zombie test'
We're ok: there is no zombie test
POST BUILD TASK : SUCCESS
END OF POST BUILD TASK : 0
Archiving artifacts
Sending artifact delta relative to HBase-TRUNK #5870
Archived 1795 artifacts
Archive block size is 32768
Received 32 blocks and 305957136 bytes
Compression is 0.3%
Took 2 min 30 sec
Recording test results
Updating HBASE-12565

Mime
View raw message