hbase-builds mailing list archives

Site index · List index
Message view « Date » · « Thread »
Top « Date » · « Thread »
From Apache Jenkins Server <jenk...@builds.apache.org>
Subject Build failed in Jenkins: HBase-0.98-on-Hadoop-1.1 #710
Date Tue, 16 Dec 2014 03:36:50 GMT
See <https://builds.apache.org/job/HBase-0.98-on-Hadoop-1.1/710/changes>

Changes:

[apurtell] HBASE-12493 Make User and TokenUtil public

[apurtell] HBASE-12348 preModifyColumn and preDeleteColumn in AC denies user to perform its
operation though it has required rights

[apurtell] HBASE-12686 Failures in split before PONR not clearing the daughter regions from
regions in transition during rollback (Vandana Ayyalasomayajula)

[rajeshbabu] HBASE-12696 Possible NPE in HRegionFileSystem#splitStoreFile when skipStoreFileRangeCheck
in splitPolicy return true(Rajeshbabu)

------------------------------------------
[...truncated 267 lines...]
Tests run: 2, Failures: 0, Errors: 0, Skipped: 0, Time elapsed: 1.033 sec - in org.apache.hadoop.hbase.util.TestDynamicClassLoader
Running org.apache.hadoop.hbase.util.TestSimpleByteRange
Tests run: 2, Failures: 0, Errors: 0, Skipped: 0, Time elapsed: 0.165 sec - in org.apache.hadoop.hbase.util.TestSimpleByteRange
Running org.apache.hadoop.hbase.util.TestLoadTestKVGenerator
Tests run: 3, Failures: 0, Errors: 0, Skipped: 0, Time elapsed: 0.862 sec - in org.apache.hadoop.hbase.util.TestLoadTestKVGenerator
Running org.apache.hadoop.hbase.util.TestShowProperties
Tests run: 1, Failures: 0, Errors: 0, Skipped: 0, Time elapsed: 0.056 sec - in org.apache.hadoop.hbase.util.TestShowProperties
Running org.apache.hadoop.hbase.util.TestKeyLocker
Tests run: 1, Failures: 0, Errors: 0, Skipped: 0, Time elapsed: 0.116 sec - in org.apache.hadoop.hbase.util.TestKeyLocker
Running org.apache.hadoop.hbase.util.TestEnvironmentEdgeManager
Tests run: 2, Failures: 0, Errors: 0, Skipped: 0, Time elapsed: 0.302 sec - in org.apache.hadoop.hbase.util.TestEnvironmentEdgeManager
Running org.apache.hadoop.hbase.util.TestDrainBarrier
Tests run: 6, Failures: 0, Errors: 0, Skipped: 0, Time elapsed: 1.261 sec - in org.apache.hadoop.hbase.util.TestDrainBarrier
Running org.apache.hadoop.hbase.util.TestOrderedBytes
Tests run: 19, Failures: 0, Errors: 0, Skipped: 0, Time elapsed: 0.732 sec - in org.apache.hadoop.hbase.util.TestOrderedBytes
Running org.apache.hadoop.hbase.util.TestConcatenatedLists
Tests run: 6, Failures: 0, Errors: 0, Skipped: 0, Time elapsed: 0.264 sec - in org.apache.hadoop.hbase.util.TestConcatenatedLists
Running org.apache.hadoop.hbase.util.TestPositionedByteRange
Tests run: 1, Failures: 0, Errors: 0, Skipped: 0, Time elapsed: 0.134 sec - in org.apache.hadoop.hbase.util.TestPositionedByteRange
Running org.apache.hadoop.hbase.util.TestCoprocessorClassLoader
Tests run: 3, Failures: 0, Errors: 0, Skipped: 0, Time elapsed: 1.115 sec - in org.apache.hadoop.hbase.util.TestCoprocessorClassLoader
Running org.apache.hadoop.hbase.TestCellUtil
Tests run: 2, Failures: 0, Errors: 0, Skipped: 0, Time elapsed: 0.252 sec - in org.apache.hadoop.hbase.TestCellUtil
Running org.apache.hadoop.hbase.TestKeyValue
Tests run: 17, Failures: 0, Errors: 0, Skipped: 0, Time elapsed: 0.518 sec - in org.apache.hadoop.hbase.TestKeyValue
Running org.apache.hadoop.hbase.TestClassFinder
Tests run: 11, Failures: 0, Errors: 0, Skipped: 0, Time elapsed: 1.728 sec - in org.apache.hadoop.hbase.TestClassFinder
Running org.apache.hadoop.hbase.codec.TestCellCodecWithTags
Tests run: 1, Failures: 0, Errors: 0, Skipped: 0, Time elapsed: 0.161 sec - in org.apache.hadoop.hbase.codec.TestCellCodecWithTags
Running org.apache.hadoop.hbase.codec.TestKeyValueCodec
Tests run: 3, Failures: 0, Errors: 0, Skipped: 0, Time elapsed: 0.21 sec - in org.apache.hadoop.hbase.codec.TestKeyValueCodec
Running org.apache.hadoop.hbase.codec.TestKeyValueCodecWithTags
Tests run: 1, Failures: 0, Errors: 0, Skipped: 0, Time elapsed: 0.16 sec - in org.apache.hadoop.hbase.codec.TestKeyValueCodecWithTags
Running org.apache.hadoop.hbase.codec.TestCellCodec
Tests run: 3, Failures: 0, Errors: 0, Skipped: 0, Time elapsed: 0.217 sec - in org.apache.hadoop.hbase.codec.TestCellCodec
Running org.apache.hadoop.hbase.types.TestStruct
Tests run: 2, Failures: 0, Errors: 0, Skipped: 0, Time elapsed: 0.077 sec - in org.apache.hadoop.hbase.types.TestStruct
Running org.apache.hadoop.hbase.types.TestOrderedString
Tests run: 1, Failures: 0, Errors: 0, Skipped: 0, Time elapsed: 0.129 sec - in org.apache.hadoop.hbase.types.TestOrderedString
Running org.apache.hadoop.hbase.types.TestOrderedBlobVar
Tests run: 1, Failures: 0, Errors: 0, Skipped: 0, Time elapsed: 0.049 sec - in org.apache.hadoop.hbase.types.TestOrderedBlobVar
Running org.apache.hadoop.hbase.types.TestFixedLengthWrapper
Tests run: 4, Failures: 0, Errors: 0, Skipped: 0, Time elapsed: 0.135 sec - in org.apache.hadoop.hbase.types.TestFixedLengthWrapper
Running org.apache.hadoop.hbase.types.TestStructNullExtension
Tests run: 2, Failures: 0, Errors: 0, Skipped: 0, Time elapsed: 0.171 sec - in org.apache.hadoop.hbase.types.TestStructNullExtension
Running org.apache.hadoop.hbase.types.TestUnion2
Tests run: 2, Failures: 0, Errors: 0, Skipped: 0, Time elapsed: 0.165 sec - in org.apache.hadoop.hbase.types.TestUnion2
Running org.apache.hadoop.hbase.types.TestRawString
Tests run: 1, Failures: 0, Errors: 0, Skipped: 0, Time elapsed: 0.137 sec - in org.apache.hadoop.hbase.types.TestRawString
Running org.apache.hadoop.hbase.types.TestOrderedBlob
Tests run: 1, Failures: 0, Errors: 0, Skipped: 0, Time elapsed: 0.048 sec - in org.apache.hadoop.hbase.types.TestOrderedBlob
Running org.apache.hadoop.hbase.types.TestTerminatedWrapper
Tests run: 8, Failures: 0, Errors: 0, Skipped: 0, Time elapsed: 0.26 sec - in org.apache.hadoop.hbase.types.TestTerminatedWrapper
Running org.apache.hadoop.hbase.TestHBaseConfiguration
Tests run: 2, Failures: 0, Errors: 0, Skipped: 0, Time elapsed: 0.339 sec - in org.apache.hadoop.hbase.TestHBaseConfiguration

Results :




Tests run: 164, Failures: 0, Errors: 0, Skipped: 0

[INFO] 
[INFO] --- maven-surefire-plugin:2.18:test (secondPartTestsExecution) @ hbase-common ---
[INFO] Tests are skipped.
[INFO] 
[INFO] --- jacoco-maven-plugin:0.6.2.201302030002:report (report) @ hbase-common ---
[INFO] Skipping JaCoCo execution
[INFO] 
[INFO] --- maven-source-plugin:2.2.1:jar-no-fork (attach-sources) @ hbase-common ---
[INFO] Building jar: <https://builds.apache.org/job/HBase-0.98-on-Hadoop-1.1/ws/hbase-common/target/hbase-common-0.98.9-sources.jar>
[INFO] 
[INFO] --- maven-jar-plugin:2.4:test-jar (default) @ hbase-common ---
[INFO] Building jar: <https://builds.apache.org/job/HBase-0.98-on-Hadoop-1.1/ws/hbase-common/target/hbase-common-0.98.9-tests.jar>
[INFO] 
[INFO] --- maven-jar-plugin:2.4:jar (default-jar) @ hbase-common ---
[INFO] Building jar: <https://builds.apache.org/job/HBase-0.98-on-Hadoop-1.1/ws/hbase-common/target/hbase-common-0.98.9.jar>
[INFO] 
[INFO] --- maven-install-plugin:2.3.1:install (default-install) @ hbase-common ---
[INFO] Installing <https://builds.apache.org/job/HBase-0.98-on-Hadoop-1.1/ws/hbase-common/target/hbase-common-0.98.9.jar>
to /home/jenkins/.m2/repository/org/apache/hbase/hbase-common/0.98.9/hbase-common-0.98.9.jar
[INFO] Installing <https://builds.apache.org/job/HBase-0.98-on-Hadoop-1.1/ws/hbase-common/pom.xml>
to /home/jenkins/.m2/repository/org/apache/hbase/hbase-common/0.98.9/hbase-common-0.98.9.pom
[INFO] Installing <https://builds.apache.org/job/HBase-0.98-on-Hadoop-1.1/ws/hbase-common/target/hbase-common-0.98.9-sources.jar>
to /home/jenkins/.m2/repository/org/apache/hbase/hbase-common/0.98.9/hbase-common-0.98.9-sources.jar
[INFO] Installing <https://builds.apache.org/job/HBase-0.98-on-Hadoop-1.1/ws/hbase-common/target/hbase-common-0.98.9-tests.jar>
to /home/jenkins/.m2/repository/org/apache/hbase/hbase-common/0.98.9/hbase-common-0.98.9-tests.jar
[INFO]                                                                         
[INFO] ------------------------------------------------------------------------
[INFO] Building HBase - Protocol 0.98.9
[INFO] ------------------------------------------------------------------------
[INFO] 
[INFO] --- maven-enforcer-plugin:1.0.1:enforce (enforce) @ hbase-protocol ---
[INFO] 
[INFO] --- jacoco-maven-plugin:0.6.2.201302030002:prepare-agent (prepare-agent) @ hbase-protocol
---
[INFO] Skipping JaCoCo execution
[INFO] argLine set to 
[INFO] 
[INFO] --- maven-remote-resources-plugin:1.4:process (default) @ hbase-protocol ---
[INFO] 
[INFO] --- maven-resources-plugin:2.6:resources (default-resources) @ hbase-protocol ---
[INFO] Using 'UTF-8' encoding to copy filtered resources.
[INFO] skip non existing resourceDirectory <https://builds.apache.org/job/HBase-0.98-on-Hadoop-1.1/ws/hbase-protocol/src/main/resources>
[INFO] Copying 3 resources
[INFO] 
[INFO] --- maven-compiler-plugin:2.5.1:compile (default-compile) @ hbase-protocol ---
[INFO] Compiling 30 source files to <https://builds.apache.org/job/HBase-0.98-on-Hadoop-1.1/ws/hbase-protocol/target/classes>
[INFO] 
[INFO] --- maven-resources-plugin:2.6:testResources (default-testResources) @ hbase-protocol
---
[INFO] Using 'UTF-8' encoding to copy filtered resources.
[INFO] skip non existing resourceDirectory <https://builds.apache.org/job/HBase-0.98-on-Hadoop-1.1/ws/hbase-protocol/src/test/resources>
[INFO] Copying 3 resources
[INFO] 
[INFO] --- maven-compiler-plugin:2.5.1:testCompile (default-testCompile) @ hbase-protocol
---
[INFO] No sources to compile
[INFO] 
[INFO] --- maven-surefire-plugin:2.18:test (default-test) @ hbase-protocol ---
[INFO] 
[INFO] --- maven-surefire-plugin:2.18:test (secondPartTestsExecution) @ hbase-protocol ---
[INFO] Tests are skipped.
[INFO] 
[INFO] --- jacoco-maven-plugin:0.6.2.201302030002:report (report) @ hbase-protocol ---
[INFO] Skipping JaCoCo execution
[INFO] 
[INFO] --- maven-source-plugin:2.2.1:jar-no-fork (attach-sources) @ hbase-protocol ---
[INFO] Building jar: <https://builds.apache.org/job/HBase-0.98-on-Hadoop-1.1/ws/hbase-protocol/target/hbase-protocol-0.98.9-sources.jar>
[INFO] 
[INFO] --- maven-jar-plugin:2.4:test-jar (default) @ hbase-protocol ---
[INFO] Building jar: <https://builds.apache.org/job/HBase-0.98-on-Hadoop-1.1/ws/hbase-protocol/target/hbase-protocol-0.98.9-tests.jar>
[INFO] 
[INFO] --- maven-jar-plugin:2.4:jar (default-jar) @ hbase-protocol ---
[INFO] Building jar: <https://builds.apache.org/job/HBase-0.98-on-Hadoop-1.1/ws/hbase-protocol/target/hbase-protocol-0.98.9.jar>
[INFO] 
[INFO] --- maven-install-plugin:2.3.1:install (default-install) @ hbase-protocol ---
[INFO] Installing <https://builds.apache.org/job/HBase-0.98-on-Hadoop-1.1/ws/hbase-protocol/target/hbase-protocol-0.98.9.jar>
to /home/jenkins/.m2/repository/org/apache/hbase/hbase-protocol/0.98.9/hbase-protocol-0.98.9.jar
[INFO] Installing <https://builds.apache.org/job/HBase-0.98-on-Hadoop-1.1/ws/hbase-protocol/pom.xml>
to /home/jenkins/.m2/repository/org/apache/hbase/hbase-protocol/0.98.9/hbase-protocol-0.98.9.pom
[INFO] Installing <https://builds.apache.org/job/HBase-0.98-on-Hadoop-1.1/ws/hbase-protocol/target/hbase-protocol-0.98.9-sources.jar>
to /home/jenkins/.m2/repository/org/apache/hbase/hbase-protocol/0.98.9/hbase-protocol-0.98.9-sources.jar
[INFO] Installing <https://builds.apache.org/job/HBase-0.98-on-Hadoop-1.1/ws/hbase-protocol/target/hbase-protocol-0.98.9-tests.jar>
to /home/jenkins/.m2/repository/org/apache/hbase/hbase-protocol/0.98.9/hbase-protocol-0.98.9-tests.jar
[INFO]                                                                         
[INFO] ------------------------------------------------------------------------
[INFO] Building HBase - Client 0.98.9
[INFO] ------------------------------------------------------------------------
[INFO] 
[INFO] --- maven-enforcer-plugin:1.0.1:enforce (enforce) @ hbase-client ---
[INFO] 
[INFO] --- jacoco-maven-plugin:0.6.2.201302030002:prepare-agent (prepare-agent) @ hbase-client
---
[INFO] Skipping JaCoCo execution
[INFO] argLine set to 
[INFO] 
[INFO] --- maven-remote-resources-plugin:1.4:process (default) @ hbase-client ---
[INFO] 
[INFO] --- maven-resources-plugin:2.6:resources (default-resources) @ hbase-client ---
[INFO] Using 'UTF-8' encoding to copy filtered resources.
[INFO] Copying 1 resource
[INFO] Copying 3 resources
[INFO] 
[INFO] --- maven-compiler-plugin:2.5.1:compile (default-compile) @ hbase-client ---
[INFO] Compiling 273 source files to <https://builds.apache.org/job/HBase-0.98-on-Hadoop-1.1/ws/hbase-client/target/classes>
[INFO] -------------------------------------------------------------
[ERROR] COMPILATION ERROR : 
[INFO] -------------------------------------------------------------
[ERROR] <https://builds.apache.org/job/HBase-0.98-on-Hadoop-1.1/ws/hbase-client/src/main/java/org/apache/hadoop/hbase/security/token/TokenUtil.java>:[356,19]
addToken(org.apache.hadoop.security.token.Token<? extends org.apache.hadoop.security.token.TokenIdentifier>)
in org.apache.hadoop.security.UserGroupInformation cannot be applied to (org.apache.hadoop.io.Text,org.apache.hadoop.security.token.Token<org.apache.hadoop.hbase.security.token.AuthenticationTokenIdentifier>)
[INFO] 1 error
[INFO] -------------------------------------------------------------
[INFO] ------------------------------------------------------------------------
[INFO] Reactor Summary:
[INFO] 
[INFO] HBase ............................................. SUCCESS [3.311s]
[INFO] HBase - Checkstyle ................................ SUCCESS [0.744s]
[INFO] HBase - Annotations ............................... SUCCESS [1.037s]
[INFO] HBase - Common .................................... SUCCESS [40.958s]
[INFO] HBase - Protocol .................................. SUCCESS [19.763s]
[INFO] HBase - Client .................................... FAILURE [1.668s]
[INFO] HBase - Hadoop Compatibility ...................... SKIPPED
[INFO] HBase - Hadoop One Compatibility .................. SKIPPED
[INFO] HBase - Prefix Tree ............................... SKIPPED
[INFO] HBase - Server .................................... SKIPPED
[INFO] HBase - Testing Util .............................. SKIPPED
[INFO] HBase - Thrift .................................... SKIPPED
[INFO] HBase - Rest ...................................... SKIPPED
[INFO] HBase - Shell ..................................... SKIPPED
[INFO] HBase - Integration Tests ......................... SKIPPED
[INFO] HBase - Examples .................................. SKIPPED
[INFO] HBase - Assembly .................................. SKIPPED
[INFO] ------------------------------------------------------------------------
[INFO] BUILD FAILURE
[INFO] ------------------------------------------------------------------------
[INFO] Total time: 1:08.368s
[INFO] Finished at: Tue Dec 16 03:36:31 UTC 2014
[INFO] Final Memory: 45M/570M
[INFO] ------------------------------------------------------------------------
[ERROR] Failed to execute goal org.apache.maven.plugins:maven-compiler-plugin:2.5.1:compile
(default-compile) on project hbase-client: Compilation failure
[ERROR] <https://builds.apache.org/job/HBase-0.98-on-Hadoop-1.1/ws/hbase-client/src/main/java/org/apache/hadoop/hbase/security/token/TokenUtil.java>:[356,19]
addToken(org.apache.hadoop.security.token.Token<? extends org.apache.hadoop.security.token.TokenIdentifier>)
in org.apache.hadoop.security.UserGroupInformation cannot be applied to (org.apache.hadoop.io.Text,org.apache.hadoop.security.token.Token<org.apache.hadoop.hbase.security.token.AuthenticationTokenIdentifier>)
[ERROR] -> [Help 1]
[ERROR] 
[ERROR] To see the full stack trace of the errors, re-run Maven with the -e switch.
[ERROR] Re-run Maven using the -X switch to enable full debug logging.
[ERROR] 
[ERROR] For more information about the errors and possible solutions, please read the following
articles:
[ERROR] [Help 1] http://cwiki.apache.org/confluence/display/MAVEN/MojoFailureException
[ERROR] 
[ERROR] After correcting the problems, you can resume the build with the command
[ERROR]   mvn <goals> -rf :hbase-client
Build step 'Invoke top-level Maven targets' marked build as failure
Performing Post build task...
Match found for :.* : True
Logical operation result is TRUE
Running script  :   ZOMBIE_TESTS_COUNT=`jps | grep surefirebooter | wc -l`
  if [[ $ZOMBIE_TESTS_COUNT != 0 ]] ; then
    #It seems sometimes the tests are not dying immediately. Let's give them 10s
    echo "Suspicious java process found - waiting 10s to see if there are just slow to stop"
    sleep 10
    ZOMBIE_TESTS_COUNT=`jps | grep surefirebooter | wc -l`
    if [[ $ZOMBIE_TESTS_COUNT != 0 ]] ; then
      echo "There are $ZOMBIE_TESTS_COUNT zombie tests, they should have been killed by surefire
but survived"
      echo "************ BEGIN zombies jstack extract"
      ZB_STACK=`jps | grep surefirebooter | cut -d ' ' -f 1 | xargs -n 1 jstack | grep ".test"
| grep "\.java"`
      jps | grep surefirebooter | cut -d ' ' -f 1 | xargs -n 1 jstack
      echo "************ END  zombies jstack extract"
      JIRA_COMMENT="$JIRA_COMMENT

     {color:red}-1 core zombie tests{color}.  There are ${ZOMBIE_TESTS_COUNT} zombie test(s):
${ZB_STACK}"
      BAD=1
      jps | grep surefirebooter | cut -d ' ' -f 1 | xargs kill -9
    else
      echo "We're ok: there is no zombie test, but some tests took some time to stop"
    fi
  else
    echo "We're ok: there is no zombie test"
  fi
[HBase-0.98-on-Hadoop-1.1] $ /bin/bash -xe /tmp/hudson7588266657905860817.sh
++ jps
++ grep surefirebooter
++ wc -l
+ ZOMBIE_TESTS_COUNT=0
+ [[ 0 != 0 ]]
+ echo 'We'\''re ok: there is no zombie test'
We're ok: there is no zombie test
POST BUILD TASK : SUCCESS
END OF POST BUILD TASK : 0
Archiving artifacts
Sending artifact delta relative to HBase-0.98-on-Hadoop-1.1 #708
Archived 130 artifacts
Archive block size is 32768
Received 4 blocks and 490878 bytes
Compression is 21.1%
Took 2.6 sec
Recording test results
Updating HBASE-12686
Updating HBASE-12696
Updating HBASE-12348
Updating HBASE-12493

Mime
View raw message