hbase-builds mailing list archives

Site index · List index
Message view « Date » · « Thread »
Top « Date » · « Thread »
From Stack <st...@duboce.net>
Subject Re: Build failed in Jenkins: HBase-1.0 #511
Date Thu, 27 Nov 2014 01:43:05 GMT
This is old school type failure.  Will try take a look but hopefully we are
coming stable again.


On Wed, Nov 26, 2014 at 5:31 PM, Apache Jenkins Server <
jenkins@builds.apache.org> wrote:

> See <https://builds.apache.org/job/HBase-1.0/511/>
>
> ------------------------------------------
> [...truncated 1762 lines...]
> Running
> org.apache.hadoop.hbase.security.visibility.TestVisibilityLabelsWithCustomVisLabService
> Tests run: 5, Failures: 0, Errors: 0, Skipped: 0, Time elapsed: 7.019 sec
> - in org.apache.hadoop.hbase.security.visibility.TestVisibilityLabelsWithACL
> Running
> org.apache.hadoop.hbase.security.visibility.TestVisibilityLabelsWithDefaultVisLabelService
> Tests run: 19, Failures: 0, Errors: 0, Skipped: 0, Time elapsed: 15.541
> sec - in
> org.apache.hadoop.hbase.security.visibility.TestVisibilityLabelsWithCustomVisLabService
> Running
> org.apache.hadoop.hbase.security.visibility.TestDefaultScanLabelGeneratorStack
> Tests run: 1, Failures: 0, Errors: 0, Skipped: 0, Time elapsed: 1.728 sec
> - in
> org.apache.hadoop.hbase.security.visibility.TestDefaultScanLabelGeneratorStack
> Tests run: 21, Failures: 0, Errors: 0, Skipped: 0, Time elapsed: 17.003
> sec - in
> org.apache.hadoop.hbase.security.visibility.TestVisibilityLabelsWithDefaultVisLabelService
> Running
> org.apache.hadoop.hbase.security.visibility.TestEnforcingScanLabelGenerator
> Tests run: 1, Failures: 0, Errors: 0, Skipped: 0, Time elapsed: 1.714 sec
> - in
> org.apache.hadoop.hbase.security.visibility.TestEnforcingScanLabelGenerator
> Running
> org.apache.hadoop.hbase.security.visibility.TestVisibilityLabelsWithDeletes
> Running
> org.apache.hadoop.hbase.security.visibility.TestVisibilityLabelsOpWithDifferentUsersNoACL
> Tests run: 1, Failures: 0, Errors: 0, Skipped: 0, Time elapsed: 2.659 sec
> - in
> org.apache.hadoop.hbase.security.visibility.TestVisibilityLabelsOpWithDifferentUsersNoACL
> Tests run: 49, Failures: 0, Errors: 0, Skipped: 0, Time elapsed: 196.723
> sec - in org.apache.hadoop.hbase.security.access.TestAccessController
> Running org.apache.hadoop.hbase.TestGlobalMemStoreSize
> Running
> org.apache.hadoop.hbase.security.visibility.TestVisibilityWithCheckAuths
> Tests run: 2, Failures: 0, Errors: 0, Skipped: 0, Time elapsed: 3.449 sec
> - in
> org.apache.hadoop.hbase.security.visibility.TestVisibilityWithCheckAuths
> Tests run: 1, Failures: 0, Errors: 0, Skipped: 0, Time elapsed: 11.705 sec
> - in org.apache.hadoop.hbase.TestGlobalMemStoreSize
> Running org.apache.hadoop.hbase.TestNamespace
> Tests run: 9, Failures: 0, Errors: 0, Skipped: 1, Time elapsed: 6.167 sec
> - in org.apache.hadoop.hbase.TestNamespace
> Running org.apache.hadoop.hbase.constraint.TestConstraint
> Tests run: 5, Failures: 0, Errors: 0, Skipped: 0, Time elapsed: 5.761 sec
> - in org.apache.hadoop.hbase.constraint.TestConstraint
> Tests run: 37, Failures: 0, Errors: 0, Skipped: 0, Time elapsed: 45.06 sec
> - in
> org.apache.hadoop.hbase.security.visibility.TestVisibilityLabelsWithDeletes
> Running org.apache.hadoop.hbase.filter.TestFuzzyRowAndColumnRangeFilter
> Tests run: 1, Failures: 0, Errors: 0, Skipped: 0, Time elapsed: 2.137 sec
> - in org.apache.hadoop.hbase.filter.TestFuzzyRowAndColumnRangeFilter
> Running org.apache.hadoop.hbase.filter.TestFilterWrapper
> Tests run: 1, Failures: 0, Errors: 0, Skipped: 0, Time elapsed: 1.579 sec
> - in org.apache.hadoop.hbase.filter.TestFilterWrapper
> Running org.apache.hadoop.hbase.filter.TestColumnRangeFilter
> Running org.apache.hadoop.hbase.filter.TestScanRowPrefix
> Tests run: 1, Failures: 0, Errors: 0, Skipped: 0, Time elapsed: 2.174 sec
> - in org.apache.hadoop.hbase.filter.TestScanRowPrefix
> Running org.apache.hadoop.hbase.TestHBaseTestingUtility
> Tests run: 1, Failures: 0, Errors: 0, Skipped: 0, Time elapsed: 7.121 sec
> - in org.apache.hadoop.hbase.filter.TestColumnRangeFilter
> Running org.apache.hadoop.hbase.io.encoding.TestDataBlockEncoders
> Running org.apache.hadoop.hbase.filter.TestFilterWithScanLimits
> Tests run: 1, Failures: 0, Errors: 0, Skipped: 0, Time elapsed: 2.256 sec
> - in org.apache.hadoop.hbase.filter.TestFilterWithScanLimits
> Tests run: 9, Failures: 0, Errors: 0, Skipped: 0, Time elapsed: 275.926
> sec - in org.apache.hadoop.hbase.snapshot.TestSecureExportSnapshot
> Running org.apache.hadoop.hbase.io.encoding.TestEncodedSeekers
> Tests run: 9, Failures: 0, Errors: 0, Skipped: 0, Time elapsed: 272.972
> sec - in org.apache.hadoop.hbase.snapshot.TestExportSnapshot
> Running org.apache.hadoop.hbase.io.encoding.TestChangingEncoding
> Running org.apache.hadoop.hbase.io.encoding.TestPrefixTree
> Tests run: 1, Failures: 0, Errors: 0, Skipped: 0, Time elapsed: 1.941 sec
> - in org.apache.hadoop.hbase.io.encoding.TestPrefixTree
> Running org.apache.hadoop.hbase.io.encoding.TestBufferedDataBlockEncoder
> Tests run: 7, Failures: 0, Errors: 0, Skipped: 0, Time elapsed: 36.015 sec
> - in org.apache.hadoop.hbase.TestHBaseTestingUtility
> Running org.apache.hadoop.hbase.io.encoding.TestLoadAndSwitchEncodeOnDisk
> Tests run: 1, Failures: 0, Errors: 0, Skipped: 0, Time elapsed: 25.654 sec
> - in org.apache.hadoop.hbase.io.encoding.TestBufferedDataBlockEncoder
> Running org.apache.hadoop.hbase.io.hfile.TestScannerSelectionUsingTTL
> Tests run: 1, Failures: 0, Errors: 0, Skipped: 0, Time elapsed: 20.867 sec
> - in org.apache.hadoop.hbase.io.encoding.TestLoadAndSwitchEncodeOnDisk
> Running org.apache.hadoop.hbase.io.hfile.TestHFileBlock
> Tests run: 20, Failures: 0, Errors: 0, Skipped: 0, Time elapsed: 93.255
> sec - in org.apache.hadoop.hbase.io.encoding.TestEncodedSeekers
> Running org.apache.hadoop.hbase.io.hfile.TestCacheOnWrite
> Tests run: 6, Failures: 0, Errors: 0, Skipped: 0, Time elapsed: 62.493 sec
> - in org.apache.hadoop.hbase.io.hfile.TestScannerSelectionUsingTTL
> Tests run: 3, Failures: 0, Errors: 0, Skipped: 0, Time elapsed: 100.944
> sec - in org.apache.hadoop.hbase.io.encoding.TestChangingEncoding
> Running org.apache.hadoop.hbase.io.hfile.TestHFileBlockIndex
> Running org.apache.hadoop.hbase.io.hfile.TestHFileSeek
> Tests run: 2, Failures: 0, Errors: 0, Skipped: 0, Time elapsed: 1.019 sec
> - in org.apache.hadoop.hbase.io.hfile.TestHFileBlockIndex
> Tests run: 1, Failures: 0, Errors: 0, Skipped: 0, Time elapsed: 2.233 sec
> - in org.apache.hadoop.hbase.io.hfile.TestHFileSeek
> Running org.apache.hadoop.hbase.io.hfile.TestCacheConfig
> Tests run: 6, Failures: 0, Errors: 0, Skipped: 0, Time elapsed: 1.951 sec
> - in org.apache.hadoop.hbase.io.hfile.TestCacheConfig
> Running org.apache.hadoop.hbase.io.hfile.TestForceCacheImportantBlocks
> Running org.apache.hadoop.hbase.io.TestFileLink
> Tests run: 3, Failures: 0, Errors: 0, Skipped: 0, Time elapsed: 14.985 sec
> - in org.apache.hadoop.hbase.io.TestFileLink
> Running org.apache.hadoop.hbase.procedure.TestZKProcedure
> Tests run: 4, Failures: 0, Errors: 0, Skipped: 0, Time elapsed: 2.009 sec
> - in org.apache.hadoop.hbase.procedure.TestZKProcedure
> Running org.apache.hadoop.hbase.procedure.TestZKProcedureControllers
> Tests run: 4, Failures: 0, Errors: 0, Skipped: 0, Time elapsed: 1.615 sec
> - in org.apache.hadoop.hbase.procedure.TestZKProcedureControllers
> Tests run: 28, Failures: 0, Errors: 0, Skipped: 0, Time elapsed: 94.369
> sec - in org.apache.hadoop.hbase.io.hfile.TestHFileBlock
> Running org.apache.hadoop.hbase.ipc.TestHBaseClient
> Tests run: 1, Failures: 0, Errors: 0, Skipped: 0, Time elapsed: 0.389 sec
> - in org.apache.hadoop.hbase.ipc.TestHBaseClient
> Running org.apache.hadoop.hbase.ipc.TestDelayedRpc
> Running org.apache.hadoop.hbase.ipc.TestProtoBufRpc
> Tests run: 1, Failures: 0, Errors: 0, Skipped: 0, Time elapsed: 1.609 sec
> - in org.apache.hadoop.hbase.ipc.TestProtoBufRpc
> Running org.apache.hadoop.hbase.TestLocalHBaseCluster
> Tests run: 4, Failures: 0, Errors: 0, Skipped: 0, Time elapsed: 3.531 sec
> - in org.apache.hadoop.hbase.ipc.TestDelayedRpc
> Running org.apache.hadoop.hbase.TestAcidGuarantees
> Tests run: 1, Failures: 0, Errors: 0, Skipped: 0, Time elapsed: 7.67 sec -
> in org.apache.hadoop.hbase.TestLocalHBaseCluster
> Tests run: 4, Failures: 0, Errors: 0, Skipped: 0, Time elapsed: 39.831 sec
> - in org.apache.hadoop.hbase.io.hfile.TestForceCacheImportantBlocks
> Running org.apache.hadoop.hbase.zookeeper.TestRecoverableZooKeeper
> Tests run: 1, Failures: 0, Errors: 0, Skipped: 0, Time elapsed: 1.269 sec
> - in org.apache.hadoop.hbase.zookeeper.TestRecoverableZooKeeper
> Running org.apache.hadoop.hbase.zookeeper.TestZooKeeperNodeTracker
> Tests run: 3, Failures: 0, Errors: 0, Skipped: 0, Time elapsed: 1.005 sec
> - in org.apache.hadoop.hbase.zookeeper.TestZooKeeperNodeTracker
> Running org.apache.hadoop.hbase.zookeeper.TestZooKeeperACL
> Tests run: 6, Failures: 0, Errors: 0, Skipped: 0, Time elapsed: 0.313 sec
> - in org.apache.hadoop.hbase.zookeeper.TestZooKeeperACL
> Running org.apache.hadoop.hbase.zookeeper.TestZKTableStateManager
> Tests run: 1, Failures: 0, Errors: 0, Skipped: 0, Time elapsed: 0.839 sec
> - in org.apache.hadoop.hbase.zookeeper.TestZKTableStateManager
> Running org.apache.hadoop.hbase.zookeeper.TestHQuorumPeer
> Running org.apache.hadoop.hbase.zookeeper.TestZKLeaderManager
> Tests run: 1, Failures: 0, Errors: 0, Skipped: 0, Time elapsed: 0.131 sec
> - in org.apache.hadoop.hbase.zookeeper.TestZKLeaderManager
> Tests run: 3, Failures: 0, Errors: 0, Skipped: 0, Time elapsed: 1.667 sec
> - in org.apache.hadoop.hbase.zookeeper.TestHQuorumPeer
> Running org.apache.hadoop.hbase.zookeeper.TestZKMulti
> Running
> org.apache.hadoop.hbase.zookeeper.lock.TestZKInterProcessReadWriteLock
> Tests run: 6, Failures: 0, Errors: 0, Skipped: 0, Time elapsed: 0.348 sec
> - in org.apache.hadoop.hbase.zookeeper.TestZKMulti
> Running org.apache.hadoop.hbase.TestJMXListener
> Tests run: 6, Failures: 0, Errors: 0, Skipped: 0, Time elapsed: 24.461 sec
> - in org.apache.hadoop.hbase.zookeeper.lock.TestZKInterProcessReadWriteLock
> Tests run: 2, Failures: 0, Errors: 0, Skipped: 0, Time elapsed: 16.39 sec
> - in org.apache.hadoop.hbase.TestJMXListener
> Running org.apache.hadoop.hbase.TestMetaTableAccessorNoCluster
> Tests run: 2, Failures: 0, Errors: 0, Skipped: 0, Time elapsed: 3.705 sec
> - in org.apache.hadoop.hbase.TestMetaTableAccessorNoCluster
> Running org.apache.hadoop.hbase.TestZooKeeper
> Running
> org.apache.hadoop.hbase.replication.regionserver.TestReplicationHLogReaderManager
> Tests run: 72, Failures: 0, Errors: 0, Skipped: 0, Time elapsed: 122.759
> sec - in org.apache.hadoop.hbase.io.hfile.TestCacheOnWrite
> Running
> org.apache.hadoop.hbase.replication.regionserver.TestReplicationSink
> Tests run: 3, Failures: 0, Errors: 0, Skipped: 0, Time elapsed: 82.641 sec
> - in org.apache.hadoop.hbase.TestAcidGuarantees
> Tests run: 5, Failures: 0, Errors: 0, Skipped: 0, Time elapsed: 2.275 sec
> - in org.apache.hadoop.hbase.replication.regionserver.TestReplicationSink
> Running org.apache.hadoop.hbase.replication.TestReplicationTrackerZKImpl
> Running
> org.apache.hadoop.hbase.replication.regionserver.TestReplicationSourceManager
> Tests run: 5, Failures: 0, Errors: 0, Skipped: 0, Time elapsed: 1.065 sec
> - in org.apache.hadoop.hbase.replication.TestReplicationTrackerZKImpl
> Tests run: 4, Failures: 0, Errors: 0, Skipped: 0, Time elapsed: 2.826 sec
> - in
> org.apache.hadoop.hbase.replication.regionserver.TestReplicationSourceManager
> Tests run: 28, Failures: 0, Errors: 0, Skipped: 0, Time elapsed: 252.538
> sec - in org.apache.hadoop.hbase.io.encoding.TestDataBlockEncoders
> Running org.apache.hadoop.hbase.replication.TestMultiSlaveReplication
> Running
> org.apache.hadoop.hbase.replication.TestReplicationKillMasterRSCompressed
> Running org.apache.hadoop.hbase.replication.TestReplicationKillMasterRS
> Tests run: 1, Failures: 0, Errors: 0, Skipped: 0, Time elapsed: 16.928 sec
> - in
> org.apache.hadoop.hbase.replication.TestReplicationKillMasterRSCompressed
> Tests run: 1, Failures: 0, Errors: 0, Skipped: 0, Time elapsed: 16.271 sec
> - in org.apache.hadoop.hbase.replication.TestReplicationKillMasterRS
> Tests run: 1, Failures: 0, Errors: 0, Skipped: 0, Time elapsed: 26.615 sec
> - in org.apache.hadoop.hbase.replication.TestMultiSlaveReplication
> Running
> org.apache.hadoop.hbase.replication.TestReplicationChangingPeerRegionservers
> Running org.apache.hadoop.hbase.replication.TestReplicationKillSlaveRS
> Tests run: 1, Failures: 0, Errors: 0, Skipped: 0, Time elapsed: 5.377 sec
> - in
> org.apache.hadoop.hbase.replication.TestReplicationChangingPeerRegionservers
> Running org.apache.hadoop.hbase.replication.TestPerTableCFReplication
> Tests run: 1, Failures: 0, Errors: 0, Skipped: 0, Time elapsed: 13.73 sec
> - in org.apache.hadoop.hbase.replication.TestReplicationKillSlaveRS
> Running org.apache.hadoop.hbase.replication.TestMasterReplication
> Running
> org.apache.hadoop.hbase.replication.TestReplicationDisableInactivePeer
> Tests run: 2, Failures: 0, Errors: 0, Skipped: 0, Time elapsed: 24.091 sec
> - in org.apache.hadoop.hbase.replication.TestPerTableCFReplication
> Tests run: 1, Failures: 0, Errors: 0, Skipped: 0, Time elapsed: 19.439 sec
> - in org.apache.hadoop.hbase.replication.TestReplicationDisableInactivePeer
> Running org.apache.hadoop.hbase.replication.TestReplicationWithTags
> Tests run: 1, Failures: 0, Errors: 0, Skipped: 0, Time elapsed: 2.561 sec
> - in org.apache.hadoop.hbase.replication.TestReplicationWithTags
> Running org.apache.hadoop.hbase.replication.TestReplicationEndpoint
> Tests run: 3, Failures: 0, Errors: 0, Skipped: 0, Time elapsed: 2.03 sec -
> in org.apache.hadoop.hbase.replication.TestReplicationEndpoint
> Running org.apache.hadoop.hbase.replication.TestReplicationSmallTests
> Running org.apache.hadoop.hbase.replication.TestReplicationSource
> Tests run: 1, Failures: 0, Errors: 0, Skipped: 0, Time elapsed: 0.497 sec
> - in org.apache.hadoop.hbase.replication.TestReplicationSource
> Tests run: 11, Failures: 0, Errors: 0, Skipped: 0, Time elapsed: 156.964
> sec - in org.apache.hadoop.hbase.TestZooKeeper
> Tests run: 3, Failures: 0, Errors: 0, Skipped: 0, Time elapsed: 60.409 sec
> - in org.apache.hadoop.hbase.replication.TestMasterReplication
> Running org.apache.hadoop.hbase.fs.TestBlockReorder
> Running org.apache.hadoop.hbase.replication.TestReplicationStateZKImpl
> Tests run: 6, Failures: 0, Errors: 0, Skipped: 0, Time elapsed: 0.922 sec
> - in org.apache.hadoop.hbase.replication.TestReplicationStateZKImpl
> Running org.apache.hadoop.hbase.replication.TestReplicationSyncUpTool
> Running org.apache.hadoop.hbase.trace.TestHTraceHooks
> Tests run: 1, Failures: 0, Errors: 0, Skipped: 0, Time elapsed: 1.913 sec
> - in org.apache.hadoop.hbase.trace.TestHTraceHooks
> Tests run: 3, Failures: 0, Errors: 0, Skipped: 0, Time elapsed: 19.303 sec
> - in org.apache.hadoop.hbase.fs.TestBlockReorder
> Running org.apache.hadoop.hbase.TestMetaTableLocator
> Tests run: 7, Failures: 0, Errors: 0, Skipped: 0, Time elapsed: 3.417 sec
> - in org.apache.hadoop.hbase.TestMetaTableLocator
> Tests run: 9, Failures: 0, Errors: 0, Skipped: 0, Time elapsed: 37.541 sec
> - in org.apache.hadoop.hbase.replication.TestReplicationSmallTests
> Running org.apache.hadoop.hbase.mapred.TestTableSnapshotInputFormat
> Running org.apache.hadoop.hbase.mapred.TestTableInputFormat
> Tests run: 10, Failures: 0, Errors: 0, Skipped: 0, Time elapsed: 5.758 sec
> - in org.apache.hadoop.hbase.mapred.TestTableInputFormat
> Running org.apache.hadoop.hbase.mapred.TestTableMapReduceUtil
> Tests run: 1, Failures: 0, Errors: 0, Skipped: 0, Time elapsed: 46.34 sec
> - in org.apache.hadoop.hbase.replication.TestReplicationSyncUpTool
> Tests run: 8, Failures: 0, Errors: 0, Skipped: 0, Time elapsed: 209.865
> sec - in
> org.apache.hadoop.hbase.replication.regionserver.TestReplicationHLogReaderManager
> Running org.apache.hadoop.hbase.TestMultiVersions
> Running org.apache.hadoop.hbase.TestMetaMigrationConvertingToPB
> Running org.apache.hadoop.hbase.mapred.TestTableMapReduce
> Tests run: 3, Failures: 0, Errors: 0, Skipped: 0, Time elapsed: 1.9 sec -
> in org.apache.hadoop.hbase.TestMetaMigrationConvertingToPB
> Tests run: 3, Failures: 0, Errors: 0, Skipped: 0, Time elapsed: 5.562 sec
> - in org.apache.hadoop.hbase.TestMultiVersions
> Tests run: 4, Failures: 0, Errors: 0, Skipped: 0, Time elapsed: 87.788 sec
> - in org.apache.hadoop.hbase.mapred.TestTableMapReduceUtil
> Tests run: 2, Failures: 0, Errors: 0, Skipped: 0, Time elapsed: 95.427 sec
> - in org.apache.hadoop.hbase.mapred.TestTableMapReduce
> Tests run: 6, Failures: 0, Errors: 0, Skipped: 0, Time elapsed: 269.304
> sec - in org.apache.hadoop.hbase.mapred.TestTableSnapshotInputFormat
>
> Results :
>
> Failed tests:
>   TestMultiParallel.testActiveThreadsCount:163 expected:<5> but was:<4>
>
>
>
> Tests run: 2086, Failures: 1, Errors: 0, Skipped: 19
>
> [INFO]
> ------------------------------------------------------------------------
> [INFO] Reactor Summary:
> [INFO]
> [INFO] HBase ............................................. SUCCESS [2.982s]
> [INFO] HBase - Checkstyle ................................ SUCCESS [0.646s]
> [INFO] HBase - Annotations ............................... SUCCESS [0.813s]
> [INFO] HBase - Common .................................... SUCCESS
> [1:03.373s]
> [INFO] HBase - Protocol .................................. SUCCESS [8.945s]
> [INFO] HBase - Client .................................... SUCCESS
> [1:18.818s]
> [INFO] HBase - Hadoop Compatibility ...................... SUCCESS [6.908s]
> [INFO] HBase - Hadoop Two Compatibility .................. SUCCESS [5.537s]
> [INFO] HBase - Prefix Tree ............................... SUCCESS [8.148s]
> [INFO] HBase - Server .................................... FAILURE
> [1:00:04.348s]
> [INFO] HBase - Testing Util .............................. SKIPPED
> [INFO] HBase - Thrift .................................... SKIPPED
> [INFO] HBase - Rest ...................................... SKIPPED
> [INFO] HBase - Shell ..................................... SKIPPED
> [INFO] HBase - Integration Tests ......................... SKIPPED
> [INFO] HBase - Examples .................................. SKIPPED
> [INFO] HBase - Assembly .................................. SKIPPED
> [INFO]
> ------------------------------------------------------------------------
> [INFO] BUILD FAILURE
> [INFO]
> ------------------------------------------------------------------------
> [INFO] Total time: 1:03:01.347s
> [INFO] Finished at: Thu Nov 27 01:29:06 UTC 2014
> [INFO] Final Memory: 46M/1118M
> [INFO]
> ------------------------------------------------------------------------
> [ERROR] Failed to execute goal
> org.apache.maven.plugins:maven-surefire-plugin:2.18:test
> (secondPartTestsExecution) on project hbase-server: There are test failures.
> [ERROR]
> [ERROR] Please refer to <
> https://builds.apache.org/job/HBase-1.0/ws/hbase-server/target/surefire-reports>
> for the individual test results.
> [ERROR] -> [Help 1]
> [ERROR]
> [ERROR] To see the full stack trace of the errors, re-run Maven with the
> -e switch.
> [ERROR] Re-run Maven using the -X switch to enable full debug logging.
> [ERROR]
> [ERROR] For more information about the errors and possible solutions,
> please read the following articles:
> [ERROR] [Help 1]
> http://cwiki.apache.org/confluence/display/MAVEN/MojoFailureException
> [ERROR]
> [ERROR] After correcting the problems, you can resume the build with the
> command
> [ERROR]   mvn <goals> -rf :hbase-server
> Build step 'Invoke top-level Maven targets' marked build as failure
> Performing Post build task...
> Match found for :.* : True
> Logical operation result is TRUE
> Running script  :   ZOMBIE_TESTS_COUNT=`jps | grep surefirebooter | wc -l`
>   if [[ $ZOMBIE_TESTS_COUNT != 0 ]] ; then
>     #It seems sometimes the tests are not dying immediately. Let's give
> them 10s
>     echo "Suspicious java process found - waiting 10s to see if there are
> just slow to stop"
>     sleep 10
>     ZOMBIE_TESTS_COUNT=`jps | grep surefirebooter | wc -l`
>     if [[ $ZOMBIE_TESTS_COUNT != 0 ]] ; then
>       echo "There are $ZOMBIE_TESTS_COUNT zombie tests, they should have
> been killed by surefire but survived"
>       echo "************ BEGIN zombies jstack extract"
>       ZB_STACK=`jps | grep surefirebooter | cut -d ' ' -f 1 | xargs -n 1
> jstack | grep ".test" | grep "\.java"`
>       jps | grep surefirebooter | cut -d ' ' -f 1 | xargs -n 1 jstack
>       echo "************ END  zombies jstack extract"
>       JIRA_COMMENT="$JIRA_COMMENT
>
>      {color:red}-1 core zombie tests{color}.  There are
> ${ZOMBIE_TESTS_COUNT} zombie test(s): ${ZB_STACK}"
>       BAD=1
>       jps | grep surefirebooter | cut -d ' ' -f 1 | xargs kill -9
>     else
>       echo "We're ok: there is no zombie test, but some tests took some
> time to stop"
>     fi
>   else
>     echo "We're ok: there is no zombie test"
>   fi
> [HBase-1.0] $ /bin/bash -xe /tmp/hudson4989163407505550192.sh
> ++ jps
> ++ wc -l
> ++ grep surefirebooter
> + ZOMBIE_TESTS_COUNT=0
> + [[ 0 != 0 ]]
> + echo 'We'\''re ok: there is no zombie test'
> We're ok: there is no zombie test
> POST BUILD TASK : SUCCESS
> END OF POST BUILD TASK : 0
> Archiving artifacts
> Sending artifact delta relative to HBase-1.0 #510
> Archived 1793 artifacts
> Archive block size is 32768
> Received 31 blocks and 348993917 bytes
> Compression is 0.3%
> Took 1 min 25 sec
> Recording test results
>

Mime
  • Unnamed multipart/alternative (inline, None, 0 bytes)
View raw message