hbase-builds mailing list archives

Site index · List index
Message view « Date » · « Thread »
Top « Date » · « Thread »
From Apache Jenkins Server <jenk...@builds.apache.org>
Subject Build failed in Jenkins: HBase-1.0 #488
Date Fri, 21 Nov 2014 02:42:46 GMT
See <https://builds.apache.org/job/HBase-1.0/488/changes>

Changes:

[stack] HBASE-12541 Add misc debug logging to hanging tests in TestHCM and TestBaseLoadBalancer

------------------------------------------
[...truncated 744 lines...]
[INFO] 
[INFO] --- maven-surefire-plugin:2.18:test (secondPartTestsExecution) @ hbase-prefix-tree
---
[INFO] Tests are skipped.
[INFO] 
[INFO] --- jacoco-maven-plugin:0.6.2.201302030002:report (report) @ hbase-prefix-tree ---
[INFO] Skipping JaCoCo execution
[INFO] 
[INFO] --- maven-source-plugin:2.2.1:jar-no-fork (attach-sources) @ hbase-prefix-tree ---
[INFO] Building jar: <https://builds.apache.org/job/HBase-1.0/ws/hbase-prefix-tree/target/hbase-prefix-tree-0.99.2-SNAPSHOT-sources.jar>
[INFO] 
[INFO] --- maven-jar-plugin:2.4:test-jar (default) @ hbase-prefix-tree ---
[INFO] Building jar: <https://builds.apache.org/job/HBase-1.0/ws/hbase-prefix-tree/target/hbase-prefix-tree-0.99.2-SNAPSHOT-tests.jar>
[INFO] 
[INFO] --- maven-jar-plugin:2.4:jar (default-jar) @ hbase-prefix-tree ---
[INFO] Building jar: <https://builds.apache.org/job/HBase-1.0/ws/hbase-prefix-tree/target/hbase-prefix-tree-0.99.2-SNAPSHOT.jar>
[INFO] 
[INFO] --- maven-install-plugin:2.3.1:install (default-install) @ hbase-prefix-tree ---
[INFO] Installing <https://builds.apache.org/job/HBase-1.0/ws/hbase-prefix-tree/target/hbase-prefix-tree-0.99.2-SNAPSHOT.jar>
to /home/jenkins/.m2/repository/org/apache/hbase/hbase-prefix-tree/0.99.2-SNAPSHOT/hbase-prefix-tree-0.99.2-SNAPSHOT.jar
[INFO] Installing <https://builds.apache.org/job/HBase-1.0/ws/hbase-prefix-tree/pom.xml>
to /home/jenkins/.m2/repository/org/apache/hbase/hbase-prefix-tree/0.99.2-SNAPSHOT/hbase-prefix-tree-0.99.2-SNAPSHOT.pom
[INFO] Installing <https://builds.apache.org/job/HBase-1.0/ws/hbase-prefix-tree/target/hbase-prefix-tree-0.99.2-SNAPSHOT-sources.jar>
to /home/jenkins/.m2/repository/org/apache/hbase/hbase-prefix-tree/0.99.2-SNAPSHOT/hbase-prefix-tree-0.99.2-SNAPSHOT-sources.jar
[INFO] Installing <https://builds.apache.org/job/HBase-1.0/ws/hbase-prefix-tree/target/hbase-prefix-tree-0.99.2-SNAPSHOT-tests.jar>
to /home/jenkins/.m2/repository/org/apache/hbase/hbase-prefix-tree/0.99.2-SNAPSHOT/hbase-prefix-tree-0.99.2-SNAPSHOT-tests.jar
[INFO]                                                                         
[INFO] ------------------------------------------------------------------------
[INFO] Building HBase - Server 0.99.2-SNAPSHOT
[INFO] ------------------------------------------------------------------------
[INFO] 
[INFO] --- maven-enforcer-plugin:1.0.1:enforce (enforce) @ hbase-server ---
[INFO] 
[INFO] --- jacoco-maven-plugin:0.6.2.201302030002:prepare-agent (prepare-agent) @ hbase-server
---
[INFO] Skipping JaCoCo execution
[INFO] argLine set to 
[INFO] 
[INFO] --- maven-antrun-plugin:1.6:run (generate) @ hbase-server ---
[INFO] Executing tasks

main:
    [mkdir] Created dir: <https://builds.apache.org/job/HBase-1.0/ws/hbase-server/target/hbase-webapps>
     [copy] Copying 20 files to <https://builds.apache.org/job/HBase-1.0/ws/hbase-server/target/hbase-webapps>
log4j:WARN No appenders could be found for logger (org.mortbay.log).
log4j:WARN Please initialize the log4j system properly.
log4j:WARN See http://logging.apache.org/log4j/1.2/faq.html#noconfig for more info.
    [mkdir] Created dir: <https://builds.apache.org/job/HBase-1.0/ws/hbase-server/target/hbase-webapps/master/WEB-INF>
    [mkdir] Created dir: <https://builds.apache.org/job/HBase-1.0/ws/hbase-server/target/hbase-webapps/regionserver/WEB-INF>
[INFO] Executed tasks
[INFO] 
[INFO] --- build-helper-maven-plugin:1.9.1:add-source (jspcSource-packageInfo-source) @ hbase-server
---
[INFO] Source directory: <https://builds.apache.org/job/HBase-1.0/ws/hbase-server/target/generated-jamon>
added.
[INFO] Source directory: <https://builds.apache.org/job/HBase-1.0/ws/hbase-server/target/generated-sources/java>
added.
[INFO] 
[INFO] --- jamon-maven-plugin:2.3.4:translate (default) @ hbase-server ---
[INFO] Translating 10 templates from <https://builds.apache.org/job/HBase-1.0/ws/hbase-server/src/main/jamon>
to <https://builds.apache.org/job/HBase-1.0/ws/hbase-server/target/generated-jamon>
[INFO] 
[INFO] --- maven-remote-resources-plugin:1.4:process (default) @ hbase-server ---
[INFO] 
[INFO] --- maven-resources-plugin:2.6:resources (default-resources) @ hbase-server ---
[INFO] Using 'UTF-8' encoding to copy filtered resources.
[INFO] Copying 22 resources
[INFO] Copying 3 resources
[INFO] 
[INFO] --- maven-compiler-plugin:2.5.1:compile (default-compile) @ hbase-server ---
[INFO] Compiling 701 source files to <https://builds.apache.org/job/HBase-1.0/ws/hbase-server/target/classes>
[INFO] 
[INFO] --- maven-dependency-plugin:2.1:build-classpath (create-mrapp-generated-classpath)
@ hbase-server ---
[INFO] Wrote classpath file '<https://builds.apache.org/job/HBase-1.0/ws/hbase-server/target/test-classes/mrapp-generated-classpath'.>
[INFO] 
[INFO] --- maven-resources-plugin:2.6:testResources (default-testResources) @ hbase-server
---
[INFO] Using 'UTF-8' encoding to copy filtered resources.
[INFO] Copying 11 resources
[INFO] Copying 3 resources
[INFO] 
[INFO] --- maven-compiler-plugin:2.5.1:testCompile (default-testCompile) @ hbase-server ---
[INFO] Compiling 632 source files to <https://builds.apache.org/job/HBase-1.0/ws/hbase-server/target/test-classes>
[INFO] -------------------------------------------------------------
[ERROR] COMPILATION ERROR : 
[INFO] -------------------------------------------------------------
[ERROR] <https://builds.apache.org/job/HBase-1.0/ws/hbase-server/src/test/java/org/apache/hadoop/hbase/http/ssl/KeyStoreTestUtil.java>:[46,24]
AlgorithmId is internal proprietary API and may be removed in a future release
[ERROR] <https://builds.apache.org/job/HBase-1.0/ws/hbase-server/src/test/java/org/apache/hadoop/hbase/http/ssl/KeyStoreTestUtil.java>:[47,24]
CertificateAlgorithmId is internal proprietary API and may be removed in a future release
[ERROR] <https://builds.apache.org/job/HBase-1.0/ws/hbase-server/src/test/java/org/apache/hadoop/hbase/http/ssl/KeyStoreTestUtil.java>:[48,24]
CertificateIssuerName is internal proprietary API and may be removed in a future release
[ERROR] <https://builds.apache.org/job/HBase-1.0/ws/hbase-server/src/test/java/org/apache/hadoop/hbase/http/ssl/KeyStoreTestUtil.java>:[49,24]
CertificateSerialNumber is internal proprietary API and may be removed in a future release
[ERROR] <https://builds.apache.org/job/HBase-1.0/ws/hbase-server/src/test/java/org/apache/hadoop/hbase/http/ssl/KeyStoreTestUtil.java>:[50,24]
CertificateSubjectName is internal proprietary API and may be removed in a future release
[ERROR] <https://builds.apache.org/job/HBase-1.0/ws/hbase-server/src/test/java/org/apache/hadoop/hbase/http/ssl/KeyStoreTestUtil.java>:[51,24]
CertificateValidity is internal proprietary API and may be removed in a future release
[ERROR] <https://builds.apache.org/job/HBase-1.0/ws/hbase-server/src/test/java/org/apache/hadoop/hbase/http/ssl/KeyStoreTestUtil.java>:[52,24]
CertificateVersion is internal proprietary API and may be removed in a future release
[ERROR] <https://builds.apache.org/job/HBase-1.0/ws/hbase-server/src/test/java/org/apache/hadoop/hbase/http/ssl/KeyStoreTestUtil.java>:[53,24]
CertificateX509Key is internal proprietary API and may be removed in a future release
[ERROR] <https://builds.apache.org/job/HBase-1.0/ws/hbase-server/src/test/java/org/apache/hadoop/hbase/http/ssl/KeyStoreTestUtil.java>:[54,24]
X500Name is internal proprietary API and may be removed in a future release
[ERROR] <https://builds.apache.org/job/HBase-1.0/ws/hbase-server/src/test/java/org/apache/hadoop/hbase/http/ssl/KeyStoreTestUtil.java>:[55,24]
X509CertImpl is internal proprietary API and may be removed in a future release
[ERROR] <https://builds.apache.org/job/HBase-1.0/ws/hbase-server/src/test/java/org/apache/hadoop/hbase/http/ssl/KeyStoreTestUtil.java>:[56,24]
X509CertInfo is internal proprietary API and may be removed in a future release
[ERROR] <https://builds.apache.org/job/HBase-1.0/ws/hbase-server/src/test/java/org/apache/hadoop/hbase/client/TestHCM.java>:[1026,13]
error: cannot find symbol
[ERROR]   symbol:   method waitUntilNoRegionsInTransition(int)
  location: variable TEST_UTIL of type HBaseTestingUtility
<https://builds.apache.org/job/HBase-1.0/ws/hbase-server/src/test/java/org/apache/hadoop/hbase/http/ssl/KeyStoreTestUtil.java>:[85,4]
X509CertInfo is internal proprietary API and may be removed in a future release
[ERROR] <https://builds.apache.org/job/HBase-1.0/ws/hbase-server/src/test/java/org/apache/hadoop/hbase/http/ssl/KeyStoreTestUtil.java>:[85,28]
X509CertInfo is internal proprietary API and may be removed in a future release
[ERROR] <https://builds.apache.org/job/HBase-1.0/ws/hbase-server/src/test/java/org/apache/hadoop/hbase/http/ssl/KeyStoreTestUtil.java>:[88,4]
CertificateValidity is internal proprietary API and may be removed in a future release
[ERROR] <https://builds.apache.org/job/HBase-1.0/ws/hbase-server/src/test/java/org/apache/hadoop/hbase/http/ssl/KeyStoreTestUtil.java>:[88,39]
CertificateValidity is internal proprietary API and may be removed in a future release
[ERROR] <https://builds.apache.org/job/HBase-1.0/ws/hbase-server/src/test/java/org/apache/hadoop/hbase/http/ssl/KeyStoreTestUtil.java>:[90,4]
X500Name is internal proprietary API and may be removed in a future release
[ERROR] <https://builds.apache.org/job/HBase-1.0/ws/hbase-server/src/test/java/org/apache/hadoop/hbase/http/ssl/KeyStoreTestUtil.java>:[90,25]
X500Name is internal proprietary API and may be removed in a future release
[ERROR] <https://builds.apache.org/job/HBase-1.0/ws/hbase-server/src/test/java/org/apache/hadoop/hbase/http/ssl/KeyStoreTestUtil.java>:[92,13]
X509CertInfo is internal proprietary API and may be removed in a future release
[ERROR] <https://builds.apache.org/job/HBase-1.0/ws/hbase-server/src/test/java/org/apache/hadoop/hbase/http/ssl/KeyStoreTestUtil.java>:[93,13]
X509CertInfo is internal proprietary API and may be removed in a future release
[ERROR] <https://builds.apache.org/job/HBase-1.0/ws/hbase-server/src/test/java/org/apache/hadoop/hbase/http/ssl/KeyStoreTestUtil.java>:[93,45]
CertificateSerialNumber is internal proprietary API and may be removed in a future release
[ERROR] <https://builds.apache.org/job/HBase-1.0/ws/hbase-server/src/test/java/org/apache/hadoop/hbase/http/ssl/KeyStoreTestUtil.java>:[94,13]
X509CertInfo is internal proprietary API and may be removed in a future release
[ERROR] <https://builds.apache.org/job/HBase-1.0/ws/hbase-server/src/test/java/org/apache/hadoop/hbase/http/ssl/KeyStoreTestUtil.java>:[94,39]
CertificateSubjectName is internal proprietary API and may be removed in a future release
[ERROR] <https://builds.apache.org/job/HBase-1.0/ws/hbase-server/src/test/java/org/apache/hadoop/hbase/http/ssl/KeyStoreTestUtil.java>:[95,13]
X509CertInfo is internal proprietary API and may be removed in a future release
[ERROR] <https://builds.apache.org/job/HBase-1.0/ws/hbase-server/src/test/java/org/apache/hadoop/hbase/http/ssl/KeyStoreTestUtil.java>:[95,38]
CertificateIssuerName is internal proprietary API and may be removed in a future release
[ERROR] <https://builds.apache.org/job/HBase-1.0/ws/hbase-server/src/test/java/org/apache/hadoop/hbase/http/ssl/KeyStoreTestUtil.java>:[96,13]
X509CertInfo is internal proprietary API and may be removed in a future release
[ERROR] <https://builds.apache.org/job/HBase-1.0/ws/hbase-server/src/test/java/org/apache/hadoop/hbase/http/ssl/KeyStoreTestUtil.java>:[96,35]
CertificateX509Key is internal proprietary API and may be removed in a future release
[ERROR] <https://builds.apache.org/job/HBase-1.0/ws/hbase-server/src/test/java/org/apache/hadoop/hbase/http/ssl/KeyStoreTestUtil.java>:[98,11]
X509CertInfo is internal proprietary API and may be removed in a future release
[ERROR] <https://builds.apache.org/job/HBase-1.0/ws/hbase-server/src/test/java/org/apache/hadoop/hbase/http/ssl/KeyStoreTestUtil.java>:[98,37]
CertificateVersion is internal proprietary API and may be removed in a future release
[ERROR] <https://builds.apache.org/job/HBase-1.0/ws/hbase-server/src/test/java/org/apache/hadoop/hbase/http/ssl/KeyStoreTestUtil.java>:[98,56]
CertificateVersion is internal proprietary API and may be removed in a future release
[ERROR] <https://builds.apache.org/job/HBase-1.0/ws/hbase-server/src/test/java/org/apache/hadoop/hbase/http/ssl/KeyStoreTestUtil.java>:[99,4]
AlgorithmId is internal proprietary API and may be removed in a future release
[ERROR] <https://builds.apache.org/job/HBase-1.0/ws/hbase-server/src/test/java/org/apache/hadoop/hbase/http/ssl/KeyStoreTestUtil.java>:[99,27]
AlgorithmId is internal proprietary API and may be removed in a future release
[ERROR] <https://builds.apache.org/job/HBase-1.0/ws/hbase-server/src/test/java/org/apache/hadoop/hbase/http/ssl/KeyStoreTestUtil.java>:[99,39]
AlgorithmId is internal proprietary API and may be removed in a future release
[ERROR] <https://builds.apache.org/job/HBase-1.0/ws/hbase-server/src/test/java/org/apache/hadoop/hbase/http/ssl/KeyStoreTestUtil.java>:[100,13]
X509CertInfo is internal proprietary API and may be removed in a future release
[ERROR] <https://builds.apache.org/job/HBase-1.0/ws/hbase-server/src/test/java/org/apache/hadoop/hbase/http/ssl/KeyStoreTestUtil.java>:[100,44]
CertificateAlgorithmId is internal proprietary API and may be removed in a future release
[ERROR] <https://builds.apache.org/job/HBase-1.0/ws/hbase-server/src/test/java/org/apache/hadoop/hbase/http/ssl/KeyStoreTestUtil.java>:[103,4]
X509CertImpl is internal proprietary API and may be removed in a future release
[ERROR] <https://builds.apache.org/job/HBase-1.0/ws/hbase-server/src/test/java/org/apache/hadoop/hbase/http/ssl/KeyStoreTestUtil.java>:[103,28]
X509CertImpl is internal proprietary API and may be removed in a future release
[ERROR] <https://builds.apache.org/job/HBase-1.0/ws/hbase-server/src/test/java/org/apache/hadoop/hbase/http/ssl/KeyStoreTestUtil.java>:[107,12]
AlgorithmId is internal proprietary API and may be removed in a future release
[ERROR] <https://builds.apache.org/job/HBase-1.0/ws/hbase-server/src/test/java/org/apache/hadoop/hbase/http/ssl/KeyStoreTestUtil.java>:[107,34]
X509CertImpl is internal proprietary API and may be removed in a future release
[ERROR] <https://builds.apache.org/job/HBase-1.0/ws/hbase-server/src/test/java/org/apache/hadoop/hbase/http/ssl/KeyStoreTestUtil.java>:[109,11]
CertificateAlgorithmId is internal proprietary API and may be removed in a future release
[ERROR] <https://builds.apache.org/job/HBase-1.0/ws/hbase-server/src/test/java/org/apache/hadoop/hbase/http/ssl/KeyStoreTestUtil.java>:[109,47]
CertificateAlgorithmId is internal proprietary API and may be removed in a future release
[ERROR] <https://builds.apache.org/job/HBase-1.0/ws/hbase-server/src/test/java/org/apache/hadoop/hbase/http/ssl/KeyStoreTestUtil.java>:[111,15]
X509CertImpl is internal proprietary API and may be removed in a future release
[INFO] 42 errors 
[INFO] -------------------------------------------------------------
[INFO] ------------------------------------------------------------------------
[INFO] Reactor Summary:
[INFO] 
[INFO] HBase ............................................. SUCCESS [3.064s]
[INFO] HBase - Checkstyle ................................ SUCCESS [0.622s]
[INFO] HBase - Annotations ............................... SUCCESS [0.827s]
[INFO] HBase - Common .................................... SUCCESS [58.110s]
[INFO] HBase - Protocol .................................. SUCCESS [9.104s]
[INFO] HBase - Client .................................... SUCCESS [1:16.244s]
[INFO] HBase - Hadoop Compatibility ...................... SUCCESS [6.953s]
[INFO] HBase - Hadoop Two Compatibility .................. SUCCESS [5.605s]
[INFO] HBase - Prefix Tree ............................... SUCCESS [8.317s]
[INFO] HBase - Server .................................... FAILURE [10.522s]
[INFO] HBase - Testing Util .............................. SKIPPED
[INFO] HBase - Thrift .................................... SKIPPED
[INFO] HBase - Rest ...................................... SKIPPED
[INFO] HBase - Shell ..................................... SKIPPED
[INFO] HBase - Integration Tests ......................... SKIPPED
[INFO] HBase - Examples .................................. SKIPPED
[INFO] HBase - Assembly .................................. SKIPPED
[INFO] ------------------------------------------------------------------------
[INFO] BUILD FAILURE
[INFO] ------------------------------------------------------------------------
[INFO] Total time: 3:00.189s
[INFO] Finished at: Fri Nov 21 02:42:30 UTC 2014
[INFO] Final Memory: 82M/953M
[INFO] ------------------------------------------------------------------------
[ERROR] Failed to execute goal org.apache.maven.plugins:maven-compiler-plugin:2.5.1:testCompile
(default-testCompile) on project hbase-server: Compilation failure: Compilation failure:
[ERROR] <https://builds.apache.org/job/HBase-1.0/ws/hbase-server/src/test/java/org/apache/hadoop/hbase/http/ssl/KeyStoreTestUtil.java>:[46,24]
AlgorithmId is internal proprietary API and may be removed in a future release
[ERROR] <https://builds.apache.org/job/HBase-1.0/ws/hbase-server/src/test/java/org/apache/hadoop/hbase/http/ssl/KeyStoreTestUtil.java>:[47,24]
CertificateAlgorithmId is internal proprietary API and may be removed in a future release
[ERROR] <https://builds.apache.org/job/HBase-1.0/ws/hbase-server/src/test/java/org/apache/hadoop/hbase/http/ssl/KeyStoreTestUtil.java>:[48,24]
CertificateIssuerName is internal proprietary API and may be removed in a future release
[ERROR] <https://builds.apache.org/job/HBase-1.0/ws/hbase-server/src/test/java/org/apache/hadoop/hbase/http/ssl/KeyStoreTestUtil.java>:[49,24]
CertificateSerialNumber is internal proprietary API and may be removed in a future release
[ERROR] <https://builds.apache.org/job/HBase-1.0/ws/hbase-server/src/test/java/org/apache/hadoop/hbase/http/ssl/KeyStoreTestUtil.java>:[50,24]
CertificateSubjectName is internal proprietary API and may be removed in a future release
[ERROR] <https://builds.apache.org/job/HBase-1.0/ws/hbase-server/src/test/java/org/apache/hadoop/hbase/http/ssl/KeyStoreTestUtil.java>:[51,24]
CertificateValidity is internal proprietary API and may be removed in a future release
[ERROR] <https://builds.apache.org/job/HBase-1.0/ws/hbase-server/src/test/java/org/apache/hadoop/hbase/http/ssl/KeyStoreTestUtil.java>:[52,24]
CertificateVersion is internal proprietary API and may be removed in a future release
[ERROR] <https://builds.apache.org/job/HBase-1.0/ws/hbase-server/src/test/java/org/apache/hadoop/hbase/http/ssl/KeyStoreTestUtil.java>:[53,24]
CertificateX509Key is internal proprietary API and may be removed in a future release
[ERROR] <https://builds.apache.org/job/HBase-1.0/ws/hbase-server/src/test/java/org/apache/hadoop/hbase/http/ssl/KeyStoreTestUtil.java>:[54,24]
X500Name is internal proprietary API and may be removed in a future release
[ERROR] <https://builds.apache.org/job/HBase-1.0/ws/hbase-server/src/test/java/org/apache/hadoop/hbase/http/ssl/KeyStoreTestUtil.java>:[55,24]
X509CertImpl is internal proprietary API and may be removed in a future release
[ERROR] <https://builds.apache.org/job/HBase-1.0/ws/hbase-server/src/test/java/org/apache/hadoop/hbase/http/ssl/KeyStoreTestUtil.java>:[56,24]
X509CertInfo is internal proprietary API and may be removed in a future release
[ERROR] <https://builds.apache.org/job/HBase-1.0/ws/hbase-server/src/test/java/org/apache/hadoop/hbase/client/TestHCM.java>:[1026,13]
error: cannot find symbol
[ERROR] symbol:   method waitUntilNoRegionsInTransition(int)
[ERROR] location: variable TEST_UTIL of type HBaseTestingUtility
[ERROR] <https://builds.apache.org/job/HBase-1.0/ws/hbase-server/src/test/java/org/apache/hadoop/hbase/http/ssl/KeyStoreTestUtil.java>:[85,4]
X509CertInfo is internal proprietary API and may be removed in a future release
[ERROR] <https://builds.apache.org/job/HBase-1.0/ws/hbase-server/src/test/java/org/apache/hadoop/hbase/http/ssl/KeyStoreTestUtil.java>:[85,28]
X509CertInfo is internal proprietary API and may be removed in a future release
[ERROR] <https://builds.apache.org/job/HBase-1.0/ws/hbase-server/src/test/java/org/apache/hadoop/hbase/http/ssl/KeyStoreTestUtil.java>:[88,4]
CertificateValidity is internal proprietary API and may be removed in a future release
[ERROR] <https://builds.apache.org/job/HBase-1.0/ws/hbase-server/src/test/java/org/apache/hadoop/hbase/http/ssl/KeyStoreTestUtil.java>:[88,39]
CertificateValidity is internal proprietary API and may be removed in a future release
[ERROR] <https://builds.apache.org/job/HBase-1.0/ws/hbase-server/src/test/java/org/apache/hadoop/hbase/http/ssl/KeyStoreTestUtil.java>:[90,4]
X500Name is internal proprietary API and may be removed in a future release
[ERROR] <https://builds.apache.org/job/HBase-1.0/ws/hbase-server/src/test/java/org/apache/hadoop/hbase/http/ssl/KeyStoreTestUtil.java>:[90,25]
X500Name is internal proprietary API and may be removed in a future release
[ERROR] <https://builds.apache.org/job/HBase-1.0/ws/hbase-server/src/test/java/org/apache/hadoop/hbase/http/ssl/KeyStoreTestUtil.java>:[92,13]
X509CertInfo is internal proprietary API and may be removed in a future release
[ERROR] <https://builds.apache.org/job/HBase-1.0/ws/hbase-server/src/test/java/org/apache/hadoop/hbase/http/ssl/KeyStoreTestUtil.java>:[93,13]
X509CertInfo is internal proprietary API and may be removed in a future release
[ERROR] <https://builds.apache.org/job/HBase-1.0/ws/hbase-server/src/test/java/org/apache/hadoop/hbase/http/ssl/KeyStoreTestUtil.java>:[93,45]
CertificateSerialNumber is internal proprietary API and may be removed in a future release
[ERROR] <https://builds.apache.org/job/HBase-1.0/ws/hbase-server/src/test/java/org/apache/hadoop/hbase/http/ssl/KeyStoreTestUtil.java>:[94,13]
X509CertInfo is internal proprietary API and may be removed in a future release
[ERROR] <https://builds.apache.org/job/HBase-1.0/ws/hbase-server/src/test/java/org/apache/hadoop/hbase/http/ssl/KeyStoreTestUtil.java>:[94,39]
CertificateSubjectName is internal proprietary API and may be removed in a future release
[ERROR] <https://builds.apache.org/job/HBase-1.0/ws/hbase-server/src/test/java/org/apache/hadoop/hbase/http/ssl/KeyStoreTestUtil.java>:[95,13]
X509CertInfo is internal proprietary API and may be removed in a future release
[ERROR] <https://builds.apache.org/job/HBase-1.0/ws/hbase-server/src/test/java/org/apache/hadoop/hbase/http/ssl/KeyStoreTestUtil.java>:[95,38]
CertificateIssuerName is internal proprietary API and may be removed in a future release
[ERROR] <https://builds.apache.org/job/HBase-1.0/ws/hbase-server/src/test/java/org/apache/hadoop/hbase/http/ssl/KeyStoreTestUtil.java>:[96,13]
X509CertInfo is internal proprietary API and may be removed in a future release
[ERROR] <https://builds.apache.org/job/HBase-1.0/ws/hbase-server/src/test/java/org/apache/hadoop/hbase/http/ssl/KeyStoreTestUtil.java>:[96,35]
CertificateX509Key is internal proprietary API and may be removed in a future release
[ERROR] <https://builds.apache.org/job/HBase-1.0/ws/hbase-server/src/test/java/org/apache/hadoop/hbase/http/ssl/KeyStoreTestUtil.java>:[98,11]
X509CertInfo is internal proprietary API and may be removed in a future release
[ERROR] <https://builds.apache.org/job/HBase-1.0/ws/hbase-server/src/test/java/org/apache/hadoop/hbase/http/ssl/KeyStoreTestUtil.java>:[98,37]
CertificateVersion is internal proprietary API and may be removed in a future release
[ERROR] <https://builds.apache.org/job/HBase-1.0/ws/hbase-server/src/test/java/org/apache/hadoop/hbase/http/ssl/KeyStoreTestUtil.java>:[98,56]
CertificateVersion is internal proprietary API and may be removed in a future release
[ERROR] <https://builds.apache.org/job/HBase-1.0/ws/hbase-server/src/test/java/org/apache/hadoop/hbase/http/ssl/KeyStoreTestUtil.java>:[99,4]
AlgorithmId is internal proprietary API and may be removed in a future release
[ERROR] <https://builds.apache.org/job/HBase-1.0/ws/hbase-server/src/test/java/org/apache/hadoop/hbase/http/ssl/KeyStoreTestUtil.java>:[99,27]
AlgorithmId is internal proprietary API and may be removed in a future release
[ERROR] <https://builds.apache.org/job/HBase-1.0/ws/hbase-server/src/test/java/org/apache/hadoop/hbase/http/ssl/KeyStoreTestUtil.java>:[99,39]
AlgorithmId is internal proprietary API and may be removed in a future release
[ERROR] <https://builds.apache.org/job/HBase-1.0/ws/hbase-server/src/test/java/org/apache/hadoop/hbase/http/ssl/KeyStoreTestUtil.java>:[100,13]
X509CertInfo is internal proprietary API and may be removed in a future release
[ERROR] <https://builds.apache.org/job/HBase-1.0/ws/hbase-server/src/test/java/org/apache/hadoop/hbase/http/ssl/KeyStoreTestUtil.java>:[100,44]
CertificateAlgorithmId is internal proprietary API and may be removed in a future release
[ERROR] <https://builds.apache.org/job/HBase-1.0/ws/hbase-server/src/test/java/org/apache/hadoop/hbase/http/ssl/KeyStoreTestUtil.java>:[103,4]
X509CertImpl is internal proprietary API and may be removed in a future release
[ERROR] <https://builds.apache.org/job/HBase-1.0/ws/hbase-server/src/test/java/org/apache/hadoop/hbase/http/ssl/KeyStoreTestUtil.java>:[103,28]
X509CertImpl is internal proprietary API and may be removed in a future release
[ERROR] <https://builds.apache.org/job/HBase-1.0/ws/hbase-server/src/test/java/org/apache/hadoop/hbase/http/ssl/KeyStoreTestUtil.java>:[107,12]
AlgorithmId is internal proprietary API and may be removed in a future release
[ERROR] <https://builds.apache.org/job/HBase-1.0/ws/hbase-server/src/test/java/org/apache/hadoop/hbase/http/ssl/KeyStoreTestUtil.java>:[107,34]
X509CertImpl is internal proprietary API and may be removed in a future release
[ERROR] <https://builds.apache.org/job/HBase-1.0/ws/hbase-server/src/test/java/org/apache/hadoop/hbase/http/ssl/KeyStoreTestUtil.java>:[109,11]
CertificateAlgorithmId is internal proprietary API and may be removed in a future release
[ERROR] <https://builds.apache.org/job/HBase-1.0/ws/hbase-server/src/test/java/org/apache/hadoop/hbase/http/ssl/KeyStoreTestUtil.java>:[109,47]
CertificateAlgorithmId is internal proprietary API and may be removed in a future release
[ERROR] <https://builds.apache.org/job/HBase-1.0/ws/hbase-server/src/test/java/org/apache/hadoop/hbase/http/ssl/KeyStoreTestUtil.java>:[111,15]
X509CertImpl is internal proprietary API and may be removed in a future release
[ERROR] -> [Help 1]
[ERROR] 
[ERROR] To see the full stack trace of the errors, re-run Maven with the -e switch.
[ERROR] Re-run Maven using the -X switch to enable full debug logging.
[ERROR] 
[ERROR] For more information about the errors and possible solutions, please read the following
articles:
[ERROR] [Help 1] http://cwiki.apache.org/confluence/display/MAVEN/MojoFailureException
[ERROR] 
[ERROR] After correcting the problems, you can resume the build with the command
[ERROR]   mvn <goals> -rf :hbase-server
Build step 'Invoke top-level Maven targets' marked build as failure
Performing Post build task...
Match found for :.* : True
Logical operation result is TRUE
Running script  :   ZOMBIE_TESTS_COUNT=`jps | grep surefirebooter | wc -l`
  if [[ $ZOMBIE_TESTS_COUNT != 0 ]] ; then
    #It seems sometimes the tests are not dying immediately. Let's give them 10s
    echo "Suspicious java process found - waiting 10s to see if there are just slow to stop"
    sleep 10   
    ZOMBIE_TESTS_COUNT=`jps | grep surefirebooter | wc -l`
    if [[ $ZOMBIE_TESTS_COUNT != 0 ]] ; then
      echo "There are $ZOMBIE_TESTS_COUNT zombie tests, they should have been killed by surefire
but survived"
      echo "************ BEGIN zombies jstack extract"
      ZB_STACK=`jps | grep surefirebooter | cut -d ' ' -f 1 | xargs -n 1 jstack | grep ".test"
| grep "\.java"`
      jps | grep surefirebooter | cut -d ' ' -f 1 | xargs -n 1 jstack
      echo "************ END  zombies jstack extract"
      JIRA_COMMENT="$JIRA_COMMENT

     {color:red}-1 core zombie tests{color}.  There are ${ZOMBIE_TESTS_COUNT} zombie test(s):
${ZB_STACK}"
      BAD=1
      jps | grep surefirebooter | cut -d ' ' -f 1 | xargs kill -9
    else
      echo "We're ok: there is no zombie test, but some tests took some time to stop"
    fi
  else
    echo "We're ok: there is no zombie test"
  fi
[HBase-1.0] $ /bin/bash -xe /tmp/hudson3787982531564366173.sh
++ jps
++ grep surefirebooter
++ wc -l
+ ZOMBIE_TESTS_COUNT=0
+ [[ 0 != 0 ]]
+ echo 'We'\''re ok: there is no zombie test'
We're ok: there is no zombie test
POST BUILD TASK : SUCCESS
END OF POST BUILD TASK : 0
Archiving artifacts
Sending artifact delta relative to HBase-1.0 #486
Archived 256 artifacts
Archive block size is 32768
Received 3 blocks and 951516 bytes
Compression is 9.4%
Took 6.1 sec
Recording test results
Updating HBASE-12541

Mime
View raw message