hbase-builds mailing list archives

Site index · List index
Message view « Date » · « Thread »
Top « Date » · « Thread »
From Apache Jenkins Server <jenk...@builds.apache.org>
Subject Build failed in Jenkins: HBase-0.98 #684
Date Wed, 19 Nov 2014 20:10:40 GMT
See <https://builds.apache.org/job/HBase-0.98/684/changes>

Changes:

[matteo.bertozzi] HBASE-12529 Use ThreadLocalRandom for RandomQueueBalancer

------------------------------------------
[...truncated 2062 lines...]
Tests run: 6, Failures: 0, Errors: 0, Skipped: 0, Time elapsed: 0.115 sec
Running org.apache.hadoop.hbase.rest.model.TestTableInfoModel
Tests run: 6, Failures: 0, Errors: 0, Skipped: 0, Time elapsed: 0.118 sec
Running org.apache.hadoop.hbase.rest.model.TestStorageClusterVersionModel
Tests run: 6, Failures: 0, Errors: 0, Skipped: 0, Time elapsed: 0.116 sec
Running org.apache.hadoop.hbase.rest.model.TestStorageClusterStatusModel
Tests run: 6, Failures: 0, Errors: 0, Skipped: 0, Time elapsed: 0.135 sec
Running org.apache.hadoop.hbase.rest.model.TestCellSetModel
Tests run: 6, Failures: 0, Errors: 0, Skipped: 0, Time elapsed: 0.117 sec
Running org.apache.hadoop.hbase.rest.model.TestTableSchemaModel
Tests run: 6, Failures: 0, Errors: 0, Skipped: 0, Time elapsed: 0.118 sec
Running org.apache.hadoop.hbase.rest.model.TestScannerModel
Tests run: 6, Failures: 0, Errors: 0, Skipped: 0, Time elapsed: 0.129 sec
Running org.apache.hadoop.hbase.rest.model.TestTableRegionModel
Tests run: 8, Failures: 0, Errors: 0, Skipped: 0, Time elapsed: 0.154 sec
Running org.apache.hadoop.hbase.rest.TestScannersWithLabels
Tests run: 2, Failures: 0, Errors: 0, Skipped: 0, Time elapsed: 0.297 sec
Running org.apache.hadoop.hbase.rest.TestTableScan
Tests run: 6, Failures: 0, Errors: 0, Skipped: 0, Time elapsed: 3.663 sec
Running org.apache.hadoop.hbase.rest.TestGzipFilter
Tests run: 2, Failures: 0, Errors: 0, Skipped: 0, Time elapsed: 0.323 sec
Running org.apache.hadoop.hbase.rest.TestGetAndPutResource
Tests run: 18, Failures: 0, Errors: 0, Skipped: 0, Time elapsed: 10.625 sec
Running org.apache.hadoop.hbase.rest.TestSchemaResource
Tests run: 2, Failures: 0, Errors: 0, Skipped: 0, Time elapsed: 145.91 sec

Results :

Tests run: 169, Failures: 0, Errors: 0, Skipped: 0

[INFO] 
[INFO] --- maven-surefire-plugin:2.12-TRUNK-HBASE-2:test (secondPartTestsExecution) @ hbase-rest
---
[INFO] Surefire report directory: <https://builds.apache.org/job/HBase-0.98/ws/hbase-rest/target/surefire-reports>
[INFO] Using configured provider org.apache.maven.surefire.junitcore.JUnitCoreProvider

-------------------------------------------------------
 T E S T S
-------------------------------------------------------

-------------------------------------------------------
 T E S T S
-------------------------------------------------------
Running org.apache.hadoop.hbase.rest.TestResourceFilter
Tests run: 1, Failures: 0, Errors: 0, Skipped: 0, Time elapsed: 9.153 sec
Running org.apache.hadoop.hbase.rest.TestDeleteRow
Tests run: 2, Failures: 0, Errors: 0, Skipped: 0, Time elapsed: 12.628 sec
Running org.apache.hadoop.hbase.rest.TestVersionResource
Tests run: 7, Failures: 0, Errors: 0, Skipped: 0, Time elapsed: 10.153 sec
Running org.apache.hadoop.hbase.rest.TestTableResource
Tests run: 8, Failures: 0, Errors: 0, Skipped: 0, Time elapsed: 22.741 sec
Running org.apache.hadoop.hbase.rest.TestStatusResource
Tests run: 2, Failures: 0, Errors: 0, Skipped: 0, Time elapsed: 10.657 sec
Running org.apache.hadoop.hbase.rest.TestScannersWithFilters
Tests run: 10, Failures: 0, Errors: 0, Skipped: 0, Time elapsed: 13.566 sec
Running org.apache.hadoop.hbase.rest.TestMultiRowResource
Tests run: 3, Failures: 0, Errors: 0, Skipped: 0, Time elapsed: 11.505 sec
Running org.apache.hadoop.hbase.rest.TestScannerResource
Tests run: 5, Failures: 0, Errors: 0, Skipped: 0, Time elapsed: 28.469 sec
Running org.apache.hadoop.hbase.rest.TestScannersWithLabels
Tests run: 2, Failures: 0, Errors: 0, Skipped: 0, Time elapsed: 10.908 sec
Running org.apache.hadoop.hbase.rest.client.TestRemoteTable
Tests run: 9, Failures: 0, Errors: 0, Skipped: 0, Time elapsed: 18.35 sec
Running org.apache.hadoop.hbase.rest.TestGzipFilter
Tests run: 2, Failures: 0, Errors: 0, Skipped: 0, Time elapsed: 10.783 sec
Running org.apache.hadoop.hbase.rest.TestTableScan
Tests run: 6, Failures: 0, Errors: 0, Skipped: 0, Time elapsed: 30.209 sec
Running org.apache.hadoop.hbase.rest.TestGetAndPutResource
Tests run: 18, Failures: 0, Errors: 0, Skipped: 0, Time elapsed: 24.015 sec
Running org.apache.hadoop.hbase.rest.TestSchemaResource
Tests run: 2, Failures: 0, Errors: 0, Skipped: 0, Time elapsed: 11.91 sec

Results :

Tests run: 77, Failures: 0, Errors: 0, Skipped: 0

[INFO] 
[INFO] --- jacoco-maven-plugin:0.6.2.201302030002:report (report) @ hbase-rest ---
[INFO] Skipping JaCoCo execution
[INFO] 
[INFO] --- maven-source-plugin:2.2.1:jar-no-fork (attach-sources) @ hbase-rest ---
[INFO] Building jar: <https://builds.apache.org/job/HBase-0.98/ws/hbase-rest/target/hbase-rest-0.98.8-sources.jar>
[INFO] 
[INFO] --- maven-jar-plugin:2.4:test-jar (default) @ hbase-rest ---
[INFO] Building jar: <https://builds.apache.org/job/HBase-0.98/ws/hbase-rest/target/hbase-rest-0.98.8-tests.jar>
[INFO] 
[INFO] --- maven-jar-plugin:2.4:jar (default-jar) @ hbase-rest ---
[INFO] Building jar: <https://builds.apache.org/job/HBase-0.98/ws/hbase-rest/target/hbase-rest-0.98.8.jar>
[INFO] 
[INFO] --- maven-install-plugin:2.3.1:install (default-install) @ hbase-rest ---
[INFO] Installing <https://builds.apache.org/job/HBase-0.98/ws/hbase-rest/target/hbase-rest-0.98.8.jar>
to /home/jenkins/.m2/repository/org/apache/hbase/hbase-rest/0.98.8/hbase-rest-0.98.8.jar
[INFO] Installing <https://builds.apache.org/job/HBase-0.98/ws/hbase-rest/pom.xml> to
/home/jenkins/.m2/repository/org/apache/hbase/hbase-rest/0.98.8/hbase-rest-0.98.8.pom
[INFO] Installing <https://builds.apache.org/job/HBase-0.98/ws/hbase-rest/target/hbase-rest-0.98.8-sources.jar>
to /home/jenkins/.m2/repository/org/apache/hbase/hbase-rest/0.98.8/hbase-rest-0.98.8-sources.jar
[INFO] Installing <https://builds.apache.org/job/HBase-0.98/ws/hbase-rest/target/hbase-rest-0.98.8-tests.jar>
to /home/jenkins/.m2/repository/org/apache/hbase/hbase-rest/0.98.8/hbase-rest-0.98.8-tests.jar
[INFO]                                                                         
[INFO] ------------------------------------------------------------------------
[INFO] Building HBase - Shell 0.98.8
[INFO] ------------------------------------------------------------------------
[INFO] 
[INFO] --- maven-enforcer-plugin:1.0.1:enforce (enforce) @ hbase-shell ---
[INFO] 
[INFO] --- jacoco-maven-plugin:0.6.2.201302030002:prepare-agent (prepare-agent) @ hbase-shell
---
[INFO] Skipping JaCoCo execution
[INFO] argLine set to 
[INFO] 
[INFO] --- build-helper-maven-plugin:1.5:add-source (jspcSource-packageInfo-source) @ hbase-shell
---
[INFO] Source directory: <https://builds.apache.org/job/HBase-0.98/ws/hbase-shell/target/generated-jamon>
added.
[INFO] Source directory: <https://builds.apache.org/job/HBase-0.98/ws/hbase-shell/target/generated-sources/java>
added.
[INFO] 
[INFO] --- maven-remote-resources-plugin:1.4:process (default) @ hbase-shell ---
[INFO] 
[INFO] --- maven-resources-plugin:2.6:resources (default-resources) @ hbase-shell ---
[INFO] Using 'UTF-8' encoding to copy filtered resources.
[INFO] Copying 0 resource
[INFO] Copying 3 resources
[INFO] 
[INFO] --- maven-compiler-plugin:2.5.1:compile (default-compile) @ hbase-shell ---
[INFO] No sources to compile
[INFO] 
[INFO] --- maven-dependency-plugin:2.1:build-classpath (create-mrapp-generated-classpath)
@ hbase-shell ---
[INFO] Wrote classpath file '<https://builds.apache.org/job/HBase-0.98/ws/hbase-shell/target/test-classes/mrapp-generated-classpath'.>
[INFO] 
[INFO] --- maven-resources-plugin:2.6:testResources (default-testResources) @ hbase-shell
---
[INFO] Using 'UTF-8' encoding to copy filtered resources.
[INFO] skip non existing resourceDirectory <https://builds.apache.org/job/HBase-0.98/ws/hbase-shell/src/test/resources>
[INFO] Copying 3 resources
[INFO] 
[INFO] --- maven-compiler-plugin:2.5.1:testCompile (default-testCompile) @ hbase-shell ---
[INFO] Compiling 1 source file to <https://builds.apache.org/job/HBase-0.98/ws/hbase-shell/target/test-classes>
[INFO] 
[INFO] --- maven-surefire-plugin:2.12-TRUNK-HBASE-2:test (default-test) @ hbase-shell ---
[INFO] Surefire report directory: <https://builds.apache.org/job/HBase-0.98/ws/hbase-shell/target/surefire-reports>
[INFO] Using configured provider org.apache.maven.surefire.junitcore.JUnitCoreProvider

-------------------------------------------------------
 T E S T S
-------------------------------------------------------

Results :

Tests run: 0, Failures: 0, Errors: 0, Skipped: 0

[INFO] 
[INFO] --- maven-surefire-plugin:2.12-TRUNK-HBASE-2:test (secondPartTestsExecution) @ hbase-shell
---
[INFO] Surefire report directory: <https://builds.apache.org/job/HBase-0.98/ws/hbase-shell/target/surefire-reports>
[INFO] Using configured provider org.apache.maven.surefire.junitcore.JUnitCoreProvider

-------------------------------------------------------
 T E S T S
-------------------------------------------------------

-------------------------------------------------------
 T E S T S
-------------------------------------------------------
Running org.apache.hadoop.hbase.client.TestShell
Tests run: 1, Failures: 0, Errors: 1, Skipped: 0, Time elapsed: 34.974 sec <<< FAILURE!

Results :

Tests in error: 
  org.apache.hadoop.hbase.client.TestShell: Shutting down

Tests run: 1, Failures: 0, Errors: 1, Skipped: 0

[INFO] ------------------------------------------------------------------------
[INFO] Reactor Summary:
[INFO] 
[INFO] HBase ............................................. SUCCESS [3.275s]
[INFO] HBase - Checkstyle ................................ SUCCESS [0.934s]
[INFO] HBase - Annotations ............................... SUCCESS [1.249s]
[INFO] HBase - Common .................................... SUCCESS [23.677s]
[INFO] HBase - Protocol .................................. SUCCESS [20.207s]
[INFO] HBase - Client .................................... SUCCESS [38.595s]
[INFO] HBase - Hadoop Compatibility ...................... SUCCESS [5.334s]
[INFO] HBase - Hadoop Two Compatibility .................. SUCCESS [1.537s]
[INFO] HBase - Prefix Tree ............................... SUCCESS [3.274s]
[INFO] HBase - Server .................................... SUCCESS [1:31:12.811s]
[INFO] HBase - Testing Util .............................. SUCCESS [1.297s]
[INFO] HBase - Thrift .................................... SUCCESS [2:24.513s]
[INFO] HBase - Rest ...................................... SUCCESS [4:30.697s]
[INFO] HBase - Shell ..................................... FAILURE [36.913s]
[INFO] HBase - Integration Tests ......................... SKIPPED
[INFO] HBase - Examples .................................. SKIPPED
[INFO] HBase - Assembly .................................. SKIPPED
[INFO] ------------------------------------------------------------------------
[INFO] BUILD FAILURE
[INFO] ------------------------------------------------------------------------
[INFO] Total time: 1:40:25.264s
[INFO] Finished at: Wed Nov 19 20:07:46 UTC 2014
[INFO] Final Memory: 57M/954M
[INFO] ------------------------------------------------------------------------
[ERROR] Failed to execute goal org.apache.maven.plugins:maven-surefire-plugin:2.12-TRUNK-HBASE-2:test
(secondPartTestsExecution) on project hbase-shell: There are test failures.
[ERROR] 
[ERROR] Please refer to <https://builds.apache.org/job/HBase-0.98/ws/hbase-shell/target/surefire-reports>
for the individual test results.
[ERROR] -> [Help 1]
[ERROR] 
[ERROR] To see the full stack trace of the errors, re-run Maven with the -e switch.
[ERROR] Re-run Maven using the -X switch to enable full debug logging.
[ERROR] 
[ERROR] For more information about the errors and possible solutions, please read the following
articles:
[ERROR] [Help 1] http://cwiki.apache.org/confluence/display/MAVEN/MojoFailureException
[ERROR] 
[ERROR] After correcting the problems, you can resume the build with the command
[ERROR]   mvn <goals> -rf :hbase-shell
Build step 'Invoke top-level Maven targets' marked build as failure
Performing Post build task...
Match found for :.* : True
Logical operation result is TRUE
Running script  :   ZOMBIE_TESTS_COUNT=`jps | grep surefirebooter | wc -l`
  if [[ $ZOMBIE_TESTS_COUNT != 0 ]] ; then
    #It seems sometimes the tests are not dying immediately. Let's give them 10s
    echo "Suspicious java process found - waiting 10s to see if there are just slow to stop"
    sleep 10   
    ZOMBIE_TESTS_COUNT=`jps | grep surefirebooter | wc -l`
    if [[ $ZOMBIE_TESTS_COUNT != 0 ]] ; then
      echo "There are $ZOMBIE_TESTS_COUNT zombie tests, they should have been killed by surefire
but survived"
      echo "************ BEGIN zombies jstack extract"
      ZB_STACK=`jps | grep surefirebooter | cut -d ' ' -f 1 | xargs -n 1 jstack | grep ".test"
| grep "\.java"`
      jps | grep surefirebooter | cut -d ' ' -f 1 | xargs -n 1 jstack
      echo "************ END  zombies jstack extract"
      JIRA_COMMENT="$JIRA_COMMENT

     {color:red}-1 core zombie tests{color}.  There are ${ZOMBIE_TESTS_COUNT} zombie test(s):
${ZB_STACK}"
      BAD=1
      jps | grep surefirebooter | cut -d ' ' -f 1 | xargs kill -9
    else
      echo "We're ok: there is no zombie test, but some tests took some time to stop"
    fi
  else
    echo "We're ok: there is no zombie test"
  fi
[HBase-0.98] $ /bin/bash -xe /tmp/hudson8096485582678212753.sh
++ jps
++ grep surefirebooter
++ wc -l
+ ZOMBIE_TESTS_COUNT=0
+ [[ 0 != 0 ]]
+ echo 'We'\''re ok: there is no zombie test'
We're ok: there is no zombie test
POST BUILD TASK : SUCCESS
END OF POST BUILD TASK : 0
Archiving artifacts
Sending artifact delta relative to HBase-0.98 #678
Archived 1727 artifacts
Archive block size is 32768
Received 18 blocks and 306103398 bytes
Compression is 0.2%
Took 1 min 54 sec
Recording test results
Updating HBASE-12529

Mime
View raw message