hbase-builds mailing list archives

Site index · List index
Message view « Date » · « Thread »
Top « Date » · « Thread »
From Apache Jenkins Server <jenk...@builds.apache.org>
Subject Build failed in Jenkins: HBase-1.0 #470
Date Tue, 18 Nov 2014 18:51:52 GMT
See <https://builds.apache.org/job/HBase-1.0/470/changes>

Changes:

[tedyu] HBASE-12337 Import tool fails with NullPointerException if clusterIds is not initialized

------------------------------------------
[...truncated 1744 lines...]
Running org.apache.hadoop.hbase.TestHBaseTestingUtility
Running org.apache.hadoop.hbase.TestJMXListener
Tests run: 2, Failures: 0, Errors: 0, Skipped: 0, Time elapsed: 16.834 sec - in org.apache.hadoop.hbase.TestJMXListener
Running org.apache.hadoop.hbase.TestInfoServers
Tests run: 3, Failures: 0, Errors: 0, Skipped: 0, Time elapsed: 1.78 sec - in org.apache.hadoop.hbase.TestInfoServers
Running org.apache.hadoop.hbase.TestClusterBootOrder
Tests run: 7, Failures: 0, Errors: 0, Skipped: 0, Time elapsed: 41.109 sec - in org.apache.hadoop.hbase.TestHBaseTestingUtility
Running org.apache.hadoop.hbase.TestGlobalMemStoreSize
Tests run: 1, Failures: 0, Errors: 0, Skipped: 0, Time elapsed: 11.451 sec - in org.apache.hadoop.hbase.TestGlobalMemStoreSize
Tests run: 4, Failures: 0, Errors: 0, Skipped: 0, Time elapsed: 90.684 sec - in org.apache.hadoop.hbase.mapred.TestTableMapReduceUtil
Running org.apache.hadoop.hbase.security.access.TestCellACLs
Tests run: 2, Failures: 0, Errors: 0, Skipped: 0, Time elapsed: 25.996 sec - in org.apache.hadoop.hbase.TestClusterBootOrder
Running org.apache.hadoop.hbase.security.access.TestAccessControlFilter
Tests run: 2, Failures: 0, Errors: 0, Skipped: 0, Time elapsed: 6.063 sec - in org.apache.hadoop.hbase.security.access.TestCellACLs
Tests run: 1, Failures: 0, Errors: 0, Skipped: 0, Time elapsed: 2.498 sec - in org.apache.hadoop.hbase.security.access.TestAccessControlFilter
Running org.apache.hadoop.hbase.security.access.TestAccessController
Running org.apache.hadoop.hbase.security.access.TestCellACLWithMultipleVersions
Running org.apache.hadoop.hbase.security.access.TestNamespaceCommands
Tests run: 4, Failures: 0, Errors: 0, Skipped: 0, Time elapsed: 2.192 sec - in org.apache.hadoop.hbase.security.access.TestNamespaceCommands
Tests run: 2, Failures: 0, Errors: 0, Skipped: 0, Time elapsed: 99.966 sec - in org.apache.hadoop.hbase.mapred.TestTableMapReduce
Tests run: 8, Failures: 0, Errors: 0, Skipped: 0, Time elapsed: 17.155 sec - in org.apache.hadoop.hbase.security.access.TestCellACLWithMultipleVersions
Running org.apache.hadoop.hbase.security.access.TestTablePermissions
Running org.apache.hadoop.hbase.security.access.TestScanEarlyTermination
Tests run: 1, Failures: 0, Errors: 0, Skipped: 0, Time elapsed: 2.49 sec - in org.apache.hadoop.hbase.security.access.TestScanEarlyTermination
Running org.apache.hadoop.hbase.security.access.TestAccessController2
Running org.apache.hadoop.hbase.security.access.TestZKPermissionsWatcher
Tests run: 7, Failures: 0, Errors: 0, Skipped: 0, Time elapsed: 13.106 sec - in org.apache.hadoop.hbase.security.access.TestTablePermissions
Tests run: 2, Failures: 0, Errors: 0, Skipped: 0, Time elapsed: 6.407 sec - in org.apache.hadoop.hbase.security.access.TestAccessController2
Tests run: 1, Failures: 0, Errors: 0, Skipped: 0, Time elapsed: 3.412 sec - in org.apache.hadoop.hbase.security.access.TestZKPermissionsWatcher
Running org.apache.hadoop.hbase.security.token.TestZKSecretWatcher
Running org.apache.hadoop.hbase.security.token.TestTokenAuthentication
Tests run: 2, Failures: 0, Errors: 0, Skipped: 0, Time elapsed: 0.384 sec - in org.apache.hadoop.hbase.security.token.TestTokenAuthentication
Running org.apache.hadoop.hbase.security.visibility.TestVisibilityLabelsWithSLGStack
Running org.apache.hadoop.hbase.security.visibility.TestEnforcingScanLabelGenerator
Tests run: 1, Failures: 0, Errors: 0, Skipped: 0, Time elapsed: 1.592 sec - in org.apache.hadoop.hbase.security.visibility.TestVisibilityLabelsWithSLGStack
Tests run: 1, Failures: 0, Errors: 0, Skipped: 0, Time elapsed: 1.798 sec - in org.apache.hadoop.hbase.security.visibility.TestEnforcingScanLabelGenerator
Tests run: 1, Failures: 0, Errors: 0, Skipped: 0, Time elapsed: 13.221 sec - in org.apache.hadoop.hbase.security.token.TestZKSecretWatcher
Running org.apache.hadoop.hbase.security.visibility.TestVisibilityLabelsWithDeletes
Running org.apache.hadoop.hbase.security.visibility.TestVisibilityLabelsOpWithDifferentUsersNoACL
Running org.apache.hadoop.hbase.security.visibility.TestVisibilityLabelsWithDistributedLogReplay
Tests run: 1, Failures: 0, Errors: 0, Skipped: 0, Time elapsed: 2.544 sec - in org.apache.hadoop.hbase.security.visibility.TestVisibilityLabelsOpWithDifferentUsersNoACL
Running org.apache.hadoop.hbase.security.visibility.TestVisibilityLabelsWithCustomVisLabService
Tests run: 21, Failures: 0, Errors: 0, Skipped: 0, Time elapsed: 13.661 sec - in org.apache.hadoop.hbase.security.visibility.TestVisibilityLabelsWithDistributedLogReplay
Running org.apache.hadoop.hbase.security.visibility.TestVisibilityLabelsWithDefaultVisLabelService
Tests run: 19, Failures: 0, Errors: 0, Skipped: 0, Time elapsed: 13.767 sec - in org.apache.hadoop.hbase.security.visibility.TestVisibilityLabelsWithCustomVisLabService
Tests run: 49, Failures: 0, Errors: 0, Skipped: 0, Time elapsed: 85.545 sec - in org.apache.hadoop.hbase.security.access.TestAccessController
Running org.apache.hadoop.hbase.security.visibility.TestVisibilityLabelsWithACL
Running org.apache.hadoop.hbase.security.visibility.TestVisibilityWithCheckAuths
Tests run: 37, Failures: 0, Errors: 0, Skipped: 0, Time elapsed: 37.921 sec - in org.apache.hadoop.hbase.security.visibility.TestVisibilityLabelsWithDeletes
Running org.apache.hadoop.hbase.zookeeper.lock.TestZKInterProcessReadWriteLock
Tests run: 5, Failures: 0, Errors: 0, Skipped: 0, Time elapsed: 4.363 sec - in org.apache.hadoop.hbase.security.visibility.TestVisibilityLabelsWithACL
Tests run: 2, Failures: 0, Errors: 0, Skipped: 0, Time elapsed: 3.33 sec - in org.apache.hadoop.hbase.security.visibility.TestVisibilityWithCheckAuths
Tests run: 21, Failures: 0, Errors: 0, Skipped: 0, Time elapsed: 15.589 sec - in org.apache.hadoop.hbase.security.visibility.TestVisibilityLabelsWithDefaultVisLabelService
Running org.apache.hadoop.hbase.zookeeper.TestHQuorumPeer
Running org.apache.hadoop.hbase.zookeeper.TestZooKeeperNodeTracker
Tests run: 3, Failures: 0, Errors: 0, Skipped: 0, Time elapsed: 1.19 sec - in org.apache.hadoop.hbase.zookeeper.TestHQuorumPeer
Tests run: 3, Failures: 0, Errors: 0, Skipped: 0, Time elapsed: 0.913 sec - in org.apache.hadoop.hbase.zookeeper.TestZooKeeperNodeTracker
Running org.apache.hadoop.hbase.zookeeper.TestZKTableStateManager
Running org.apache.hadoop.hbase.zookeeper.TestRecoverableZooKeeper
Tests run: 1, Failures: 0, Errors: 0, Skipped: 0, Time elapsed: 0.724 sec - in org.apache.hadoop.hbase.zookeeper.TestZKTableStateManager
Tests run: 1, Failures: 0, Errors: 0, Skipped: 0, Time elapsed: 1.239 sec - in org.apache.hadoop.hbase.zookeeper.TestRecoverableZooKeeper
Running org.apache.hadoop.hbase.zookeeper.TestZKLeaderManager
Tests run: 1, Failures: 0, Errors: 0, Skipped: 0, Time elapsed: 0.129 sec - in org.apache.hadoop.hbase.zookeeper.TestZKLeaderManager
Running org.apache.hadoop.hbase.zookeeper.TestZKMulti
Tests run: 6, Failures: 0, Errors: 0, Skipped: 0, Time elapsed: 0.284 sec - in org.apache.hadoop.hbase.zookeeper.TestZKMulti
Running org.apache.hadoop.hbase.TestRegionRebalancing
Running org.apache.hadoop.hbase.TestDrainingServer
Running org.apache.hadoop.hbase.zookeeper.TestZooKeeperACL
Tests run: 6, Failures: 0, Errors: 0, Skipped: 0, Time elapsed: 0.298 sec - in org.apache.hadoop.hbase.zookeeper.TestZooKeeperACL
Tests run: 2, Failures: 0, Errors: 0, Skipped: 0, Time elapsed: 1.575 sec - in org.apache.hadoop.hbase.TestDrainingServer
Running org.apache.hadoop.hbase.TestAcidGuarantees
Tests run: 6, Failures: 0, Errors: 0, Skipped: 0, Time elapsed: 24.474 sec - in org.apache.hadoop.hbase.zookeeper.lock.TestZKInterProcessReadWriteLock
Running org.apache.hadoop.hbase.migration.TestNamespaceUpgrade
Running org.apache.hadoop.hbase.migration.TestUpgradeTo96
Tests run: 5, Failures: 0, Errors: 0, Skipped: 0, Time elapsed: 2.653 sec - in org.apache.hadoop.hbase.migration.TestUpgradeTo96
Tests run: 6, Failures: 0, Errors: 0, Skipped: 0, Time elapsed: 259.219 sec - in org.apache.hadoop.hbase.mapred.TestTableSnapshotInputFormat
Tests run: 2, Failures: 0, Errors: 0, Skipped: 0, Time elapsed: 32.276 sec - in org.apache.hadoop.hbase.TestRegionRebalancing
Running org.apache.hadoop.hbase.master.TestHMasterRPCException
Tests run: 5, Failures: 0, Errors: 0, Skipped: 0, Time elapsed: 17.221 sec - in org.apache.hadoop.hbase.migration.TestNamespaceUpgrade
Running org.apache.hadoop.hbase.master.TestDeadServer
Tests run: 3, Failures: 0, Errors: 0, Skipped: 0, Time elapsed: 0.29 sec - in org.apache.hadoop.hbase.master.TestDeadServer
Running org.apache.hadoop.hbase.master.TestMasterRestartAfterDisablingTable
Tests run: 1, Failures: 0, Errors: 0, Skipped: 0, Time elapsed: 2.725 sec - in org.apache.hadoop.hbase.master.TestHMasterRPCException
Running org.apache.hadoop.hbase.TestMultiVersions
Running org.apache.hadoop.hbase.master.TestAssignmentListener
Tests run: 3, Failures: 0, Errors: 0, Skipped: 0, Time elapsed: 6.392 sec - in org.apache.hadoop.hbase.TestMultiVersions
Running org.apache.hadoop.hbase.master.TestMasterFailoverBalancerPersistence
Tests run: 2, Failures: 0, Errors: 0, Skipped: 0, Time elapsed: 5.892 sec - in org.apache.hadoop.hbase.master.TestAssignmentListener
Tests run: 1, Failures: 0, Errors: 0, Skipped: 0, Time elapsed: 14.246 sec - in org.apache.hadoop.hbase.master.TestMasterRestartAfterDisablingTable
Running org.apache.hadoop.hbase.master.TestZKBasedOpenCloseRegion
Running org.apache.hadoop.hbase.master.TestMasterShutdown
Tests run: 3, Failures: 0, Errors: 0, Skipped: 0, Time elapsed: 3.072 sec - in org.apache.hadoop.hbase.master.TestZKBasedOpenCloseRegion
Running org.apache.hadoop.hbase.master.snapshot.TestSnapshotFileCache
Tests run: 1, Failures: 0, Errors: 0, Skipped: 0, Time elapsed: 14.012 sec - in org.apache.hadoop.hbase.master.TestMasterFailoverBalancerPersistence
Running org.apache.hadoop.hbase.master.cleaner.TestHFileCleaner
Tests run: 3, Failures: 0, Errors: 0, Skipped: 0, Time elapsed: 0.915 sec - in org.apache.hadoop.hbase.master.cleaner.TestHFileCleaner
Running org.apache.hadoop.hbase.master.cleaner.TestLogsCleaner
Tests run: 2, Failures: 0, Errors: 0, Skipped: 0, Time elapsed: 15.84 sec - in org.apache.hadoop.hbase.master.TestMasterShutdown
Running org.apache.hadoop.hbase.master.cleaner.TestSnapshotFromMaster
Tests run: 1, Failures: 0, Errors: 0, Skipped: 0, Time elapsed: 11.206 sec - in org.apache.hadoop.hbase.master.cleaner.TestLogsCleaner
Running org.apache.hadoop.hbase.master.TestMasterStatusServlet
Tests run: 4, Failures: 0, Errors: 0, Skipped: 0, Time elapsed: 19.491 sec - in org.apache.hadoop.hbase.master.snapshot.TestSnapshotFileCache
Tests run: 4, Failures: 0, Errors: 0, Skipped: 0, Time elapsed: 1.881 sec - in org.apache.hadoop.hbase.master.TestMasterStatusServlet
Running org.apache.hadoop.hbase.master.balancer.TestStochasticLoadBalancer
Running org.apache.hadoop.hbase.master.TestMasterOperationsForRegionReplicas
Running org.apache.hadoop.hbase.master.balancer.TestDefaultLoadBalancer
Tests run: 4, Failures: 0, Errors: 0, Skipped: 0, Time elapsed: 11.663 sec - in org.apache.hadoop.hbase.master.cleaner.TestSnapshotFromMaster
Running org.apache.hadoop.hbase.master.balancer.TestBaseLoadBalancer
Tests run: 2, Failures: 0, Errors: 0, Skipped: 0, Time elapsed: 10.205 sec - in org.apache.hadoop.hbase.master.TestMasterOperationsForRegionReplicas
Running org.apache.hadoop.hbase.master.TestMasterFailover
Tests run: 3, Failures: 0, Errors: 0, Skipped: 0, Time elapsed: 85.787 sec - in org.apache.hadoop.hbase.TestAcidGuarantees
Running org.apache.hadoop.hbase.master.TestDistributedLogSplitting
Tests run: 1, Failures: 0, Errors: 0, Skipped: 0, Time elapsed: 20.742 sec - in org.apache.hadoop.hbase.master.balancer.TestDefaultLoadBalancer
Running org.apache.hadoop.hbase.master.TestMasterNoCluster
Tests run: 3, Failures: 0, Errors: 0, Skipped: 0, Time elapsed: 12.805 sec - in org.apache.hadoop.hbase.master.TestMasterNoCluster
Running org.apache.hadoop.hbase.master.TestRollingRestart
Tests run: 1, Failures: 0, Errors: 0, Skipped: 0, Time elapsed: 21.634 sec - in org.apache.hadoop.hbase.master.TestRollingRestart
Tests run: 6, Failures: 0, Errors: 0, Skipped: 0, Time elapsed: 49.975 sec - in org.apache.hadoop.hbase.master.TestMasterFailover
Running org.apache.hadoop.hbase.master.TestRegionPlacement2
Tests run: 2, Failures: 0, Errors: 0, Skipped: 0, Time elapsed: 1.92 sec - in org.apache.hadoop.hbase.master.TestRegionPlacement2
Running org.apache.hadoop.hbase.master.TestMaster
Tests run: 4, Failures: 0, Errors: 0, Skipped: 0, Time elapsed: 6.504 sec - in org.apache.hadoop.hbase.master.TestMaster
Running org.apache.hadoop.hbase.master.TestMasterMetricsWrapper
Running org.apache.hadoop.hbase.master.TestActiveMasterManager
Tests run: 2, Failures: 0, Errors: 0, Skipped: 0, Time elapsed: 1.096 sec - in org.apache.hadoop.hbase.master.TestActiveMasterManager
Tests run: 1, Failures: 0, Errors: 0, Skipped: 0, Time elapsed: 1.953 sec - in org.apache.hadoop.hbase.master.TestMasterMetricsWrapper
Running org.apache.hadoop.hbase.master.TestRestartCluster
Running org.apache.hadoop.hbase.master.TestMasterTransitions
Tests run: 3, Failures: 0, Errors: 0, Skipped: 3, Time elapsed: 1.672 sec - in org.apache.hadoop.hbase.master.TestMasterTransitions
Running org.apache.hadoop.hbase.master.TestOpenedRegionHandler
Tests run: 2, Failures: 0, Errors: 0, Skipped: 0, Time elapsed: 12.142 sec - in org.apache.hadoop.hbase.master.TestOpenedRegionHandler
Running org.apache.hadoop.hbase.master.handler.TestTableDescriptorModification
Tests run: 3, Failures: 0, Errors: 0, Skipped: 0, Time elapsed: 3.459 sec - in org.apache.hadoop.hbase.master.handler.TestTableDescriptorModification
Running org.apache.hadoop.hbase.master.handler.TestCreateTableHandler
Tests run: 3, Failures: 0, Errors: 0, Skipped: 0, Time elapsed: 37.153 sec - in org.apache.hadoop.hbase.master.TestRestartCluster
Running org.apache.hadoop.hbase.master.handler.TestTableDeleteFamilyHandler
Tests run: 1, Failures: 0, Errors: 0, Skipped: 0, Time elapsed: 1.94 sec - in org.apache.hadoop.hbase.master.handler.TestTableDeleteFamilyHandler
Running org.apache.hadoop.hbase.master.TestSplitLogManager
Tests run: 3, Failures: 0, Errors: 0, Skipped: 0, Time elapsed: 23.283 sec - in org.apache.hadoop.hbase.master.handler.TestCreateTableHandler
Running org.apache.hadoop.hbase.master.TestAssignmentManagerOnCluster
Tests run: 18, Failures: 0, Errors: 0, Skipped: 0, Time elapsed: 154.931 sec - in org.apache.hadoop.hbase.master.TestDistributedLogSplitting
Running org.apache.hadoop.hbase.master.TestRegionPlacement
Tests run: 2, Failures: 0, Errors: 0, Skipped: 0, Time elapsed: 17.802 sec - in org.apache.hadoop.hbase.master.TestRegionPlacement
Running org.apache.hadoop.hbase.master.TestClusterStatusPublisher
Tests run: 3, Failures: 0, Errors: 0, Skipped: 0, Time elapsed: 0.403 sec - in org.apache.hadoop.hbase.master.TestClusterStatusPublisher
Running org.apache.hadoop.hbase.master.TestTableLockManager
Tests run: 21, Failures: 0, Errors: 0, Skipped: 0, Time elapsed: 64.578 sec - in org.apache.hadoop.hbase.master.TestAssignmentManagerOnCluster
Running org.apache.hadoop.hbase.master.TestMasterMetrics
Tests run: 2, Failures: 0, Errors: 0, Skipped: 0, Time elapsed: 1.228 sec - in org.apache.hadoop.hbase.master.TestMasterMetrics
Running org.apache.hadoop.hbase.master.TestZKLessAMOnCluster
Tests run: 15, Failures: 0, Errors: 0, Skipped: 0, Time elapsed: 133.215 sec - in org.apache.hadoop.hbase.master.TestSplitLogManager
Running org.apache.hadoop.hbase.master.TestMasterFileSystem
Tests run: 5, Failures: 0, Errors: 0, Skipped: 0, Time elapsed: 75.221 sec - in org.apache.hadoop.hbase.master.TestTableLockManager
Tests run: 2, Failures: 0, Errors: 0, Skipped: 0, Time elapsed: 1.259 sec - in org.apache.hadoop.hbase.master.TestMasterFileSystem
Running org.apache.hadoop.hbase.master.TestAssignmentManager
Tests run: 20, Failures: 0, Errors: 0, Skipped: 0, Time elapsed: 4.074 sec - in org.apache.hadoop.hbase.master.TestAssignmentManager
Tests run: 21, Failures: 0, Errors: 0, Skipped: 0, Time elapsed: 63.224 sec - in org.apache.hadoop.hbase.master.TestZKLessAMOnCluster
Tests run: 23, Failures: 0, Errors: 0, Skipped: 0, Time elapsed: 528.711 sec - in org.apache.hadoop.hbase.master.balancer.TestStochasticLoadBalancer

Results :




Tests run: 2076, Failures: 0, Errors: 0, Skipped: 19

[INFO] ------------------------------------------------------------------------
[INFO] Reactor Summary:
[INFO] 
[INFO] HBase ............................................. SUCCESS [2.997s]
[INFO] HBase - Checkstyle ................................ SUCCESS [0.611s]
[INFO] HBase - Annotations ............................... SUCCESS [0.812s]
[INFO] HBase - Common .................................... SUCCESS [59.030s]
[INFO] HBase - Protocol .................................. SUCCESS [8.783s]
[INFO] HBase - Client .................................... SUCCESS [1:15.809s]
[INFO] HBase - Hadoop Compatibility ...................... SUCCESS [6.927s]
[INFO] HBase - Hadoop Two Compatibility .................. SUCCESS [5.502s]
[INFO] HBase - Prefix Tree ............................... SUCCESS [8.326s]
[INFO] HBase - Server .................................... FAILURE [1:06:32.118s]
[INFO] HBase - Testing Util .............................. SKIPPED
[INFO] HBase - Thrift .................................... SKIPPED
[INFO] HBase - Rest ...................................... SKIPPED
[INFO] HBase - Shell ..................................... SKIPPED
[INFO] HBase - Integration Tests ......................... SKIPPED
[INFO] HBase - Examples .................................. SKIPPED
[INFO] HBase - Assembly .................................. SKIPPED
[INFO] ------------------------------------------------------------------------
[INFO] BUILD FAILURE
[INFO] ------------------------------------------------------------------------
[INFO] Total time: 1:09:21.692s
[INFO] Finished at: Tue Nov 18 18:48:39 UTC 2014
[INFO] Final Memory: 46M/756M
[INFO] ------------------------------------------------------------------------
[ERROR] Failed to execute goal org.apache.maven.plugins:maven-surefire-plugin:2.18:test (secondPartTestsExecution)
on project hbase-server: There was a timeout or other error in the fork -> [Help 1]
[ERROR] 
[ERROR] To see the full stack trace of the errors, re-run Maven with the -e switch.
[ERROR] Re-run Maven using the -X switch to enable full debug logging.
[ERROR] 
[ERROR] For more information about the errors and possible solutions, please read the following
articles:
[ERROR] [Help 1] http://cwiki.apache.org/confluence/display/MAVEN/MojoFailureException
[ERROR] 
[ERROR] After correcting the problems, you can resume the build with the command
[ERROR]   mvn <goals> -rf :hbase-server
Build step 'Invoke top-level Maven targets' marked build as failure
Performing Post build task...
Match found for :.* : True
Logical operation result is TRUE
Running script  :   ZOMBIE_TESTS_COUNT=`jps | grep surefirebooter | wc -l`
  if [[ $ZOMBIE_TESTS_COUNT != 0 ]] ; then
    #It seems sometimes the tests are not dying immediately. Let's give them 10s
    echo "Suspicious java process found - waiting 10s to see if there are just slow to stop"
    sleep 10   
    ZOMBIE_TESTS_COUNT=`jps | grep surefirebooter | wc -l`
    if [[ $ZOMBIE_TESTS_COUNT != 0 ]] ; then
      echo "There are $ZOMBIE_TESTS_COUNT zombie tests, they should have been killed by surefire
but survived"
      echo "************ BEGIN zombies jstack extract"
      ZB_STACK=`jps | grep surefirebooter | cut -d ' ' -f 1 | xargs -n 1 jstack | grep ".test"
| grep "\.java"`
      jps | grep surefirebooter | cut -d ' ' -f 1 | xargs -n 1 jstack
      echo "************ END  zombies jstack extract"
      JIRA_COMMENT="$JIRA_COMMENT

     {color:red}-1 core zombie tests{color}.  There are ${ZOMBIE_TESTS_COUNT} zombie test(s):
${ZB_STACK}"
      BAD=1
      jps | grep surefirebooter | cut -d ' ' -f 1 | xargs kill -9
    else
      echo "We're ok: there is no zombie test, but some tests took some time to stop"
    fi
  else
    echo "We're ok: there is no zombie test"
  fi
[HBase-1.0] $ /bin/bash -xe /tmp/hudson4961841731499797737.sh
++ jps
++ wc -l
++ grep surefirebooter
+ ZOMBIE_TESTS_COUNT=0
+ [[ 0 != 0 ]]
+ echo 'We'\''re ok: there is no zombie test'
We're ok: there is no zombie test
POST BUILD TASK : SUCCESS
END OF POST BUILD TASK : 0
Archiving artifacts
Sending artifact delta relative to HBase-1.0 #469
Archived 1785 artifacts
Archive block size is 32768
Received 27 blocks and 341029400 bytes
Compression is 0.3%
Took 2 min 0 sec
Recording test results
Updating HBASE-12337

Mime
View raw message