hbase-builds mailing list archives

Site index · List index
Message view « Date » · « Thread »
Top « Date » · « Thread »
From Apache Jenkins Server <jenk...@builds.apache.org>
Subject Build failed in Jenkins: HBase-1.0 #471
Date Tue, 18 Nov 2014 19:58:25 GMT
See <https://builds.apache.org/job/HBase-1.0/471/changes>

Changes:

[stack] HBASE-12471 Task 4. replace internal ConnectionManager#{delete,get}Connection use
with #close, #createConnection (0.98, 0.99)

------------------------------------------
[...truncated 1759 lines...]
Running org.apache.hadoop.hbase.TestClusterBootOrder
Tests run: 7, Failures: 0, Errors: 0, Skipped: 0, Time elapsed: 39.286 sec - in org.apache.hadoop.hbase.TestHBaseTestingUtility
Running org.apache.hadoop.hbase.TestGlobalMemStoreSize
Running org.apache.hadoop.hbase.security.access.TestCellACLs
Tests run: 1, Failures: 0, Errors: 0, Skipped: 0, Time elapsed: 12.212 sec - in org.apache.hadoop.hbase.TestGlobalMemStoreSize
Tests run: 2, Failures: 0, Errors: 0, Skipped: 0, Time elapsed: 7.613 sec - in org.apache.hadoop.hbase.security.access.TestCellACLs
Running org.apache.hadoop.hbase.security.access.TestAccessControlFilter
Tests run: 1, Failures: 0, Errors: 0, Skipped: 0, Time elapsed: 2.672 sec - in org.apache.hadoop.hbase.security.access.TestAccessControlFilter
Running org.apache.hadoop.hbase.security.access.TestAccessController
Tests run: 2, Failures: 0, Errors: 0, Skipped: 0, Time elapsed: 27.223 sec - in org.apache.hadoop.hbase.TestClusterBootOrder
Running org.apache.hadoop.hbase.security.access.TestCellACLWithMultipleVersions
Running org.apache.hadoop.hbase.security.access.TestNamespaceCommands
Tests run: 4, Failures: 0, Errors: 0, Skipped: 0, Time elapsed: 3.279 sec - in org.apache.hadoop.hbase.security.access.TestNamespaceCommands
Tests run: 2, Failures: 0, Errors: 0, Skipped: 0, Time elapsed: 99.16 sec - in org.apache.hadoop.hbase.mapred.TestTableMapReduce
Tests run: 8, Failures: 0, Errors: 0, Skipped: 0, Time elapsed: 17.875 sec - in org.apache.hadoop.hbase.security.access.TestCellACLWithMultipleVersions
Running org.apache.hadoop.hbase.security.access.TestTablePermissions
Running org.apache.hadoop.hbase.security.access.TestScanEarlyTermination
Tests run: 1, Failures: 0, Errors: 0, Skipped: 0, Time elapsed: 4.136 sec - in org.apache.hadoop.hbase.security.access.TestScanEarlyTermination
Running org.apache.hadoop.hbase.security.access.TestAccessController2
Running org.apache.hadoop.hbase.security.access.TestZKPermissionsWatcher
Tests run: 1, Failures: 0, Errors: 0, Skipped: 0, Time elapsed: 3.836 sec - in org.apache.hadoop.hbase.security.access.TestZKPermissionsWatcher
Tests run: 2, Failures: 0, Errors: 0, Skipped: 0, Time elapsed: 7.864 sec - in org.apache.hadoop.hbase.security.access.TestAccessController2
Running org.apache.hadoop.hbase.security.token.TestZKSecretWatcher
Running org.apache.hadoop.hbase.security.token.TestTokenAuthentication
Tests run: 2, Failures: 0, Errors: 0, Skipped: 0, Time elapsed: 0.378 sec - in org.apache.hadoop.hbase.security.token.TestTokenAuthentication
Tests run: 7, Failures: 0, Errors: 0, Skipped: 0, Time elapsed: 22.222 sec - in org.apache.hadoop.hbase.security.access.TestTablePermissions
Running org.apache.hadoop.hbase.security.visibility.TestVisibilityLabelsWithSLGStack
Tests run: 1, Failures: 0, Errors: 0, Skipped: 0, Time elapsed: 1.495 sec - in org.apache.hadoop.hbase.security.visibility.TestVisibilityLabelsWithSLGStack
Running org.apache.hadoop.hbase.security.visibility.TestEnforcingScanLabelGenerator
Tests run: 1, Failures: 0, Errors: 0, Skipped: 0, Time elapsed: 13.206 sec - in org.apache.hadoop.hbase.security.token.TestZKSecretWatcher
Tests run: 1, Failures: 0, Errors: 0, Skipped: 0, Time elapsed: 2.005 sec - in org.apache.hadoop.hbase.security.visibility.TestEnforcingScanLabelGenerator
Running org.apache.hadoop.hbase.security.visibility.TestVisibilityLabelsWithDeletes
Running org.apache.hadoop.hbase.security.visibility.TestVisibilityLabelsOpWithDifferentUsersNoACL
Running org.apache.hadoop.hbase.security.visibility.TestVisibilityLabelsWithDistributedLogReplay
Tests run: 1, Failures: 0, Errors: 0, Skipped: 0, Time elapsed: 2.705 sec - in org.apache.hadoop.hbase.security.visibility.TestVisibilityLabelsOpWithDifferentUsersNoACL
Running org.apache.hadoop.hbase.security.visibility.TestVisibilityLabelsWithCustomVisLabService
Tests run: 21, Failures: 0, Errors: 0, Skipped: 0, Time elapsed: 17.152 sec - in org.apache.hadoop.hbase.security.visibility.TestVisibilityLabelsWithDistributedLogReplay
Tests run: 19, Failures: 0, Errors: 0, Skipped: 0, Time elapsed: 13.591 sec - in org.apache.hadoop.hbase.security.visibility.TestVisibilityLabelsWithCustomVisLabService
Running org.apache.hadoop.hbase.security.visibility.TestVisibilityLabelsWithDefaultVisLabelService
Running org.apache.hadoop.hbase.security.visibility.TestVisibilityLabelsWithACL
Tests run: 37, Failures: 0, Errors: 0, Skipped: 0, Time elapsed: 37.308 sec - in org.apache.hadoop.hbase.security.visibility.TestVisibilityLabelsWithDeletes
Tests run: 5, Failures: 0, Errors: 0, Skipped: 0, Time elapsed: 4.971 sec - in org.apache.hadoop.hbase.security.visibility.TestVisibilityLabelsWithACL
Running org.apache.hadoop.hbase.zookeeper.lock.TestZKInterProcessReadWriteLock
Tests run: 21, Failures: 0, Errors: 0, Skipped: 0, Time elapsed: 15.715 sec - in org.apache.hadoop.hbase.security.visibility.TestVisibilityLabelsWithDefaultVisLabelService
Running org.apache.hadoop.hbase.security.visibility.TestVisibilityWithCheckAuths
Tests run: 2, Failures: 0, Errors: 0, Skipped: 0, Time elapsed: 3.287 sec - in org.apache.hadoop.hbase.security.visibility.TestVisibilityWithCheckAuths
Running org.apache.hadoop.hbase.zookeeper.TestHQuorumPeer
Running org.apache.hadoop.hbase.zookeeper.TestZooKeeperACL
Tests run: 6, Failures: 0, Errors: 0, Skipped: 0, Time elapsed: 0.272 sec - in org.apache.hadoop.hbase.zookeeper.TestZooKeeperACL
Tests run: 49, Failures: 0, Errors: 0, Skipped: 0, Time elapsed: 120.713 sec - in org.apache.hadoop.hbase.security.access.TestAccessController
Running org.apache.hadoop.hbase.zookeeper.TestZooKeeperNodeTracker
Tests run: 3, Failures: 0, Errors: 0, Skipped: 0, Time elapsed: 0.869 sec - in org.apache.hadoop.hbase.zookeeper.TestZooKeeperNodeTracker
Running org.apache.hadoop.hbase.zookeeper.TestZKTableStateManager
Tests run: 1, Failures: 0, Errors: 0, Skipped: 0, Time elapsed: 0.73 sec - in org.apache.hadoop.hbase.zookeeper.TestZKTableStateManager
Running org.apache.hadoop.hbase.zookeeper.TestRecoverableZooKeeper
Tests run: 3, Failures: 0, Errors: 0, Skipped: 0, Time elapsed: 6.6 sec - in org.apache.hadoop.hbase.zookeeper.TestHQuorumPeer
Tests run: 1, Failures: 0, Errors: 0, Skipped: 0, Time elapsed: 1.215 sec - in org.apache.hadoop.hbase.zookeeper.TestRecoverableZooKeeper
Running org.apache.hadoop.hbase.zookeeper.TestZKLeaderManager
Tests run: 1, Failures: 0, Errors: 0, Skipped: 0, Time elapsed: 0.123 sec - in org.apache.hadoop.hbase.zookeeper.TestZKLeaderManager
Running org.apache.hadoop.hbase.zookeeper.TestZKMulti
Tests run: 6, Failures: 0, Errors: 0, Skipped: 0, Time elapsed: 0.299 sec - in org.apache.hadoop.hbase.zookeeper.TestZKMulti
Running org.apache.hadoop.hbase.TestRegionRebalancing
Running org.apache.hadoop.hbase.TestDrainingServer
Running org.apache.hadoop.hbase.TestAcidGuarantees
Tests run: 2, Failures: 0, Errors: 0, Skipped: 0, Time elapsed: 1.553 sec - in org.apache.hadoop.hbase.TestDrainingServer
Tests run: 6, Failures: 0, Errors: 0, Skipped: 0, Time elapsed: 24.448 sec - in org.apache.hadoop.hbase.zookeeper.lock.TestZKInterProcessReadWriteLock
Tests run: 6, Failures: 0, Errors: 0, Skipped: 0, Time elapsed: 259.453 sec - in org.apache.hadoop.hbase.mapred.TestTableSnapshotInputFormat
Running org.apache.hadoop.hbase.migration.TestUpgradeTo96
Running org.apache.hadoop.hbase.migration.TestNamespaceUpgrade
Tests run: 5, Failures: 0, Errors: 0, Skipped: 0, Time elapsed: 2.557 sec - in org.apache.hadoop.hbase.migration.TestUpgradeTo96
Running org.apache.hadoop.hbase.TestMultiVersions
Running org.apache.hadoop.hbase.master.TestAssignmentListener
Tests run: 2, Failures: 0, Errors: 0, Skipped: 0, Time elapsed: 32.641 sec - in org.apache.hadoop.hbase.TestRegionRebalancing
Running org.apache.hadoop.hbase.master.TestHMasterRPCException
Tests run: 3, Failures: 0, Errors: 0, Skipped: 0, Time elapsed: 6.452 sec - in org.apache.hadoop.hbase.TestMultiVersions
Running org.apache.hadoop.hbase.master.TestDeadServer
Tests run: 3, Failures: 0, Errors: 0, Skipped: 0, Time elapsed: 0.418 sec - in org.apache.hadoop.hbase.master.TestDeadServer
Running org.apache.hadoop.hbase.master.TestMasterRestartAfterDisablingTable
Tests run: 1, Failures: 0, Errors: 0, Skipped: 0, Time elapsed: 3.106 sec - in org.apache.hadoop.hbase.master.TestHMasterRPCException
Tests run: 5, Failures: 0, Errors: 0, Skipped: 0, Time elapsed: 18.211 sec - in org.apache.hadoop.hbase.migration.TestNamespaceUpgrade
Tests run: 2, Failures: 0, Errors: 0, Skipped: 0, Time elapsed: 5.783 sec - in org.apache.hadoop.hbase.master.TestAssignmentListener
Running org.apache.hadoop.hbase.master.TestMasterFailoverBalancerPersistence
Running org.apache.hadoop.hbase.master.snapshot.TestSnapshotFileCache
Running org.apache.hadoop.hbase.master.TestZKBasedOpenCloseRegion
Tests run: 1, Failures: 0, Errors: 0, Skipped: 0, Time elapsed: 15.486 sec - in org.apache.hadoop.hbase.master.TestMasterRestartAfterDisablingTable
Running org.apache.hadoop.hbase.master.TestMasterShutdown
Tests run: 1, Failures: 0, Errors: 0, Skipped: 0, Time elapsed: 14.924 sec - in org.apache.hadoop.hbase.master.TestMasterFailoverBalancerPersistence
Tests run: 3, Failures: 0, Errors: 0, Skipped: 0, Time elapsed: 2.708 sec - in org.apache.hadoop.hbase.master.TestZKBasedOpenCloseRegion
Running org.apache.hadoop.hbase.master.cleaner.TestHFileCleaner
Tests run: 3, Failures: 0, Errors: 0, Skipped: 0, Time elapsed: 0.882 sec - in org.apache.hadoop.hbase.master.cleaner.TestHFileCleaner
Running org.apache.hadoop.hbase.master.cleaner.TestLogsCleaner
Running org.apache.hadoop.hbase.master.cleaner.TestSnapshotFromMaster
Tests run: 4, Failures: 0, Errors: 0, Skipped: 0, Time elapsed: 18.626 sec - in org.apache.hadoop.hbase.master.snapshot.TestSnapshotFileCache
Tests run: 2, Failures: 0, Errors: 0, Skipped: 0, Time elapsed: 15.645 sec - in org.apache.hadoop.hbase.master.TestMasterShutdown
Running org.apache.hadoop.hbase.master.TestMasterStatusServlet
Tests run: 4, Failures: 0, Errors: 0, Skipped: 0, Time elapsed: 1.682 sec - in org.apache.hadoop.hbase.master.TestMasterStatusServlet
Tests run: 1, Failures: 0, Errors: 0, Skipped: 0, Time elapsed: 11.406 sec - in org.apache.hadoop.hbase.master.cleaner.TestLogsCleaner
Running org.apache.hadoop.hbase.master.balancer.TestStochasticLoadBalancer
Running org.apache.hadoop.hbase.master.balancer.TestDefaultLoadBalancer
Tests run: 4, Failures: 0, Errors: 0, Skipped: 0, Time elapsed: 11.934 sec - in org.apache.hadoop.hbase.master.cleaner.TestSnapshotFromMaster
Running org.apache.hadoop.hbase.master.TestMasterOperationsForRegionReplicas
Running org.apache.hadoop.hbase.master.balancer.TestBaseLoadBalancer
Tests run: 3, Failures: 0, Errors: 0, Skipped: 0, Time elapsed: 80.548 sec - in org.apache.hadoop.hbase.TestAcidGuarantees
Running org.apache.hadoop.hbase.master.TestMasterFailover
Tests run: 2, Failures: 0, Errors: 0, Skipped: 0, Time elapsed: 14.284 sec - in org.apache.hadoop.hbase.master.TestMasterOperationsForRegionReplicas
Running org.apache.hadoop.hbase.master.TestDistributedLogSplitting
Tests run: 1, Failures: 0, Errors: 0, Skipped: 0, Time elapsed: 49.262 sec - in org.apache.hadoop.hbase.master.balancer.TestDefaultLoadBalancer
Running org.apache.hadoop.hbase.master.TestMasterNoCluster
Tests run: 6, Failures: 0, Errors: 0, Skipped: 0, Time elapsed: 51.931 sec - in org.apache.hadoop.hbase.master.TestMasterFailover
Running org.apache.hadoop.hbase.master.TestRollingRestart
Tests run: 3, Failures: 0, Errors: 0, Skipped: 0, Time elapsed: 13.1 sec - in org.apache.hadoop.hbase.master.TestMasterNoCluster
Running org.apache.hadoop.hbase.master.TestRegionPlacement2
Tests run: 2, Failures: 0, Errors: 0, Skipped: 0, Time elapsed: 2.19 sec - in org.apache.hadoop.hbase.master.TestRegionPlacement2
Tests run: 1, Failures: 0, Errors: 0, Skipped: 0, Time elapsed: 20.598 sec - in org.apache.hadoop.hbase.master.TestRollingRestart
Running org.apache.hadoop.hbase.master.TestMaster
Tests run: 4, Failures: 0, Errors: 0, Skipped: 0, Time elapsed: 5.964 sec - in org.apache.hadoop.hbase.master.TestMaster
Running org.apache.hadoop.hbase.master.TestActiveMasterManager
Tests run: 2, Failures: 0, Errors: 0, Skipped: 0, Time elapsed: 0.995 sec - in org.apache.hadoop.hbase.master.TestActiveMasterManager
Running org.apache.hadoop.hbase.master.TestMasterMetricsWrapper
Tests run: 1, Failures: 0, Errors: 0, Skipped: 0, Time elapsed: 1.976 sec - in org.apache.hadoop.hbase.master.TestMasterMetricsWrapper
Running org.apache.hadoop.hbase.master.TestRestartCluster
Running org.apache.hadoop.hbase.master.TestMasterTransitions
Tests run: 3, Failures: 0, Errors: 0, Skipped: 3, Time elapsed: 1.974 sec - in org.apache.hadoop.hbase.master.TestMasterTransitions
Running org.apache.hadoop.hbase.master.TestOpenedRegionHandler
Tests run: 2, Failures: 0, Errors: 0, Skipped: 0, Time elapsed: 11.88 sec - in org.apache.hadoop.hbase.master.TestOpenedRegionHandler
Running org.apache.hadoop.hbase.master.handler.TestTableDescriptorModification
Tests run: 3, Failures: 0, Errors: 0, Skipped: 0, Time elapsed: 33.19 sec - in org.apache.hadoop.hbase.master.TestRestartCluster
Tests run: 3, Failures: 0, Errors: 0, Skipped: 0, Time elapsed: 3.894 sec - in org.apache.hadoop.hbase.master.handler.TestTableDescriptorModification
Running org.apache.hadoop.hbase.master.handler.TestCreateTableHandler
Running org.apache.hadoop.hbase.master.handler.TestTableDeleteFamilyHandler
Tests run: 1, Failures: 0, Errors: 0, Skipped: 0, Time elapsed: 1.759 sec - in org.apache.hadoop.hbase.master.handler.TestTableDeleteFamilyHandler
Running org.apache.hadoop.hbase.master.TestSplitLogManager
Tests run: 3, Failures: 0, Errors: 0, Skipped: 0, Time elapsed: 24.317 sec - in org.apache.hadoop.hbase.master.handler.TestCreateTableHandler
Running org.apache.hadoop.hbase.master.TestAssignmentManagerOnCluster
Tests run: 18, Failures: 0, Errors: 0, Skipped: 0, Time elapsed: 165.405 sec - in org.apache.hadoop.hbase.master.TestDistributedLogSplitting
Running org.apache.hadoop.hbase.master.TestRegionPlacement
Tests run: 2, Failures: 0, Errors: 0, Skipped: 0, Time elapsed: 17.447 sec - in org.apache.hadoop.hbase.master.TestRegionPlacement
Running org.apache.hadoop.hbase.master.TestClusterStatusPublisher
Tests run: 3, Failures: 0, Errors: 0, Skipped: 0, Time elapsed: 0.398 sec - in org.apache.hadoop.hbase.master.TestClusterStatusPublisher
Running org.apache.hadoop.hbase.master.TestTableLockManager
Tests run: 21, Failures: 0, Errors: 0, Skipped: 0, Time elapsed: 67.309 sec - in org.apache.hadoop.hbase.master.TestAssignmentManagerOnCluster
Running org.apache.hadoop.hbase.master.TestMasterMetrics
Tests run: 2, Failures: 0, Errors: 0, Skipped: 0, Time elapsed: 0.939 sec - in org.apache.hadoop.hbase.master.TestMasterMetrics
Running org.apache.hadoop.hbase.master.TestZKLessAMOnCluster
Tests run: 15, Failures: 0, Errors: 0, Skipped: 0, Time elapsed: 133.047 sec - in org.apache.hadoop.hbase.master.TestSplitLogManager
Tests run: 5, Failures: 0, Errors: 0, Skipped: 0, Time elapsed: 69.541 sec - in org.apache.hadoop.hbase.master.TestTableLockManager
Running org.apache.hadoop.hbase.master.TestMasterFileSystem
Running org.apache.hadoop.hbase.master.TestAssignmentManager
Tests run: 2, Failures: 0, Errors: 0, Skipped: 0, Time elapsed: 1.348 sec - in org.apache.hadoop.hbase.master.TestMasterFileSystem
Tests run: 20, Failures: 0, Errors: 0, Skipped: 0, Time elapsed: 4.067 sec - in org.apache.hadoop.hbase.master.TestAssignmentManager
Tests run: 21, Failures: 0, Errors: 0, Skipped: 0, Time elapsed: 64.177 sec - in org.apache.hadoop.hbase.master.TestZKLessAMOnCluster
Tests run: 7, Failures: 0, Errors: 0, Skipped: 0, Time elapsed: 393.322 sec - in org.apache.hadoop.hbase.master.balancer.TestBaseLoadBalancer
Tests run: 23, Failures: 0, Errors: 0, Skipped: 0, Time elapsed: 528.296 sec - in org.apache.hadoop.hbase.master.balancer.TestStochasticLoadBalancer

Results :

Failed tests: 
  TestMultiParallel.testActiveThreadsCount:161 expected:<5> but was:<4>



Tests run: 2083, Failures: 1, Errors: 0, Skipped: 19

[INFO] ------------------------------------------------------------------------
[INFO] Reactor Summary:
[INFO] 
[INFO] HBase ............................................. SUCCESS [2.946s]
[INFO] HBase - Checkstyle ................................ SUCCESS [0.662s]
[INFO] HBase - Annotations ............................... SUCCESS [0.893s]
[INFO] HBase - Common .................................... SUCCESS [58.245s]
[INFO] HBase - Protocol .................................. SUCCESS [9.073s]
[INFO] HBase - Client .................................... SUCCESS [1:16.065s]
[INFO] HBase - Hadoop Compatibility ...................... SUCCESS [6.957s]
[INFO] HBase - Hadoop Two Compatibility .................. SUCCESS [5.580s]
[INFO] HBase - Prefix Tree ............................... SUCCESS [8.251s]
[INFO] HBase - Server .................................... FAILURE [1:00:30.403s]
[INFO] HBase - Testing Util .............................. SKIPPED
[INFO] HBase - Thrift .................................... SKIPPED
[INFO] HBase - Rest ...................................... SKIPPED
[INFO] HBase - Shell ..................................... SKIPPED
[INFO] HBase - Integration Tests ......................... SKIPPED
[INFO] HBase - Examples .................................. SKIPPED
[INFO] HBase - Assembly .................................. SKIPPED
[INFO] ------------------------------------------------------------------------
[INFO] BUILD FAILURE
[INFO] ------------------------------------------------------------------------
[INFO] Total time: 1:03:19.905s
[INFO] Finished at: Tue Nov 18 19:55:38 UTC 2014
[INFO] Final Memory: 46M/843M
[INFO] ------------------------------------------------------------------------
[ERROR] Failed to execute goal org.apache.maven.plugins:maven-surefire-plugin:2.18:test (secondPartTestsExecution)
on project hbase-server: There are test failures.
[ERROR] 
[ERROR] Please refer to <https://builds.apache.org/job/HBase-1.0/ws/hbase-server/target/surefire-reports>
for the individual test results.
[ERROR] -> [Help 1]
[ERROR] 
[ERROR] To see the full stack trace of the errors, re-run Maven with the -e switch.
[ERROR] Re-run Maven using the -X switch to enable full debug logging.
[ERROR] 
[ERROR] For more information about the errors and possible solutions, please read the following
articles:
[ERROR] [Help 1] http://cwiki.apache.org/confluence/display/MAVEN/MojoFailureException
[ERROR] 
[ERROR] After correcting the problems, you can resume the build with the command
[ERROR]   mvn <goals> -rf :hbase-server
Build step 'Invoke top-level Maven targets' marked build as failure
Performing Post build task...
Match found for :.* : True
Logical operation result is TRUE
Running script  :   ZOMBIE_TESTS_COUNT=`jps | grep surefirebooter | wc -l`
  if [[ $ZOMBIE_TESTS_COUNT != 0 ]] ; then
    #It seems sometimes the tests are not dying immediately. Let's give them 10s
    echo "Suspicious java process found - waiting 10s to see if there are just slow to stop"
    sleep 10   
    ZOMBIE_TESTS_COUNT=`jps | grep surefirebooter | wc -l`
    if [[ $ZOMBIE_TESTS_COUNT != 0 ]] ; then
      echo "There are $ZOMBIE_TESTS_COUNT zombie tests, they should have been killed by surefire
but survived"
      echo "************ BEGIN zombies jstack extract"
      ZB_STACK=`jps | grep surefirebooter | cut -d ' ' -f 1 | xargs -n 1 jstack | grep ".test"
| grep "\.java"`
      jps | grep surefirebooter | cut -d ' ' -f 1 | xargs -n 1 jstack
      echo "************ END  zombies jstack extract"
      JIRA_COMMENT="$JIRA_COMMENT

     {color:red}-1 core zombie tests{color}.  There are ${ZOMBIE_TESTS_COUNT} zombie test(s):
${ZB_STACK}"
      BAD=1
      jps | grep surefirebooter | cut -d ' ' -f 1 | xargs kill -9
    else
      echo "We're ok: there is no zombie test, but some tests took some time to stop"
    fi
  else
    echo "We're ok: there is no zombie test"
  fi
[HBase-1.0] $ /bin/bash -xe /tmp/hudson1792380954232305609.sh
++ jps
++ grep surefirebooter
++ wc -l
+ ZOMBIE_TESTS_COUNT=0
+ [[ 0 != 0 ]]
+ echo 'We'\''re ok: there is no zombie test'
We're ok: there is no zombie test
POST BUILD TASK : SUCCESS
END OF POST BUILD TASK : 0
Archiving artifacts
Sending artifact delta relative to HBase-1.0 #469
Archived 1787 artifacts
Archive block size is 32768
Received 27 blocks and 343259620 bytes
Compression is 0.3%
Took 1 min 56 sec
Recording test results
Updating HBASE-12471

Mime
View raw message