hbase-builds mailing list archives

Site index · List index
Message view « Date » · « Thread »
Top « Date » · « Thread »
From Apache Jenkins Server <jenk...@builds.apache.org>
Subject Build failed in Jenkins: HBase-0.98 #618
Date Tue, 21 Oct 2014 19:04:21 GMT
See <https://builds.apache.org/job/HBase-0.98/618/changes>

Changes:

[stack] HBASE-12308 Fix typo in hbase-rest profile name (Solomon Duskis)

------------------------------------------
[...truncated 1719 lines...]
Tests run: 4, Failures: 0, Errors: 0, Skipped: 0, Time elapsed: 45.677 sec
Running org.apache.hadoop.hbase.client.TestFromClientSideNoCodec
Tests run: 2, Failures: 0, Errors: 0, Skipped: 0, Time elapsed: 9.225 sec
Running org.apache.hadoop.hbase.client.TestScannersFromClientSide
Tests run: 5, Failures: 0, Errors: 0, Skipped: 0, Time elapsed: 11.75 sec
Running org.apache.hadoop.hbase.client.TestHTableUtil
Tests run: 2, Failures: 0, Errors: 0, Skipped: 0, Time elapsed: 8.734 sec
Running org.apache.hadoop.hbase.client.TestAdmin
Tests run: 44, Failures: 0, Errors: 0, Skipped: 0, Time elapsed: 377.115 sec
Running org.apache.hadoop.hbase.client.TestCheckAndMutate
Tests run: 1, Failures: 0, Errors: 0, Skipped: 0, Time elapsed: 9.141 sec
Running org.apache.hadoop.hbase.client.TestHTableMultiplexerFlushCache
Tests run: 1, Failures: 0, Errors: 0, Skipped: 0, Time elapsed: 11.188 sec
Running org.apache.hadoop.hbase.client.TestTimestampsFilter
Tests run: 3, Failures: 0, Errors: 0, Skipped: 0, Time elapsed: 11.894 sec
Running org.apache.hadoop.hbase.client.TestFromClientSide
Tests run: 77, Failures: 0, Errors: 0, Skipped: 4, Time elapsed: 84.955 sec
Running org.apache.hadoop.hbase.client.TestTableSnapshotScanner
Tests run: 3, Failures: 0, Errors: 0, Skipped: 0, Time elapsed: 32.854 sec
Running org.apache.hadoop.hbase.client.TestRpcControllerFactory
Tests run: 1, Failures: 0, Errors: 0, Skipped: 0, Time elapsed: 8.755 sec
Running org.apache.hadoop.hbase.client.TestMultiParallel
Tests run: 12, Failures: 0, Errors: 0, Skipped: 0, Time elapsed: 23.116 sec
Running org.apache.hadoop.hbase.client.TestClientScannerRPCTimeout
Tests run: 1, Failures: 0, Errors: 0, Skipped: 0, Time elapsed: 28.435 sec
Running org.apache.hadoop.hbase.client.TestMetaScanner
Tests run: 2, Failures: 0, Errors: 0, Skipped: 0, Time elapsed: 42.377 sec
Running org.apache.hadoop.hbase.client.TestPutWithDelete
Tests run: 1, Failures: 0, Errors: 0, Skipped: 0, Time elapsed: 9.012 sec
Running org.apache.hadoop.hbase.client.TestFromClientSide3
Tests run: 6, Failures: 0, Errors: 0, Skipped: 0, Time elapsed: 30.233 sec
Running org.apache.hadoop.hbase.client.TestRestoreSnapshotFromClient
Tests run: 5, Failures: 0, Errors: 0, Skipped: 0, Time elapsed: 74.39 sec
Running org.apache.hadoop.hbase.regionserver.TestTags
Tests run: 4, Failures: 0, Errors: 0, Skipped: 0, Time elapsed: 10.742 sec
Running org.apache.hadoop.hbase.regionserver.TestRegionServerNoMaster
Tests run: 9, Failures: 0, Errors: 0, Skipped: 0, Time elapsed: 25.221 sec
Running org.apache.hadoop.hbase.regionserver.TestPriorityRpc
Tests run: 3, Failures: 0, Errors: 0, Skipped: 0, Time elapsed: 1.778 sec
Running org.apache.hadoop.hbase.regionserver.TestBlocksRead
Tests run: 4, Failures: 0, Errors: 0, Skipped: 0, Time elapsed: 2.104 sec
Running org.apache.hadoop.hbase.regionserver.TestEncryptionRandomKeying
Tests run: 1, Failures: 0, Errors: 0, Skipped: 0, Time elapsed: 8.842 sec
Running org.apache.hadoop.hbase.regionserver.TestMasterAddressTracker
Tests run: 1, Failures: 0, Errors: 0, Skipped: 0, Time elapsed: 1.197 sec
Running org.apache.hadoop.hbase.regionserver.TestScannerWithBulkload
Tests run: 3, Failures: 0, Errors: 0, Skipped: 0, Time elapsed: 9.769 sec
Running org.apache.hadoop.hbase.regionserver.TestCompaction
Tests run: 5, Failures: 0, Errors: 0, Skipped: 0, Time elapsed: 10.323 sec
Running org.apache.hadoop.hbase.client.TestFromClientSideWithCoprocessor
Tests run: 77, Failures: 0, Errors: 0, Skipped: 4, Time elapsed: 83.902 sec
Running org.apache.hadoop.hbase.regionserver.TestStoreScanner
Tests run: 16, Failures: 0, Errors: 0, Skipped: 0, Time elapsed: 0.714 sec
Running org.apache.hadoop.hbase.regionserver.TestParallelPut
Tests run: 2, Failures: 0, Errors: 0, Skipped: 0, Time elapsed: 5.601 sec
Running org.apache.hadoop.hbase.regionserver.TestMultiColumnScanner
Tests run: 12, Failures: 0, Errors: 0, Skipped: 0, Time elapsed: 42.31 sec
Running org.apache.hadoop.hbase.regionserver.TestHRegionServerBulkLoad
Tests run: 1, Failures: 0, Errors: 0, Skipped: 0, Time elapsed: 39.534 sec
Running org.apache.hadoop.hbase.regionserver.TestJoinedScanners
Tests run: 1, Failures: 0, Errors: 0, Skipped: 0, Time elapsed: 18.661 sec
Running org.apache.hadoop.hbase.regionserver.TestReversibleScanners
Tests run: 5, Failures: 0, Errors: 0, Skipped: 0, Time elapsed: 3.668 sec
Running org.apache.hadoop.hbase.regionserver.TestSplitTransactionOnCluster
Tests run: 12, Failures: 0, Errors: 0, Skipped: 0, Time elapsed: 37.479 sec
Running org.apache.hadoop.hbase.regionserver.TestHRegionOnCluster
Tests run: 1, Failures: 0, Errors: 0, Skipped: 0, Time elapsed: 12.109 sec
Running org.apache.hadoop.hbase.regionserver.TestHRegion
Tests run: 73, Failures: 0, Errors: 0, Skipped: 0, Time elapsed: 56.779 sec
Running org.apache.hadoop.hbase.regionserver.TestEndToEndSplitTransaction
Tests run: 2, Failures: 0, Errors: 0, Skipped: 0, Time elapsed: 21.391 sec
Running org.apache.hadoop.hbase.regionserver.TestGetClosestAtOrBefore
Tests run: 3, Failures: 0, Errors: 0, Skipped: 0, Time elapsed: 1.848 sec
Running org.apache.hadoop.hbase.regionserver.TestSCVFWithMiniCluster
Tests run: 5, Failures: 0, Errors: 0, Skipped: 0, Time elapsed: 7.388 sec
Running org.apache.hadoop.hbase.regionserver.TestStore
Tests run: 16, Failures: 0, Errors: 0, Skipped: 0, Time elapsed: 13.279 sec
Running org.apache.hadoop.hbase.regionserver.TestCacheOnWriteInSchema
Tests run: 3, Failures: 0, Errors: 0, Skipped: 0, Time elapsed: 2.413 sec
Running org.apache.hadoop.hbase.regionserver.TestSeekOptimizations
Tests run: 6, Failures: 0, Errors: 0, Skipped: 0, Time elapsed: 4.06 sec
Running org.apache.hadoop.hbase.regionserver.wal.TestWALReplay
Tests run: 9, Failures: 0, Errors: 0, Skipped: 0, Time elapsed: 52.215 sec
Running org.apache.hadoop.hbase.regionserver.wal.TestWALReplayCompressed
Tests run: 9, Failures: 0, Errors: 0, Skipped: 0, Time elapsed: 52.774 sec
Running org.apache.hadoop.hbase.regionserver.wal.TestLogRollPeriod
Tests run: 2, Failures: 0, Errors: 0, Skipped: 0, Time elapsed: 57.625 sec
Running org.apache.hadoop.hbase.regionserver.wal.TestSecureWALReplay
Tests run: 9, Failures: 0, Errors: 0, Skipped: 0, Time elapsed: 56.283 sec
Running org.apache.hadoop.hbase.regionserver.wal.TestHLogSplit
Tests run: 33, Failures: 0, Errors: 0, Skipped: 1, Time elapsed: 62.224 sec
Running org.apache.hadoop.hbase.regionserver.wal.TestHLogReaderOnSecureHLog
Tests run: 2, Failures: 0, Errors: 0, Skipped: 0, Time elapsed: 1.999 sec
Running org.apache.hadoop.hbase.regionserver.wal.TestLogRollAbort
Tests run: 1, Failures: 0, Errors: 0, Skipped: 0, Time elapsed: 13.884 sec
Running org.apache.hadoop.hbase.regionserver.wal.TestReadOldRootAndMetaEdits
Tests run: 1, Failures: 0, Errors: 0, Skipped: 0, Time elapsed: 1.222 sec
Running org.apache.hadoop.hbase.regionserver.wal.TestLogRolling
Tests run: 4, Failures: 0, Errors: 0, Skipped: 0, Time elapsed: 193.58 sec
Running org.apache.hadoop.hbase.regionserver.wal.TestDurability
Tests run: 2, Failures: 0, Errors: 0, Skipped: 0, Time elapsed: 5.462 sec
Running org.apache.hadoop.hbase.regionserver.wal.TestSecureHLog
Tests run: 1, Failures: 0, Errors: 0, Skipped: 0, Time elapsed: 1.99 sec
Running org.apache.hadoop.hbase.regionserver.wal.TestHLog
Tests run: 17, Failures: 0, Errors: 0, Skipped: 0, Time elapsed: 33.496 sec
Running org.apache.hadoop.hbase.regionserver.wal.TestHLogSplitCompressed
Tests run: 33, Failures: 0, Errors: 0, Skipped: 1, Time elapsed: 61.361 sec
Running org.apache.hadoop.hbase.regionserver.TestMinorCompaction
Tests run: 6, Failures: 0, Errors: 0, Skipped: 0, Time elapsed: 3.253 sec
Running org.apache.hadoop.hbase.regionserver.wal.TestHLogFiltering
Tests run: 1, Failures: 0, Errors: 0, Skipped: 0, Time elapsed: 23.243 sec
Running org.apache.hadoop.hbase.regionserver.TestRegionMergeTransactionOnCluster
Tests run: 3, Failures: 0, Errors: 0, Skipped: 0, Time elapsed: 18.634 sec
Running org.apache.hadoop.hbase.regionserver.TestZKLessMergeOnCluster
Tests run: 3, Failures: 0, Errors: 0, Skipped: 0, Time elapsed: 18.846 sec
Running org.apache.hadoop.hbase.regionserver.TestServerCustomProtocol
Tests run: 7, Failures: 0, Errors: 0, Skipped: 0, Time elapsed: 17.645 sec
Running org.apache.hadoop.hbase.regionserver.TestRegionFavoredNodes
Tests run: 1, Failures: 0, Errors: 0, Skipped: 0, Time elapsed: 17.089 sec
Running org.apache.hadoop.hbase.regionserver.TestCompactionWithCoprocessor
Tests run: 5, Failures: 0, Errors: 0, Skipped: 0, Time elapsed: 9.559 sec
Running org.apache.hadoop.hbase.regionserver.TestZKLessSplitOnCluster
Tests run: 12, Failures: 0, Errors: 0, Skipped: 0, Time elapsed: 31.26 sec
Running org.apache.hadoop.hbase.regionserver.TestAtomicOperation
Tests run: 6, Failures: 0, Errors: 0, Skipped: 0, Time elapsed: 29.352 sec
Running org.apache.hadoop.hbase.regionserver.TestSplitLogWorker
Tests run: 7, Failures: 0, Errors: 0, Skipped: 0, Time elapsed: 24.863 sec
Running org.apache.hadoop.hbase.regionserver.TestMemStore
Tests run: 23, Failures: 0, Errors: 0, Skipped: 0, Time elapsed: 42.086 sec
Running org.apache.hadoop.hbase.regionserver.TestMajorCompaction
Tests run: 7, Failures: 0, Errors: 0, Skipped: 0, Time elapsed: 25.442 sec
Running org.apache.hadoop.hbase.regionserver.TestCompactionState
Tests run: 5, Failures: 0, Errors: 0, Skipped: 0, Time elapsed: 27.057 sec
Running org.apache.hadoop.hbase.regionserver.TestClusterId
Tests run: 2, Failures: 0, Errors: 0, Skipped: 0, Time elapsed: 29.655 sec
Running org.apache.hadoop.hbase.regionserver.TestEncryptionKeyRotation
Tests run: 2, Failures: 0, Errors: 0, Skipped: 0, Time elapsed: 18.241 sec
Running org.apache.hadoop.hbase.regionserver.TestFSErrorsExposed
Tests run: 3, Failures: 0, Errors: 0, Skipped: 0, Time elapsed: 28.511 sec
Running org.apache.hadoop.hbase.regionserver.handler.TestOpenRegionHandler
Tests run: 6, Failures: 0, Errors: 0, Skipped: 0, Time elapsed: 2.083 sec
Running org.apache.hadoop.hbase.regionserver.handler.TestCloseRegionHandler
Tests run: 3, Failures: 0, Errors: 0, Skipped: 0, Time elapsed: 2.124 sec
Running org.apache.hadoop.hbase.regionserver.TestCompoundBloomFilter
Tests run: 3, Failures: 0, Errors: 0, Skipped: 0, Time elapsed: 22.872 sec
Running org.apache.hadoop.hbase.regionserver.TestRegionServerMetrics
Tests run: 9, Failures: 0, Errors: 0, Skipped: 0, Time elapsed: 11.449 sec
Running org.apache.hadoop.hbase.TestLocalHBaseCluster
Tests run: 1, Failures: 0, Errors: 0, Skipped: 0, Time elapsed: 7.94 sec
Running org.apache.hadoop.hbase.migration.TestUpgradeTo96
Tests run: 5, Failures: 0, Errors: 0, Skipped: 0, Time elapsed: 7.603 sec
Running org.apache.hadoop.hbase.migration.TestNamespaceUpgrade
Tests run: 5, Failures: 0, Errors: 0, Skipped: 0, Time elapsed: 26.129 sec
Running org.apache.hadoop.hbase.constraint.TestConstraint
Tests run: 5, Failures: 0, Errors: 0, Skipped: 0, Time elapsed: 12.819 sec

Results :

Tests in error: 
  testLogFilesAreArchived(org.apache.hadoop.hbase.master.TestSplitLogManager): test timed
out after 60000 milliseconds

Tests run: 1965, Failures: 0, Errors: 1, Skipped: 22

[INFO] ------------------------------------------------------------------------
[INFO] Reactor Summary:
[INFO] 
[INFO] HBase - Checkstyle ................................ SUCCESS [2.463s]
[INFO] HBase ............................................. SUCCESS [2.360s]
[INFO] HBase - Annotations ............................... SUCCESS [1.865s]
[INFO] HBase - Common .................................... SUCCESS [23.538s]
[INFO] HBase - Protocol .................................. SUCCESS [19.813s]
[INFO] HBase - Client .................................... SUCCESS [38.719s]
[INFO] HBase - Hadoop Compatibility ...................... SUCCESS [5.280s]
[INFO] HBase - Hadoop Two Compatibility .................. SUCCESS [1.515s]
[INFO] HBase - Prefix Tree ............................... SUCCESS [3.103s]
[INFO] HBase - Server .................................... FAILURE [1:31:24.464s]
[INFO] HBase - Testing Util .............................. SKIPPED
[INFO] HBase - Thrift .................................... SKIPPED
[INFO] HBase - Rest ...................................... SKIPPED
[INFO] HBase - Shell ..................................... SKIPPED
[INFO] HBase - Integration Tests ......................... SKIPPED
[INFO] HBase - Examples .................................. SKIPPED
[INFO] HBase - Assembly .................................. SKIPPED
[INFO] ------------------------------------------------------------------------
[INFO] BUILD FAILURE
[INFO] ------------------------------------------------------------------------
[INFO] Total time: 1:33:04.025s
[INFO] Finished at: Tue Oct 21 19:01:12 UTC 2014
[INFO] Final Memory: 39M/747M
[INFO] ------------------------------------------------------------------------
[ERROR] Failed to execute goal org.apache.maven.plugins:maven-surefire-plugin:2.12-TRUNK-HBASE-2:test
(secondPartTestsExecution) on project hbase-server: There are test failures.
[ERROR] 
[ERROR] Please refer to <https://builds.apache.org/job/HBase-0.98/ws/hbase-server/target/surefire-reports>
for the individual test results.
[ERROR] -> [Help 1]
[ERROR] 
[ERROR] To see the full stack trace of the errors, re-run Maven with the -e switch.
[ERROR] Re-run Maven using the -X switch to enable full debug logging.
[ERROR] 
[ERROR] For more information about the errors and possible solutions, please read the following
articles:
[ERROR] [Help 1] http://cwiki.apache.org/confluence/display/MAVEN/MojoFailureException
[ERROR] 
[ERROR] After correcting the problems, you can resume the build with the command
[ERROR]   mvn <goals> -rf :hbase-server
Build step 'Invoke top-level Maven targets' marked build as failure
Performing Post build task...
Match found for :.* : True
Logical operation result is TRUE
Running script  :   ZOMBIE_TESTS_COUNT=`jps | grep surefirebooter | wc -l`
  if [[ $ZOMBIE_TESTS_COUNT != 0 ]] ; then
    #It seems sometimes the tests are not dying immediately. Let's give them 10s
    echo "Suspicious java process found - waiting 10s to see if there are just slow to stop"
    sleep 10   
    ZOMBIE_TESTS_COUNT=`jps | grep surefirebooter | wc -l`
    if [[ $ZOMBIE_TESTS_COUNT != 0 ]] ; then
      echo "There are $ZOMBIE_TESTS_COUNT zombie tests, they should have been killed by surefire
but survived"
      echo "************ BEGIN zombies jstack extract"
      ZB_STACK=`jps | grep surefirebooter | cut -d ' ' -f 1 | xargs -n 1 jstack | grep ".test"
| grep "\.java"`
      jps | grep surefirebooter | cut -d ' ' -f 1 | xargs -n 1 jstack
      echo "************ END  zombies jstack extract"
      JIRA_COMMENT="$JIRA_COMMENT

     {color:red}-1 core zombie tests{color}.  There are ${ZOMBIE_TESTS_COUNT} zombie test(s):
${ZB_STACK}"
      BAD=1
      jps | grep surefirebooter | cut -d ' ' -f 1 | xargs kill -9
    else
      echo "We're ok: there is no zombie test, but some tests took some time to stop"
    fi
  else
    echo "We're ok: there is no zombie test"
  fi
[HBase-0.98] $ /bin/bash -xe /tmp/hudson7833324882269642925.sh
++ jps
++ grep surefirebooter
++ wc -l
+ ZOMBIE_TESTS_COUNT=0
+ [[ 0 != 0 ]]
+ echo 'We'\''re ok: there is no zombie test'
We're ok: there is no zombie test
POST BUILD TASK : SUCCESS
END OF POST BUILD TASK : 0
Archiving artifacts
Sending artifact delta relative to HBase-0.98 #606
Archived 1620 artifacts
Archive block size is 32768
Received 57 blocks and 427410866 bytes
Compression is 0.4%
Took 2 min 6 sec
Recording test results
Updating HBASE-12308

Mime
View raw message