hbase-builds mailing list archives

Site index · List index
Message view « Date » · « Thread »
Top « Date » · « Thread »
From Apache Jenkins Server <jenk...@builds.apache.org>
Subject Build failed in Jenkins: HBase-TRUNK #5630
Date Tue, 07 Oct 2014 18:15:13 GMT
See <https://builds.apache.org/job/HBase-TRUNK/5630/changes>

Changes:

[jxiang] HBASE-11838 Enable PREFIX_TREE in integration tests

------------------------------------------
[...truncated 1725 lines...]
Tests run: 1, Failures: 0, Errors: 0, Skipped: 0, Time elapsed: 36.476 sec - in org.apache.hadoop.hbase.TestFullLogReconstruction
Tests run: 9, Failures: 0, Errors: 0, Skipped: 0, Time elapsed: 13.867 sec - in org.apache.hadoop.hbase.rest.client.TestRemoteTable
Running org.apache.hadoop.hbase.rest.TestMultiRowResource
Running org.apache.hadoop.hbase.rest.TestGetAndPutResource
Tests run: 3, Failures: 0, Errors: 0, Skipped: 0, Time elapsed: 2.812 sec - in org.apache.hadoop.hbase.rest.TestMultiRowResource
Running org.apache.hadoop.hbase.rest.TestGzipFilter
Tests run: 2, Failures: 0, Errors: 0, Skipped: 0, Time elapsed: 3.006 sec - in org.apache.hadoop.hbase.rest.TestGzipFilter
Running org.apache.hadoop.hbase.rest.TestTableResource
Tests run: 8, Failures: 0, Errors: 0, Skipped: 0, Time elapsed: 3.215 sec - in org.apache.hadoop.hbase.rest.TestTableResource
Running org.apache.hadoop.hbase.rest.TestResourceFilter
Tests run: 1, Failures: 0, Errors: 0, Skipped: 0, Time elapsed: 1.535 sec - in org.apache.hadoop.hbase.rest.TestResourceFilter
Running org.apache.hadoop.hbase.rest.TestDeleteRow
Tests run: 18, Failures: 0, Errors: 0, Skipped: 0, Time elapsed: 21.014 sec - in org.apache.hadoop.hbase.rest.TestGetAndPutResource
Tests run: 2, Failures: 0, Errors: 0, Skipped: 0, Time elapsed: 5.672 sec - in org.apache.hadoop.hbase.rest.TestDeleteRow
Running org.apache.hadoop.hbase.rest.TestVersionResource
Running org.apache.hadoop.hbase.rest.TestTableScan
Tests run: 7, Failures: 0, Errors: 0, Skipped: 0, Time elapsed: 2.295 sec - in org.apache.hadoop.hbase.rest.TestVersionResource
Running org.apache.hadoop.hbase.rest.TestStatusResource
Running org.apache.hadoop.hbase.rest.TestScannerResource
Tests run: 2, Failures: 0, Errors: 0, Skipped: 0, Time elapsed: 3.028 sec - in org.apache.hadoop.hbase.rest.TestStatusResource
Tests run: 5, Failures: 0, Errors: 0, Skipped: 0, Time elapsed: 5.106 sec - in org.apache.hadoop.hbase.rest.TestScannerResource
Tests run: 10, Failures: 0, Errors: 0, Skipped: 0, Time elapsed: 9.144 sec - in org.apache.hadoop.hbase.rest.TestTableScan
Running org.apache.hadoop.hbase.rest.TestScannersWithLabels
Running org.apache.hadoop.hbase.io.hfile.TestHFileBlockIndex
Tests run: 2, Failures: 0, Errors: 0, Skipped: 0, Time elapsed: 2.842 sec - in org.apache.hadoop.hbase.rest.TestScannersWithLabels
Running org.apache.hadoop.hbase.io.hfile.TestHFileSeek
Tests run: 2, Failures: 0, Errors: 0, Skipped: 0, Time elapsed: 0.822 sec - in org.apache.hadoop.hbase.io.hfile.TestHFileBlockIndex
Running org.apache.hadoop.hbase.rest.TestScannersWithFilters
Running org.apache.hadoop.hbase.io.hfile.TestForceCacheImportantBlocks
Tests run: 1, Failures: 0, Errors: 0, Skipped: 0, Time elapsed: 1.777 sec - in org.apache.hadoop.hbase.io.hfile.TestHFileSeek
Running org.apache.hadoop.hbase.io.hfile.TestCacheConfig
Tests run: 6, Failures: 0, Errors: 0, Skipped: 0, Time elapsed: 1.617 sec - in org.apache.hadoop.hbase.io.hfile.TestCacheConfig
Running org.apache.hadoop.hbase.trace.TestHTraceHooks
Tests run: 10, Failures: 0, Errors: 0, Skipped: 0, Time elapsed: 6.332 sec - in org.apache.hadoop.hbase.rest.TestScannersWithFilters
Tests run: 1, Failures: 0, Errors: 0, Skipped: 0, Time elapsed: 3.083 sec - in org.apache.hadoop.hbase.trace.TestHTraceHooks
Running org.apache.hadoop.hbase.io.hfile.TestCacheOnWrite
Running org.apache.hadoop.hbase.io.hfile.TestScannerSelectionUsingTTL
Running org.apache.hadoop.hbase.io.hfile.TestHFileBlock
Tests run: 47, Failures: 0, Errors: 0, Skipped: 0, Time elapsed: 122.126 sec - in org.apache.hadoop.hbase.security.access.TestAccessController
Running org.apache.hadoop.hbase.io.TestFileLink
Tests run: 3, Failures: 0, Errors: 0, Skipped: 0, Time elapsed: 14.252 sec - in org.apache.hadoop.hbase.io.TestFileLink
Running org.apache.hadoop.hbase.io.encoding.TestEncodedSeekers
Tests run: 4, Failures: 0, Errors: 0, Skipped: 0, Time elapsed: 32.801 sec - in org.apache.hadoop.hbase.io.hfile.TestForceCacheImportantBlocks
Running org.apache.hadoop.hbase.io.encoding.TestChangingEncoding
Tests run: 6, Failures: 0, Errors: 0, Skipped: 0, Time elapsed: 63.092 sec - in org.apache.hadoop.hbase.io.hfile.TestScannerSelectionUsingTTL
Running org.apache.hadoop.hbase.io.encoding.TestDataBlockEncoders
Tests run: 3, Failures: 0, Errors: 0, Skipped: 0, Time elapsed: 58.13 sec - in org.apache.hadoop.hbase.io.encoding.TestChangingEncoding
Tests run: 28, Failures: 0, Errors: 0, Skipped: 0, Time elapsed: 94.131 sec - in org.apache.hadoop.hbase.io.hfile.TestHFileBlock
Running org.apache.hadoop.hbase.io.encoding.TestBufferedDataBlockEncoder
Running org.apache.hadoop.hbase.io.encoding.TestPrefixTree
Tests run: 1, Failures: 0, Errors: 0, Skipped: 0, Time elapsed: 2.588 sec - in org.apache.hadoop.hbase.io.encoding.TestPrefixTree
Running org.apache.hadoop.hbase.io.encoding.TestLoadAndSwitchEncodeOnDisk
Tests run: 1, Failures: 0, Errors: 0, Skipped: 0, Time elapsed: 19.883 sec - in org.apache.hadoop.hbase.io.encoding.TestBufferedDataBlockEncoder
Running org.apache.hadoop.hbase.TestRegionRebalancing
Tests run: 20, Failures: 0, Errors: 0, Skipped: 0, Time elapsed: 97.856 sec - in org.apache.hadoop.hbase.io.encoding.TestEncodedSeekers
Tests run: 72, Failures: 0, Errors: 0, Skipped: 0, Time elapsed: 122.24 sec - in org.apache.hadoop.hbase.io.hfile.TestCacheOnWrite
Tests run: 1, Failures: 0, Errors: 0, Skipped: 0, Time elapsed: 21.462 sec - in org.apache.hadoop.hbase.io.encoding.TestLoadAndSwitchEncodeOnDisk
Running org.apache.hadoop.hbase.TestHColumnDescriptorDefaultVersions
Running org.apache.hadoop.hbase.mapred.TestTableInputFormat
Tests run: 3, Failures: 0, Errors: 0, Skipped: 0, Time elapsed: 15.98 sec - in org.apache.hadoop.hbase.TestHColumnDescriptorDefaultVersions
Tests run: 10, Failures: 0, Errors: 0, Skipped: 0, Time elapsed: 8.928 sec - in org.apache.hadoop.hbase.mapred.TestTableInputFormat
Running org.apache.hadoop.hbase.mapred.TestTableSnapshotInputFormat
Running org.apache.hadoop.hbase.mapred.TestTableMapReduceUtil
Tests run: 2, Failures: 0, Errors: 0, Skipped: 0, Time elapsed: 37.451 sec - in org.apache.hadoop.hbase.TestRegionRebalancing
Running org.apache.hadoop.hbase.replication.TestReplicationTrackerZKImpl
Tests run: 4, Failures: 0, Errors: 0, Skipped: 2, Time elapsed: 0.838 sec - in org.apache.hadoop.hbase.replication.TestReplicationTrackerZKImpl
Running org.apache.hadoop.hbase.mapred.TestTableMapReduce
Running org.apache.hadoop.hbase.replication.TestReplicationEndpoint
Tests run: 3, Failures: 0, Errors: 0, Skipped: 0, Time elapsed: 2.68 sec - in org.apache.hadoop.hbase.replication.TestReplicationEndpoint
Running org.apache.hadoop.hbase.replication.TestReplicationDisableInactivePeer
Tests run: 1, Failures: 0, Errors: 0, Skipped: 0, Time elapsed: 20.063 sec - in org.apache.hadoop.hbase.replication.TestReplicationDisableInactivePeer
Running org.apache.hadoop.hbase.replication.TestReplicationKillMasterRSCompressed
Tests run: 4, Failures: 0, Errors: 0, Skipped: 0, Time elapsed: 84.445 sec - in org.apache.hadoop.hbase.mapred.TestTableMapReduceUtil
Tests run: 1, Failures: 0, Errors: 0, Skipped: 0, Time elapsed: 18.64 sec - in org.apache.hadoop.hbase.replication.TestReplicationKillMasterRSCompressed
Tests run: 28, Failures: 0, Errors: 0, Skipped: 0, Time elapsed: 187.721 sec - in org.apache.hadoop.hbase.io.encoding.TestDataBlockEncoders
Running org.apache.hadoop.hbase.replication.TestPerTableCFReplication
Running org.apache.hadoop.hbase.replication.regionserver.TestReplicationHLogReaderManager
Tests run: 2, Failures: 0, Errors: 0, Skipped: 0, Time elapsed: 88.282 sec - in org.apache.hadoop.hbase.mapred.TestTableMapReduce
Running org.apache.hadoop.hbase.replication.regionserver.TestReplicationSink
Running org.apache.hadoop.hbase.replication.regionserver.TestReplicationSourceManager
Tests run: 5, Failures: 0, Errors: 0, Skipped: 0, Time elapsed: 1.774 sec - in org.apache.hadoop.hbase.replication.regionserver.TestReplicationSink
Running org.apache.hadoop.hbase.replication.regionserver.TestRegionReplicaReplicationEndpoint
Tests run: 7, Failures: 0, Errors: 0, Skipped: 7, Time elapsed: 0.003 sec - in org.apache.hadoop.hbase.replication.regionserver.TestRegionReplicaReplicationEndpoint
Tests run: 4, Failures: 0, Errors: 0, Skipped: 0, Time elapsed: 4.127 sec - in org.apache.hadoop.hbase.replication.regionserver.TestReplicationSourceManager
Running org.apache.hadoop.hbase.replication.TestReplicationSource
Tests run: 1, Failures: 0, Errors: 0, Skipped: 0, Time elapsed: 0.464 sec - in org.apache.hadoop.hbase.replication.TestReplicationSource
Running org.apache.hadoop.hbase.replication.regionserver.TestRegionReplicaReplicationEndpointNoMaster
Tests run: 2, Failures: 0, Errors: 0, Skipped: 0, Time elapsed: 26.169 sec - in org.apache.hadoop.hbase.replication.TestPerTableCFReplication
Running org.apache.hadoop.hbase.replication.TestReplicationChangingPeerRegionservers
Running org.apache.hadoop.hbase.replication.TestReplicationSyncUpTool
Tests run: 1, Failures: 0, Errors: 0, Skipped: 0, Time elapsed: 6.853 sec - in org.apache.hadoop.hbase.replication.TestReplicationChangingPeerRegionservers
Tests run: 3, Failures: 0, Errors: 0, Skipped: 0, Time elapsed: 39.433 sec - in org.apache.hadoop.hbase.replication.regionserver.TestRegionReplicaReplicationEndpointNoMaster
Running org.apache.hadoop.hbase.replication.TestMultiSlaveReplication
Running org.apache.hadoop.hbase.replication.TestReplicationKillMasterRS
Tests run: 1, Failures: 0, Errors: 0, Skipped: 0, Time elapsed: 20.384 sec - in org.apache.hadoop.hbase.replication.TestReplicationKillMasterRS
Tests run: 1, Failures: 0, Errors: 0, Skipped: 0, Time elapsed: 32.913 sec - in org.apache.hadoop.hbase.replication.TestMultiSlaveReplication
Tests run: 1, Failures: 0, Errors: 0, Skipped: 0, Time elapsed: 52.114 sec - in org.apache.hadoop.hbase.replication.TestReplicationSyncUpTool
Running org.apache.hadoop.hbase.replication.TestReplicationStateZKImpl
Tests run: 6, Failures: 0, Errors: 0, Skipped: 0, Time elapsed: 5.556 sec - in org.apache.hadoop.hbase.replication.TestReplicationStateZKImpl
Running org.apache.hadoop.hbase.replication.TestReplicationWithTags
Tests run: 1, Failures: 0, Errors: 0, Skipped: 0, Time elapsed: 3.91 sec - in org.apache.hadoop.hbase.replication.TestReplicationWithTags
Running org.apache.hadoop.hbase.replication.TestMasterReplication
Running org.apache.hadoop.hbase.replication.TestReplicationKillSlaveRS
Running org.apache.hadoop.hbase.replication.TestReplicationSmallTests
Tests run: 1, Failures: 0, Errors: 0, Skipped: 0, Time elapsed: 17.948 sec - in org.apache.hadoop.hbase.replication.TestReplicationKillSlaveRS
Running org.apache.hadoop.hbase.util.TestMergeTool
Tests run: 1, Failures: 0, Errors: 0, Skipped: 0, Time elapsed: 26.545 sec - in org.apache.hadoop.hbase.util.TestMergeTool
Running org.apache.hadoop.hbase.util.TestFSTableDescriptors
Tests run: 13, Failures: 0, Errors: 0, Skipped: 0, Time elapsed: 1.557 sec - in org.apache.hadoop.hbase.util.TestFSTableDescriptors
Running org.apache.hadoop.hbase.util.TestHBaseFsckEncryption
Tests run: 9, Failures: 0, Errors: 0, Skipped: 0, Time elapsed: 38.128 sec - in org.apache.hadoop.hbase.replication.TestReplicationSmallTests
Running org.apache.hadoop.hbase.util.TestIdLock
Tests run: 1, Failures: 0, Errors: 0, Skipped: 0, Time elapsed: 16.167 sec - in org.apache.hadoop.hbase.util.TestHBaseFsckEncryption
Running org.apache.hadoop.hbase.util.TestMiniClusterLoadSequential
Tests run: 1, Failures: 0, Errors: 0, Skipped: 0, Time elapsed: 15.354 sec - in org.apache.hadoop.hbase.util.TestIdLock
Tests run: 6, Failures: 0, Errors: 0, Skipped: 0, Time elapsed: 289.532 sec - in org.apache.hadoop.hbase.mapred.TestTableSnapshotInputFormat
Running org.apache.hadoop.hbase.util.TestMergeTable
Running org.apache.hadoop.hbase.util.TestMiniClusterLoadParallel
Tests run: 3, Failures: 0, Errors: 0, Skipped: 0, Time elapsed: 75.321 sec - in org.apache.hadoop.hbase.replication.TestMasterReplication
Running org.apache.hadoop.hbase.util.TestHBaseFsck
Tests run: 8, Failures: 0, Errors: 0, Skipped: 0, Time elapsed: 203.317 sec - in org.apache.hadoop.hbase.replication.regionserver.TestReplicationHLogReaderManager
Running org.apache.hadoop.hbase.util.TestFSUtils
Tests run: 1, Failures: 0, Errors: 0, Skipped: 0, Time elapsed: 23.115 sec - in org.apache.hadoop.hbase.util.TestMergeTable
Running org.apache.hadoop.hbase.util.TestRegionSplitter
Tests run: 7, Failures: 0, Errors: 0, Skipped: 0, Time elapsed: 16.864 sec - in org.apache.hadoop.hbase.util.TestFSUtils
Running org.apache.hadoop.hbase.util.TestProcessBasedCluster
Tests run: 1, Failures: 0, Errors: 0, Skipped: 0, Time elapsed: 0.097 sec - in org.apache.hadoop.hbase.util.TestProcessBasedCluster
Running org.apache.hadoop.hbase.util.TestTableName
Tests run: 5, Failures: 0, Errors: 0, Skipped: 0, Time elapsed: 0.425 sec - in org.apache.hadoop.hbase.util.TestTableName
Running org.apache.hadoop.hbase.util.TestMiniClusterLoadEncoded
Tests run: 6, Failures: 0, Errors: 0, Skipped: 0, Time elapsed: 5.593 sec - in org.apache.hadoop.hbase.util.TestRegionSplitter
Tests run: 4, Failures: 0, Errors: 0, Skipped: 0, Time elapsed: 49.217 sec - in org.apache.hadoop.hbase.util.TestMiniClusterLoadSequential
Running org.apache.hadoop.hbase.util.TestFSVisitor
Tests run: 4, Failures: 0, Errors: 0, Skipped: 0, Time elapsed: 47.777 sec - in org.apache.hadoop.hbase.util.TestMiniClusterLoadParallel
Running org.apache.hadoop.hbase.util.hbck.TestOfflineMetaRebuildBase
Tests run: 3, Failures: 0, Errors: 0, Skipped: 0, Time elapsed: 2.991 sec - in org.apache.hadoop.hbase.util.TestFSVisitor
Running org.apache.hadoop.hbase.util.hbck.TestOfflineMetaRebuildOverlap
Running org.apache.hadoop.hbase.util.TestCoprocessorScanPolicy
Tests run: 4, Failures: 0, Errors: 0, Skipped: 0, Time elapsed: 5.81 sec - in org.apache.hadoop.hbase.util.TestCoprocessorScanPolicy
Running org.apache.hadoop.hbase.util.hbck.TestOfflineMetaRebuildHole
Tests run: 1, Failures: 0, Errors: 0, Skipped: 0, Time elapsed: 22.31 sec - in org.apache.hadoop.hbase.util.hbck.TestOfflineMetaRebuildBase
Running org.apache.hadoop.hbase.util.TestDefaultEnvironmentEdge
Tests run: 1, Failures: 0, Errors: 0, Skipped: 0, Time elapsed: 0.268 sec - in org.apache.hadoop.hbase.util.TestDefaultEnvironmentEdge
Tests run: 1, Failures: 0, Errors: 0, Skipped: 0, Time elapsed: 21.764 sec - in org.apache.hadoop.hbase.util.hbck.TestOfflineMetaRebuildOverlap
Running org.apache.hadoop.hbase.util.TestFSHDFSUtils
Tests run: 3, Failures: 0, Errors: 0, Skipped: 0, Time elapsed: 4.879 sec - in org.apache.hadoop.hbase.util.TestFSHDFSUtils
Running org.apache.hadoop.hbase.TestMetaTableAccessorNoCluster
Tests run: 1, Failures: 0, Errors: 0, Skipped: 0, Time elapsed: 23.598 sec - in org.apache.hadoop.hbase.util.hbck.TestOfflineMetaRebuildHole
Tests run: 2, Failures: 0, Errors: 0, Skipped: 0, Time elapsed: 4.245 sec - in org.apache.hadoop.hbase.TestMetaTableAccessorNoCluster
Running org.apache.hadoop.hbase.TestNamespace
Running org.apache.hadoop.hbase.TestInfoServers
Tests run: 5, Failures: 0, Errors: 0, Skipped: 0, Time elapsed: 54.049 sec - in org.apache.hadoop.hbase.util.TestMiniClusterLoadEncoded
Tests run: 3, Failures: 0, Errors: 0, Skipped: 0, Time elapsed: 2.92 sec - in org.apache.hadoop.hbase.TestInfoServers
Running org.apache.hadoop.hbase.TestMetaTableAccessor
Tests run: 9, Failures: 0, Errors: 0, Skipped: 1, Time elapsed: 7.642 sec - in org.apache.hadoop.hbase.TestNamespace
Tests run: 8, Failures: 0, Errors: 0, Skipped: 0, Time elapsed: 4.33 sec - in org.apache.hadoop.hbase.TestMetaTableAccessor
Tests run: 47, Failures: 0, Errors: 0, Skipped: 1, Time elapsed: 280.038 sec - in org.apache.hadoop.hbase.util.TestHBaseFsck

Results :

Failed tests: 
  TestRegionObserverInterface.testCompactionOverride:551 Row should be 2: arrays first differed
at element [7]; expected:<1> but was:<2>

Tests run: 2040, Failures: 1, Errors: 0, Skipped: 26

[INFO] ------------------------------------------------------------------------
[INFO] Reactor Summary:
[INFO] 
[INFO] HBase ............................................. SUCCESS [3.395s]
[INFO] HBase - Annotations ............................... SUCCESS [1.502s]
[INFO] HBase - Common .................................... SUCCESS [54.568s]
[INFO] HBase - Protocol .................................. SUCCESS [7.889s]
[INFO] HBase - Client .................................... SUCCESS [1:06.112s]
[INFO] HBase - Hadoop Compatibility ...................... SUCCESS [6.985s]
[INFO] HBase - Hadoop Two Compatibility .................. SUCCESS [5.497s]
[INFO] HBase - Prefix Tree ............................... SUCCESS [7.949s]
[INFO] HBase - Server .................................... FAILURE [1:03:53.257s]
[INFO] HBase - Testing Util .............................. SKIPPED
[INFO] HBase - Thrift .................................... SKIPPED
[INFO] HBase - Shell ..................................... SKIPPED
[INFO] HBase - Integration Tests ......................... SKIPPED
[INFO] HBase - Examples .................................. SKIPPED
[INFO] HBase - Assembly .................................. SKIPPED
[INFO] ------------------------------------------------------------------------
[INFO] BUILD FAILURE
[INFO] ------------------------------------------------------------------------
[INFO] Total time: 1:06:27.844s
[INFO] Finished at: Tue Oct 07 18:12:33 UTC 2014
[INFO] Final Memory: 44M/291M
[INFO] ------------------------------------------------------------------------
[ERROR] Failed to execute goal org.apache.maven.plugins:maven-surefire-plugin:2.17:test (secondPartTestsExecution)
on project hbase-server: There are test failures.
[ERROR] 
[ERROR] Please refer to /x1/jenkins/jenkins-slave/workspace/HBase-TRUNK/hbase-server/target/surefire-reports
for the individual test results.
[ERROR] -> [Help 1]
[ERROR] 
[ERROR] To see the full stack trace of the errors, re-run Maven with the -e switch.
[ERROR] Re-run Maven using the -X switch to enable full debug logging.
[ERROR] 
[ERROR] For more information about the errors and possible solutions, please read the following
articles:
[ERROR] [Help 1] http://cwiki.apache.org/confluence/display/MAVEN/MojoFailureException
[ERROR] 
[ERROR] After correcting the problems, you can resume the build with the command
[ERROR]   mvn <goals> -rf :hbase-server
Build step 'Invoke top-level Maven targets' marked build as failure
Performing Post build task...
Match found for :.* : True
Logical operation result is TRUE
Running script  :   ZOMBIE_TESTS_COUNT=`jps | grep surefirebooter | wc -l`
  if [[ $ZOMBIE_TESTS_COUNT != 0 ]] ; then
    #It seems sometimes the tests are not dying immediately. Let's give them 10s
    echo "Suspicious java process found - waiting 10s to see if there are just slow to stop"
    sleep 10   
    ZOMBIE_TESTS_COUNT=`jps | grep surefirebooter | wc -l`
    if [[ $ZOMBIE_TESTS_COUNT != 0 ]] ; then
      echo "There are $ZOMBIE_TESTS_COUNT zombie tests, they should have been killed by surefire
but survived"
      echo "************ BEGIN zombies jstack extract"
      ZB_STACK=`jps | grep surefirebooter | cut -d ' ' -f 1 | xargs -n 1 jstack | grep ".test"
| grep "\.java"`
      jps | grep surefirebooter | cut -d ' ' -f 1 | xargs -n 1 jstack
      echo "************ END  zombies jstack extract"
      JIRA_COMMENT="$JIRA_COMMENT

     {color:red}-1 core zombie tests{color}.  There are ${ZOMBIE_TESTS_COUNT} zombie test(s):
${ZB_STACK}"
      BAD=1
      jps | grep surefirebooter | cut -d ' ' -f 1 | xargs kill -9
    else
      echo "We're ok: there is no zombie test, but some tests took some time to stop"
    fi
  else
    echo "We're ok: there is no zombie test"
  fi
[HBase-TRUNK] $ /bin/bash -xe /tmp/hudson52344369362803608.sh
++ grep surefirebooter
++ wc -l
++ jps
+ ZOMBIE_TESTS_COUNT=0
+ [[ 0 != 0 ]]
+ echo 'We'\''re ok: there is no zombie test'
We're ok: there is no zombie test
POST BUILD TASK : SUCCESS
END OF POST BUILD TASK : 0
Archiving artifacts
Sending artifact delta relative to HBase-TRUNK #5629
Archived 1820 artifacts
Archive block size is 32768
Received 77 blocks and 543168349 bytes
Compression is 0.5%
Took 2 min 31 sec
Recording test results
Updating HBASE-11838

Mime
View raw message