hbase-builds mailing list archives

Site index · List index
Message view « Date » · « Thread »
Top « Date » · « Thread »
From Apache Jenkins Server <jenk...@builds.apache.org>
Subject Build failed in Jenkins: HBase-0.98-on-Hadoop-1.1 #589
Date Tue, 21 Oct 2014 20:28:17 GMT
See <https://builds.apache.org/job/HBase-0.98-on-Hadoop-1.1/589/changes>


[tedyu] HBASE-12302 VisibilityClient getAuths does not propagate remote service exception
correctly (Jerry He)

Started by an SCM change
Building remotely on jenkins-ubuntu-1404-4gb-bdb (jenkins-cloud-4GB Ubuntu ubuntu) in workspace
Cloning the remote Git repository
Cloning repository https://git-wip-us.apache.org/repos/asf/hbase.git
 > git init <https://builds.apache.org/job/HBase-0.98-on-Hadoop-1.1/ws/>
Fetching upstream changes from https://git-wip-us.apache.org/repos/asf/hbase.git
 > git --version
 > git fetch --tags --progress https://git-wip-us.apache.org/repos/asf/hbase.git +refs/heads/*:refs/remotes/origin/*
 > git config remote.origin.url https://git-wip-us.apache.org/repos/asf/hbase.git
 > git config remote.origin.fetch +refs/heads/*:refs/remotes/origin/*
 > git config remote.origin.url https://git-wip-us.apache.org/repos/asf/hbase.git
Cleaning workspace
 > git rev-parse --verify HEAD
No valid HEAD. Skipping the resetting
 > git clean -fdx
Fetching upstream changes from https://git-wip-us.apache.org/repos/asf/hbase.git
 > git fetch --tags --progress https://git-wip-us.apache.org/repos/asf/hbase.git +refs/heads/*:refs/remotes/origin/*
 > git rev-parse origin/0.98^{commit}
Checking out Revision 9fd346b981c91e67df9bc6332c874d8c369c66df (origin/0.98)
 > git config core.sparsecheckout
 > git checkout -f 9fd346b981c91e67df9bc6332c874d8c369c66df
 > git rev-list 5df04bc1a0c5b3df3d3441fa8972e7af083b8837
[HBase-0.98-on-Hadoop-1.1] $ /bin/bash -xe /tmp/hudson3927879014606583208.sh
+ uname -a
Linux jenkins-ubuntu-1404-4gb-bdb 3.13.0-30-generic #54-Ubuntu SMP Mon Jun 9 22:45:01 UTC
2014 x86_64 x86_64 x86_64 GNU/Linux
[HBase-0.98-on-Hadoop-1.1] $ /bin/bash -xe /tmp/hudson8827697823153172469.sh
+ ulimit -a
core file size          (blocks, -c) 0
data seg size           (kbytes, -d) unlimited
scheduling priority             (-e) 0
file size               (blocks, -f) unlimited
pending signals                 (-i) 31591
max locked memory       (kbytes, -l) 64
max memory size         (kbytes, -m) unlimited
open files                      (-n) 60000
pipe size            (512 bytes, -p) 8
POSIX message queues     (bytes, -q) 819200
real-time priority              (-r) 0
stack size              (kbytes, -s) 8192
cpu time               (seconds, -t) unlimited
max user processes              (-u) 10240
virtual memory          (kbytes, -v) unlimited
file locks                      (-x) unlimited
+ rm -rf /tmp/hbase-jenkins/hbase
Unpacking http://archive.apache.org/dist/maven/binaries/apache-maven-3.0.3-bin.zip to /jenkins/tools/hudson.tasks.Maven_MavenInstallation/Maven_3.0.3
on jenkins-ubuntu-1404-4gb-bdb
[HBase-0.98-on-Hadoop-1.1] $ /jenkins/tools/hudson.tasks.Maven_MavenInstallation/Maven_3.0.3/bin/mvn
-PrunAllTests -Dmaven.test.redirectTestOutputToFile=true install -Dsurefire.secondPartThreadCount=2
-Dhadoop.profile=1.1 -Dit.test=noTest
[INFO] Scanning for projects...
Downloading: https://repository.apache.org/content/repositories/releases/org/apache/apache/12/apache-12.pom
4 KB   
8 KB   
12 KB   
14 KB   
16 KB   
Downloaded: https://repository.apache.org/content/repositories/releases/org/apache/apache/12/apache-12.pom
(16 KB at 16.5 KB/sec)
[ERROR] The build could not read 1 project -> [Help 1]
[ERROR]   The project org.apache.hbase:hbase-checkstyle:0.98.8-SNAPSHOT (<https://builds.apache.org/job/HBase-0.98-on-Hadoop-1.1/ws/hbase-checkstyle/pom.xml)>
has 1 error
[ERROR]     Non-resolvable parent POM: Could not find artifact org.apache.hbase:hbase:pom:2.0.0-SNAPSHOT
and 'parent.relativePath' points at wrong local POM @ line 31, column 11 -> [Help 2]
[ERROR] To see the full stack trace of the errors, re-run Maven with the -e switch.
[ERROR] Re-run Maven using the -X switch to enable full debug logging.
[ERROR] For more information about the errors and possible solutions, please read the following
[ERROR] [Help 1] http://cwiki.apache.org/confluence/display/MAVEN/ProjectBuildingException
[ERROR] [Help 2] http://cwiki.apache.org/confluence/display/MAVEN/UnresolvableModelException
Build step 'Invoke top-level Maven targets' marked build as failure
Performing Post build task...
Match found for :.* : True
Logical operation result is TRUE
Running script  :   ZOMBIE_TESTS_COUNT=`jps | grep surefirebooter | wc -l`
  if [[ $ZOMBIE_TESTS_COUNT != 0 ]] ; then
    #It seems sometimes the tests are not dying immediately. Let's give them 10s
    echo "Suspicious java process found - waiting 10s to see if there are just slow to stop"
    sleep 10
    ZOMBIE_TESTS_COUNT=`jps | grep surefirebooter | wc -l`
    if [[ $ZOMBIE_TESTS_COUNT != 0 ]] ; then
      echo "There are $ZOMBIE_TESTS_COUNT zombie tests, they should have been killed by surefire
but survived"
      echo "************ BEGIN zombies jstack extract"
      ZB_STACK=`jps | grep surefirebooter | cut -d ' ' -f 1 | xargs -n 1 jstack | grep ".test"
| grep "\.java"`
      jps | grep surefirebooter | cut -d ' ' -f 1 | xargs -n 1 jstack
      echo "************ END  zombies jstack extract"

     {color:red}-1 core zombie tests{color}.  There are ${ZOMBIE_TESTS_COUNT} zombie test(s):
      jps | grep surefirebooter | cut -d ' ' -f 1 | xargs kill -9
      echo "We're ok: there is no zombie test, but some tests took some time to stop"
    echo "We're ok: there is no zombie test"
[HBase-0.98-on-Hadoop-1.1] $ /bin/bash -xe /tmp/hudson6511709127365452643.sh
++ jps
++ grep surefirebooter
++ wc -l
+ [[ 0 != 0 ]]
+ echo 'We'\''re ok: there is no zombie test'
We're ok: there is no zombie test
Archiving artifacts
Sending artifact delta relative to HBase-0.98-on-Hadoop-1.1 #587
Archived 9 artifacts
Archive block size is 32768
Received 4 blocks and 64163 bytes
Compression is 67.1%
Took 33 sec
Recording test results
Updating HBASE-12302

View raw message