hbase-builds mailing list archives

Site index · List index
Message view « Date » · « Thread »
Top « Date » · « Thread »
From Apache Jenkins Server <jenk...@builds.apache.org>
Subject Build failed in Jenkins: HBase-0.98-on-Hadoop-1.1 #529
Date Thu, 02 Oct 2014 00:17:58 GMT
See <https://builds.apache.org/job/HBase-0.98-on-Hadoop-1.1/529/changes>

Changes:

[tedyu] HBASE-12144 Backport HBASE-10141 'instead of putting expired store files thru compaction,
just archive them' to 0.98

[apurtell] HBASE-12065 Import tool is not restoring multiple DeleteFamily markers of a row
(Maddineni Sukumar)

[apurtell] HBASE-12078 Missing Data when scanning using PREFIX_TREE DATA-BLOCK-ENCODING

------------------------------------------
[...truncated 18560 lines...]
Running org.apache.hadoop.hbase.regionserver.wal.TestWALActionsListener
Tests run: 1, Failures: 0, Errors: 0, Skipped: 0, Time elapsed: 0.044 sec
Running org.apache.hadoop.hbase.regionserver.wal.TestKeyValueCompression
Tests run: 3, Failures: 0, Errors: 0, Skipped: 0, Time elapsed: 0.05 sec
Running org.apache.hadoop.hbase.regionserver.wal.TestHLogMethods
Tests run: 3, Failures: 0, Errors: 0, Skipped: 0, Time elapsed: 0.088 sec
Running org.apache.hadoop.hbase.regionserver.wal.TestCompressor
Tests run: 4, Failures: 0, Errors: 0, Skipped: 0, Time elapsed: 0.048 sec
Running org.apache.hadoop.hbase.regionserver.wal.TestLogRollingNoCluster
Tests run: 1, Failures: 0, Errors: 0, Skipped: 0, Time elapsed: 1.167 sec
Running org.apache.hadoop.hbase.regionserver.wal.TestCustomWALCellCodec
Tests run: 1, Failures: 0, Errors: 0, Skipped: 0, Time elapsed: 0.033 sec
Running org.apache.hadoop.hbase.regionserver.TestStoreFile
Tests run: 12, Failures: 0, Errors: 0, Skipped: 0, Time elapsed: 0.62 sec
Running org.apache.hadoop.hbase.regionserver.TestColumnSeeking
Tests run: 2, Failures: 0, Errors: 0, Skipped: 0, Time elapsed: 2.859 sec
Running org.apache.hadoop.hbase.regionserver.TestMiniBatchOperationInProgress
Tests run: 1, Failures: 0, Errors: 0, Skipped: 0, Time elapsed: 0.07 sec
Running org.apache.hadoop.hbase.regionserver.TestStripeCompactor
Tests run: 3, Failures: 0, Errors: 0, Skipped: 0, Time elapsed: 0.235 sec
Running org.apache.hadoop.hbase.regionserver.TestSplitTransaction
Tests run: 7, Failures: 0, Errors: 0, Skipped: 0, Time elapsed: 3.718 sec
Running org.apache.hadoop.hbase.regionserver.TestKeepDeletes
Tests run: 10, Failures: 0, Errors: 0, Skipped: 0, Time elapsed: 0.57 sec
Running org.apache.hadoop.hbase.regionserver.TestMemStoreChunkPool
Tests run: 3, Failures: 0, Errors: 0, Skipped: 0, Time elapsed: 0.067 sec
Running org.apache.hadoop.hbase.regionserver.TestScanWildcardColumnTracker
Tests run: 2, Failures: 0, Errors: 0, Skipped: 0, Time elapsed: 0.058 sec
Running org.apache.hadoop.hbase.regionserver.TestStripeStoreEngine
Tests run: 2, Failures: 0, Errors: 0, Skipped: 0, Time elapsed: 0.05 sec
Running org.apache.hadoop.hbase.regionserver.TestQueryMatcher
Tests run: 6, Failures: 0, Errors: 0, Skipped: 0, Time elapsed: 0.169 sec
Running org.apache.hadoop.hbase.regionserver.TestStoreFileInfo
Tests run: 1, Failures: 0, Errors: 0, Skipped: 0, Time elapsed: 0.029 sec
Running org.apache.hadoop.hbase.regionserver.TestScanWithBloomError
Tests run: 3, Failures: 0, Errors: 0, Skipped: 0, Time elapsed: 0.159 sec
Running org.apache.hadoop.hbase.security.TestHBaseSaslRpcClient
Tests run: 5, Failures: 0, Errors: 0, Skipped: 0, Time elapsed: 0.126 sec
Running org.apache.hadoop.hbase.security.visibility.TestExpressionExpander
Tests run: 1, Failures: 0, Errors: 0, Skipped: 0, Time elapsed: 0.017 sec
Running org.apache.hadoop.hbase.security.visibility.TestExpressionParser
Tests run: 4, Failures: 0, Errors: 0, Skipped: 0, Time elapsed: 0.061 sec
Running org.apache.hadoop.hbase.security.TestUser
Tests run: 5, Failures: 0, Errors: 0, Skipped: 0, Time elapsed: 0.134 sec
Running org.apache.hadoop.hbase.TestHDFSBlocksDistribution
Tests run: 2, Failures: 0, Errors: 0, Skipped: 0, Time elapsed: 0.024 sec
Running org.apache.hadoop.hbase.zookeeper.TestZooKeeperMainServer
Tests run: 2, Failures: 0, Errors: 0, Skipped: 0, Time elapsed: 0.237 sec
Running org.apache.hadoop.hbase.zookeeper.TestZKConfig
Tests run: 1, Failures: 0, Errors: 0, Skipped: 0, Time elapsed: 0.023 sec
Running org.apache.hadoop.hbase.mapred.TestIdentityTableMap
Tests run: 1, Failures: 0, Errors: 0, Skipped: 0, Time elapsed: 0.044 sec
Running org.apache.hadoop.hbase.mapred.TestGroupingTableMap
Tests run: 4, Failures: 0, Errors: 0, Skipped: 0, Time elapsed: 0.066 sec
Running org.apache.hadoop.hbase.mapred.TestDriver
Tests run: 1, Failures: 0, Errors: 0, Skipped: 0, Time elapsed: 0.016 sec
Running org.apache.hadoop.hbase.mapred.TestRowCounter
Tests run: 4, Failures: 0, Errors: 0, Skipped: 0, Time elapsed: 3.19 sec
Running org.apache.hadoop.hbase.mapred.TestSplitTable
Tests run: 3, Failures: 0, Errors: 0, Skipped: 0, Time elapsed: 0.038 sec
Running org.apache.hadoop.hbase.util.TestRegionSizeCalculator
Tests run: 3, Failures: 0, Errors: 0, Skipped: 0, Time elapsed: 0.121 sec
Running org.apache.hadoop.hbase.util.TestByteBufferUtils
Tests run: 12, Failures: 0, Errors: 0, Skipped: 0, Time elapsed: 0.174 sec
Running org.apache.hadoop.hbase.util.TestIncrementingEnvironmentEdge
Tests run: 1, Failures: 0, Errors: 0, Skipped: 0, Time elapsed: 0.013 sec
Running org.apache.hadoop.hbase.util.TestHBaseFsckComparator
Tests run: 6, Failures: 0, Errors: 0, Skipped: 0, Time elapsed: 0.078 sec
Running org.apache.hadoop.hbase.util.TestCompressionTest
Tests run: 2, Failures: 0, Errors: 0, Skipped: 0, Time elapsed: 0.031 sec
Running org.apache.hadoop.hbase.util.TestRegionSplitCalculator
Tests run: 15, Failures: 0, Errors: 0, Skipped: 0, Time elapsed: 0.209 sec
Running org.apache.hadoop.hbase.util.TestSortedCopyOnWriteSet
Tests run: 2, Failures: 0, Errors: 0, Skipped: 0, Time elapsed: 0.027 sec
Running org.apache.hadoop.hbase.util.TestHFileArchiveUtil
Tests run: 4, Failures: 0, Errors: 0, Skipped: 0, Time elapsed: 0.064 sec
Running org.apache.hadoop.hbase.util.TestRootPath
Tests run: 1, Failures: 0, Errors: 0, Skipped: 0, Time elapsed: 0.015 sec
Running org.apache.hadoop.hbase.util.TestByteBloomFilter
Tests run: 5, Failures: 0, Errors: 0, Skipped: 0, Time elapsed: 0.818 sec
Running org.apache.hadoop.hbase.util.TestTableName
Tests run: 4, Failures: 0, Errors: 0, Skipped: 0, Time elapsed: 0.055 sec
Running org.apache.hadoop.hbase.util.TestPoolMap$TestRoundRobinPoolType
Tests run: 3, Failures: 0, Errors: 0, Skipped: 0, Time elapsed: 0.042 sec
Running org.apache.hadoop.hbase.util.TestPoolMap$TestThreadLocalPoolType
Tests run: 3, Failures: 0, Errors: 0, Skipped: 0, Time elapsed: 0.044 sec
Running org.apache.hadoop.hbase.util.TestPoolMap$TestReusablePoolType
Tests run: 3, Failures: 0, Errors: 0, Skipped: 0, Time elapsed: 0.043 sec
Running org.apache.hadoop.hbase.monitoring.TestMemoryBoundedLogMessageBuffer
Tests run: 2, Failures: 0, Errors: 0, Skipped: 0, Time elapsed: 0.032 sec
Running org.apache.hadoop.hbase.monitoring.TestTaskMonitor
Tests run: 3, Failures: 0, Errors: 0, Skipped: 0, Time elapsed: 0.96 sec
Running org.apache.hadoop.hbase.replication.regionserver.TestReplicationThrottler
Tests run: 1, Failures: 0, Errors: 0, Skipped: 0, Time elapsed: 0.013 sec
Running org.apache.hadoop.hbase.replication.regionserver.TestReplicationSinkManager
Tests run: 5, Failures: 0, Errors: 0, Skipped: 0, Time elapsed: 0.11 sec
Running org.apache.hadoop.hbase.rest.client.TestRemoteAdminRetries
Tests run: 7, Failures: 0, Errors: 0, Skipped: 0, Time elapsed: 1.157 sec
Running org.apache.hadoop.hbase.rest.client.TestRemoteHTableRetries
Tests run: 7, Failures: 0, Errors: 0, Skipped: 0, Time elapsed: 1.158 sec
Running org.apache.hadoop.hbase.rest.TestGZIPResponseWrapper
Tests run: 4, Failures: 0, Errors: 0, Skipped: 0, Time elapsed: 0.053 sec
Running org.apache.hadoop.hbase.rest.model.TestVersionModel
Tests run: 6, Failures: 0, Errors: 0, Skipped: 0, Time elapsed: 0.169 sec
Running org.apache.hadoop.hbase.rest.model.TestTableListModel
Tests run: 6, Failures: 0, Errors: 0, Skipped: 0, Time elapsed: 0.091 sec
Running org.apache.hadoop.hbase.rest.model.TestColumnSchemaModel
Tests run: 6, Failures: 0, Errors: 0, Skipped: 0, Time elapsed: 0.081 sec
Running org.apache.hadoop.hbase.rest.model.TestTableInfoModel
Tests run: 6, Failures: 0, Errors: 0, Skipped: 0, Time elapsed: 0.104 sec
Running org.apache.hadoop.hbase.rest.model.TestScannerModel
Tests run: 6, Failures: 0, Errors: 0, Skipped: 0, Time elapsed: 0.087 sec
Running org.apache.hadoop.hbase.rest.model.TestTableSchemaModel
Tests run: 6, Failures: 0, Errors: 0, Skipped: 0, Time elapsed: 0.079 sec
Running org.apache.hadoop.hbase.rest.model.TestStorageClusterStatusModel
Tests run: 6, Failures: 0, Errors: 0, Skipped: 0, Time elapsed: 0.095 sec
Running org.apache.hadoop.hbase.rest.model.TestCellSetModel
Tests run: 6, Failures: 0, Errors: 0, Skipped: 0, Time elapsed: 0.082 sec
Running org.apache.hadoop.hbase.rest.model.TestStorageClusterVersionModel
Tests run: 6, Failures: 0, Errors: 0, Skipped: 0, Time elapsed: 0.079 sec
Running org.apache.hadoop.hbase.rest.model.TestRowModel
Tests run: 6, Failures: 0, Errors: 0, Skipped: 0, Time elapsed: 0.079 sec
Running org.apache.hadoop.hbase.rest.model.TestTableRegionModel
Tests run: 8, Failures: 0, Errors: 0, Skipped: 0, Time elapsed: 0.1 sec
Running org.apache.hadoop.hbase.rest.model.TestCellModel
Tests run: 6, Failures: 0, Errors: 0, Skipped: 0, Time elapsed: 0.074 sec
Running org.apache.hadoop.hbase.TestServerName
Tests run: 6, Failures: 0, Errors: 0, Skipped: 0, Time elapsed: 0.075 sec
Running org.apache.hadoop.hbase.master.balancer.TestFavoredNodeAssignmentHelper
Tests run: 8, Failures: 0, Errors: 0, Skipped: 0, Time elapsed: 16.26 sec
Running org.apache.hadoop.hbase.master.cleaner.TestCleanerChore
Tests run: 6, Failures: 0, Errors: 0, Skipped: 0, Time elapsed: 1.654 sec
Running org.apache.hadoop.hbase.master.cleaner.TestHFileLinkCleaner
Tests run: 1, Failures: 0, Errors: 0, Skipped: 0, Time elapsed: 10.027 sec
Running org.apache.hadoop.hbase.master.snapshot.TestSnapshotHFileCleaner
Tests run: 1, Failures: 0, Errors: 0, Skipped: 0, Time elapsed: 0.018 sec
Running org.apache.hadoop.hbase.master.snapshot.TestSnapshotLogCleaner
Tests run: 1, Failures: 0, Errors: 0, Skipped: 0, Time elapsed: 0.019 sec
Running org.apache.hadoop.hbase.master.snapshot.TestSnapshotManager
Tests run: 2, Failures: 0, Errors: 0, Skipped: 0, Time elapsed: 0.075 sec
Running org.apache.hadoop.hbase.master.TestRegionState
Tests run: 1, Failures: 0, Errors: 0, Skipped: 0, Time elapsed: 0.019 sec
Running org.apache.hadoop.hbase.master.TestCatalogJanitor
Tests run: 7, Failures: 0, Errors: 0, Skipped: 0, Time elapsed: 9.347 sec
Running org.apache.hadoop.hbase.master.TestHMasterCommandLine
Tests run: 1, Failures: 0, Errors: 0, Skipped: 0, Time elapsed: 0.124 sec
Running org.apache.hadoop.hbase.master.TestClockSkewDetection
Tests run: 1, Failures: 0, Errors: 0, Skipped: 0, Time elapsed: 176.503 sec
Running org.apache.hadoop.hbase.procedure.TestProcedureManager
Tests run: 1, Failures: 0, Errors: 1, Skipped: 0, Time elapsed: 176.503 sec <<< FAILURE!
Running org.apache.hadoop.hbase.security.TestSecureRPC
Tests run: 1, Failures: 0, Errors: 0, Skipped: 1, Time elapsed: 176.503 sec
Running org.apache.hadoop.hbase.security.TestUsersOperationsWithSecureHadoop
Tests run: 1, Failures: 0, Errors: 0, Skipped: 1, Time elapsed: 176.503 sec

Results :

Tests in error: 
  org.apache.hadoop.hbase.procedure.TestProcedureManager

Tests run: 831, Failures: 0, Errors: 1, Skipped: 2

[INFO] ------------------------------------------------------------------------
[INFO] Reactor Summary:
[INFO] 
[INFO] HBase ............................................. SUCCESS [43.810s]
[INFO] HBase - Annotations ............................... SUCCESS [5.829s]
[INFO] HBase - Common .................................... SUCCESS [47.997s]
[INFO] HBase - Protocol .................................. SUCCESS [18.762s]
[INFO] HBase - Client .................................... SUCCESS [46.015s]
[INFO] HBase - Hadoop Compatibility ...................... SUCCESS [5.441s]
[INFO] HBase - Hadoop One Compatibility .................. SUCCESS [10.948s]
[INFO] HBase - Prefix Tree ............................... SUCCESS [2.979s]
[INFO] HBase - Server .................................... FAILURE [3:18.135s]
[INFO] HBase - Testing Util .............................. SKIPPED
[INFO] HBase - Thrift .................................... SKIPPED
[INFO] HBase - Shell ..................................... SKIPPED
[INFO] HBase - Integration Tests ......................... SKIPPED
[INFO] HBase - Examples .................................. SKIPPED
[INFO] HBase - Assembly .................................. SKIPPED
[INFO] ------------------------------------------------------------------------
[INFO] BUILD FAILURE
[INFO] ------------------------------------------------------------------------
[INFO] Total time: 6:21.523s
[INFO] Finished at: Thu Oct 02 00:14:30 UTC 2014
[INFO] Final Memory: 48M/413M
[INFO] ------------------------------------------------------------------------
[ERROR] Failed to execute goal org.apache.maven.plugins:maven-surefire-plugin:2.12-TRUNK-HBASE-2:test
(default-test) on project hbase-server: There are test failures.
[ERROR] 
[ERROR] Please refer to <https://builds.apache.org/job/HBase-0.98-on-Hadoop-1.1/ws/hbase-server/target/surefire-reports>
for the individual test results.
[ERROR] -> [Help 1]
[ERROR] 
[ERROR] To see the full stack trace of the errors, re-run Maven with the -e switch.
[ERROR] Re-run Maven using the -X switch to enable full debug logging.
[ERROR] 
[ERROR] For more information about the errors and possible solutions, please read the following
articles:
[ERROR] [Help 1] http://cwiki.apache.org/confluence/display/MAVEN/MojoFailureException
[ERROR] 
[ERROR] After correcting the problems, you can resume the build with the command
[ERROR]   mvn <goals> -rf :hbase-server
Build step 'Invoke top-level Maven targets' marked build as failure
Performing Post build task...
Match found for :.* : True
Logical operation result is TRUE
Running script  :   ZOMBIE_TESTS_COUNT=`jps | grep surefirebooter | wc -l`
  if [[ $ZOMBIE_TESTS_COUNT != 0 ]] ; then
    #It seems sometimes the tests are not dying immediately. Let's give them 10s
    echo "Suspicious java process found - waiting 10s to see if there are just slow to stop"
    sleep 10
    ZOMBIE_TESTS_COUNT=`jps | grep surefirebooter | wc -l`
    if [[ $ZOMBIE_TESTS_COUNT != 0 ]] ; then
      echo "There are $ZOMBIE_TESTS_COUNT zombie tests, they should have been killed by surefire
but survived"
      echo "************ BEGIN zombies jstack extract"
      ZB_STACK=`jps | grep surefirebooter | cut -d ' ' -f 1 | xargs -n 1 jstack | grep ".test"
| grep "\.java"`
      jps | grep surefirebooter | cut -d ' ' -f 1 | xargs -n 1 jstack
      echo "************ END  zombies jstack extract"
      JIRA_COMMENT="$JIRA_COMMENT

     {color:red}-1 core zombie tests{color}.  There are ${ZOMBIE_TESTS_COUNT} zombie test(s):
${ZB_STACK}"
      BAD=1
      jps | grep surefirebooter | cut -d ' ' -f 1 | xargs kill -9
    else
      echo "We're ok: there is no zombie test, but some tests took some time to stop"
    fi
  else
    echo "We're ok: there is no zombie test"
  fi
[HBase-0.98-on-Hadoop-1.1] $ /bin/bash -xe /tmp/hudson5867851570087240850.sh
++ jps
++ grep surefirebooter
++ wc -l
+ ZOMBIE_TESTS_COUNT=0
+ [[ 0 != 0 ]]
+ echo 'We'\''re ok: there is no zombie test'
We're ok: there is no zombie test
POST BUILD TASK : SUCCESS
END OF POST BUILD TASK : 0
Archiving artifacts
Sending artifact delta relative to HBase-0.98-on-Hadoop-1.1 #517
Archived 793 artifacts
Archive block size is 32768
Received 4 blocks and 34662783 bytes
Compression is 0.4%
Took 21 sec
Recording test results
Updating HBASE-12144
Updating HBASE-12065
Updating HBASE-10141
Updating HBASE-12078

Mime
View raw message