hbase-builds mailing list archives

Site index · List index
Message view « Date » · « Thread »
Top « Date » · « Thread »
From Apache Jenkins Server <jenk...@builds.apache.org>
Subject Build failed in Jenkins: HBase-TRUNK #5700
Date Sat, 25 Oct 2014 16:09:12 GMT
See <https://builds.apache.org/job/HBase-TRUNK/5700/>

------------------------------------------
[...truncated 2618 lines...]
	at org.apache.hadoop.hbase.client.ClientScanner.nextScanner(ClientScanner.java:266)
	at org.apache.hadoop.hbase.client.ClientScanner.initializeScannerInConstruction(ClientScanner.java:138)
	at org.apache.hadoop.hbase.client.ClientScanner.<init>(ClientScanner.java:133)
	at org.apache.hadoop.hbase.client.HTable.getScanner(HTable.java:789)
	at org.apache.hadoop.hbase.MetaTableAccessor.fullScan(MetaTableAccessor.java:596)
	at org.apache.hadoop.hbase.MetaTableAccessor.tableExists(MetaTableAccessor.java:362)
	at org.apache.hadoop.hbase.client.HBaseAdmin.tableExists(HBaseAdmin.java:292)
	at org.apache.hadoop.hbase.client.HBaseAdmin.checkTableExistence(HBaseAdmin.java:1091)
	at org.apache.hadoop.hbase.client.HBaseAdmin.isTableEnabled(HBaseAdmin.java:1103)
	at org.apache.hadoop.hbase.util.TestHBaseFsck.deleteTable(TestHBaseFsck.java:431)
	at org.apache.hadoop.hbase.util.TestHBaseFsck.doQuarantineTest(TestHBaseFsck.java:2056)
	at org.apache.hadoop.hbase.util.TestHBaseFsck.testQuarantineMissingRegionDir(TestHBaseFsck.java:2143)

testHbckThreadpooling(org.apache.hadoop.hbase.util.TestHBaseFsck)  Time elapsed: 69.719 sec
 <<< ERROR!
org.apache.hadoop.hbase.client.RetriesExhaustedException: Can't get the locations
	at org.apache.hadoop.hbase.client.RpcRetryingCallerWithReadReplicas.getRegionLocations(RpcRetryingCallerWithReadReplicas.java:302)
	at org.apache.hadoop.hbase.client.ScannerCallableWithReplicas.call(ScannerCallableWithReplicas.java:131)
	at org.apache.hadoop.hbase.client.ScannerCallableWithReplicas.call(ScannerCallableWithReplicas.java:56)
	at org.apache.hadoop.hbase.client.RpcRetryingCaller.callWithoutRetries(RpcRetryingCaller.java:179)
	at org.apache.hadoop.hbase.client.ClientScanner.call(ClientScanner.java:286)
	at org.apache.hadoop.hbase.client.ClientScanner.nextScanner(ClientScanner.java:266)
	at org.apache.hadoop.hbase.client.ClientScanner.initializeScannerInConstruction(ClientScanner.java:138)
	at org.apache.hadoop.hbase.client.ClientScanner.<init>(ClientScanner.java:133)
	at org.apache.hadoop.hbase.client.HTable.getScanner(HTable.java:789)
	at org.apache.hadoop.hbase.MetaTableAccessor.fullScan(MetaTableAccessor.java:596)
	at org.apache.hadoop.hbase.MetaTableAccessor.tableExists(MetaTableAccessor.java:362)
	at org.apache.hadoop.hbase.client.HBaseAdmin.tableExists(HBaseAdmin.java:292)
	at org.apache.hadoop.hbase.client.HBaseAdmin.checkTableExistence(HBaseAdmin.java:1091)
	at org.apache.hadoop.hbase.client.HBaseAdmin.isTableEnabled(HBaseAdmin.java:1103)
	at org.apache.hadoop.hbase.util.TestHBaseFsck.deleteTable(TestHBaseFsck.java:431)
	at org.apache.hadoop.hbase.util.TestHBaseFsck.testHbckThreadpooling(TestHBaseFsck.java:494)

Running org.apache.hadoop.hbase.snapshot.TestRestoreFlushSnapshotFromClient
Tests run: 11, Failures: 0, Errors: 0, Skipped: 0, Time elapsed: 194.431 sec - in org.apache.hadoop.hbase.TestZooKeeper
Running org.apache.hadoop.hbase.snapshot.TestSnapshotDescriptionUtils
Tests run: 2, Failures: 0, Errors: 0, Skipped: 0, Time elapsed: 0.184 sec - in org.apache.hadoop.hbase.snapshot.TestSnapshotDescriptionUtils
Running org.apache.hadoop.hbase.TestIOFencing
Tests run: 5, Failures: 0, Errors: 0, Skipped: 0, Time elapsed: 41.727 sec - in org.apache.hadoop.hbase.snapshot.TestRestoreFlushSnapshotFromClient
Running org.apache.hadoop.hbase.coprocessor.TestRegionObserverScannerOpenHook
Tests run: 3, Failures: 0, Errors: 0, Skipped: 0, Time elapsed: 8.728 sec - in org.apache.hadoop.hbase.coprocessor.TestRegionObserverScannerOpenHook
Running org.apache.hadoop.hbase.coprocessor.TestOpenTableInCoprocessor
Tests run: 2, Failures: 0, Errors: 0, Skipped: 0, Time elapsed: 3.629 sec - in org.apache.hadoop.hbase.coprocessor.TestOpenTableInCoprocessor
Running org.apache.hadoop.hbase.coprocessor.TestMasterCoprocessorExceptionWithAbort
Tests run: 1, Failures: 0, Errors: 0, Skipped: 0, Time elapsed: 17.881 sec - in org.apache.hadoop.hbase.coprocessor.TestMasterCoprocessorExceptionWithAbort
Running org.apache.hadoop.hbase.coprocessor.TestRegionServerCoprocessorEndpoint
Tests run: 1, Failures: 0, Errors: 0, Skipped: 0, Time elapsed: 1.515 sec - in org.apache.hadoop.hbase.coprocessor.TestRegionServerCoprocessorEndpoint
Running org.apache.hadoop.hbase.coprocessor.TestRegionObserverInterface
Tests run: 9, Failures: 0, Errors: 0, Skipped: 0, Time elapsed: 267.734 sec - in org.apache.hadoop.hbase.snapshot.TestExportSnapshot
Running org.apache.hadoop.hbase.coprocessor.TestMasterCoprocessorExceptionWithRemove
Tests run: 1, Failures: 0, Errors: 0, Skipped: 0, Time elapsed: 4.551 sec - in org.apache.hadoop.hbase.coprocessor.TestMasterCoprocessorExceptionWithRemove
Running org.apache.hadoop.hbase.coprocessor.TestAggregateProtocol
Tests run: 12, Failures: 0, Errors: 0, Skipped: 0, Time elapsed: 32.625 sec - in org.apache.hadoop.hbase.coprocessor.TestRegionObserverInterface
Tests run: 44, Failures: 0, Errors: 0, Skipped: 0, Time elapsed: 3.971 sec - in org.apache.hadoop.hbase.coprocessor.TestAggregateProtocol
Running org.apache.hadoop.hbase.coprocessor.TestBatchCoprocessorEndpoint
Running org.apache.hadoop.hbase.coprocessor.TestHTableWrapper
Tests run: 4, Failures: 0, Errors: 0, Skipped: 0, Time elapsed: 1.897 sec - in org.apache.hadoop.hbase.coprocessor.TestBatchCoprocessorEndpoint
Running org.apache.hadoop.hbase.coprocessor.TestRegionServerObserver
Tests run: 1, Failures: 0, Errors: 0, Skipped: 0, Time elapsed: 2.538 sec - in org.apache.hadoop.hbase.coprocessor.TestHTableWrapper
Tests run: 9, Failures: 0, Errors: 0, Skipped: 0, Time elapsed: 266.622 sec - in org.apache.hadoop.hbase.snapshot.TestSecureExportSnapshot
Running org.apache.hadoop.hbase.coprocessor.TestClassLoading
Running org.apache.hadoop.hbase.coprocessor.TestRegionServerCoprocessorExceptionWithAbort
Tests run: 1, Failures: 0, Errors: 0, Skipped: 0, Time elapsed: 10.852 sec - in org.apache.hadoop.hbase.coprocessor.TestRegionServerObserver
Running org.apache.hadoop.hbase.coprocessor.TestDoubleColumnInterpreter
Tests run: 2, Failures: 0, Errors: 0, Skipped: 0, Time elapsed: 14.041 sec - in org.apache.hadoop.hbase.coprocessor.TestRegionServerCoprocessorExceptionWithAbort
Tests run: 9, Failures: 0, Errors: 0, Skipped: 0, Time elapsed: 14.692 sec - in org.apache.hadoop.hbase.coprocessor.TestClassLoading
Tests run: 38, Failures: 0, Errors: 0, Skipped: 0, Time elapsed: 4.209 sec - in org.apache.hadoop.hbase.coprocessor.TestDoubleColumnInterpreter
Tests run: 46, Failures: 0, Errors: 0, Skipped: 0, Time elapsed: 517.855 sec - in org.apache.hadoop.hbase.client.TestAdmin
Running org.apache.hadoop.hbase.coprocessor.TestRegionObserverBypass
Running org.apache.hadoop.hbase.coprocessor.TestRowProcessorEndpoint
Running org.apache.hadoop.hbase.coprocessor.TestCoprocessorStop
Tests run: 2, Failures: 0, Errors: 0, Skipped: 0, Time elapsed: 2.655 sec - in org.apache.hadoop.hbase.coprocessor.TestRegionObserverBypass
Running org.apache.hadoop.hbase.coprocessor.TestRegionServerCoprocessorExceptionWithRemove
Tests run: 4, Failures: 0, Errors: 0, Skipped: 0, Time elapsed: 6.789 sec - in org.apache.hadoop.hbase.coprocessor.TestRowProcessorEndpoint
Running org.apache.hadoop.hbase.coprocessor.TestBigDecimalColumnInterpreter
Tests run: 38, Failures: 0, Errors: 0, Skipped: 0, Time elapsed: 3.801 sec - in org.apache.hadoop.hbase.coprocessor.TestBigDecimalColumnInterpreter
Running org.apache.hadoop.hbase.coprocessor.TestMasterObserver
Tests run: 1, Failures: 0, Errors: 0, Skipped: 0, Time elapsed: 12.664 sec - in org.apache.hadoop.hbase.coprocessor.TestRegionServerCoprocessorExceptionWithRemove
Tests run: 1, Failures: 0, Errors: 0, Skipped: 0, Time elapsed: 16.362 sec - in org.apache.hadoop.hbase.coprocessor.TestCoprocessorStop
Running org.apache.hadoop.hbase.TestGlobalMemStoreSize
Tests run: 6, Failures: 0, Errors: 0, Skipped: 0, Time elapsed: 7.936 sec - in org.apache.hadoop.hbase.coprocessor.TestMasterObserver
Running org.apache.hadoop.hbase.coprocessor.TestCoprocessorEndpoint
Tests run: 6, Failures: 0, Errors: 0, Skipped: 0, Time elapsed: 1.962 sec - in org.apache.hadoop.hbase.coprocessor.TestCoprocessorEndpoint
Running org.apache.hadoop.hbase.coprocessor.TestWALObserver
Running org.apache.hadoop.hbase.TestMetaTableLocator
Tests run: 2, Failures: 0, Errors: 0, Skipped: 0, Time elapsed: 191.739 sec - in org.apache.hadoop.hbase.TestIOFencing
Tests run: 1, Failures: 0, Errors: 0, Skipped: 0, Time elapsed: 10.725 sec - in org.apache.hadoop.hbase.TestGlobalMemStoreSize
Running org.apache.hadoop.hbase.TestJMXListener
Tests run: 7, Failures: 0, Errors: 0, Skipped: 0, Time elapsed: 3.475 sec - in org.apache.hadoop.hbase.TestMetaTableLocator
Running org.apache.hadoop.hbase.zookeeper.TestZKMulti
Tests run: 6, Failures: 0, Errors: 0, Skipped: 0, Time elapsed: 0.293 sec - in org.apache.hadoop.hbase.zookeeper.TestZKMulti
Running org.apache.hadoop.hbase.zookeeper.lock.TestZKInterProcessReadWriteLock
Running org.apache.hadoop.hbase.zookeeper.TestZKLeaderManager
Tests run: 1, Failures: 0, Errors: 0, Skipped: 0, Time elapsed: 0.115 sec - in org.apache.hadoop.hbase.zookeeper.TestZKLeaderManager
Running org.apache.hadoop.hbase.zookeeper.TestRecoverableZooKeeper
Tests run: 3, Failures: 0, Errors: 0, Skipped: 0, Time elapsed: 9.421 sec - in org.apache.hadoop.hbase.coprocessor.TestWALObserver
Tests run: 1, Failures: 0, Errors: 0, Skipped: 0, Time elapsed: 1.217 sec - in org.apache.hadoop.hbase.zookeeper.TestRecoverableZooKeeper
Running org.apache.hadoop.hbase.zookeeper.TestHQuorumPeer
Running org.apache.hadoop.hbase.zookeeper.TestZooKeeperACL
Running org.apache.hadoop.hbase.zookeeper.TestZooKeeperNodeTracker
Tests run: 6, Failures: 0, Errors: 0, Skipped: 0, Time elapsed: 0.252 sec - in org.apache.hadoop.hbase.zookeeper.TestZooKeeperACL
Tests run: 3, Failures: 0, Errors: 0, Skipped: 0, Time elapsed: 0.904 sec - in org.apache.hadoop.hbase.zookeeper.TestZooKeeperNodeTracker
Tests run: 3, Failures: 0, Errors: 0, Skipped: 0, Time elapsed: 1.47 sec - in org.apache.hadoop.hbase.zookeeper.TestHQuorumPeer
Running org.apache.hadoop.hbase.TestClusterBootOrder
Tests run: 2, Failures: 0, Errors: 0, Skipped: 0, Time elapsed: 15.794 sec - in org.apache.hadoop.hbase.TestJMXListener
Tests run: 6, Failures: 0, Errors: 0, Skipped: 0, Time elapsed: 24.461 sec - in org.apache.hadoop.hbase.zookeeper.lock.TestZKInterProcessReadWriteLock
Tests run: 2, Failures: 0, Errors: 0, Skipped: 0, Time elapsed: 25.132 sec - in org.apache.hadoop.hbase.TestClusterBootOrder

Results :

Tests in error: 
  TestHBaseFsck.testHBaseFsckClean:457 » NullPointer
  TestHBaseFsck.testCoveredStartKey:1059 » IO Duplicate hbck - Abort
  TestHBaseFsck.testFixHdfsHolesNotWorkingWithNoHdfsChecking:1918 » IO Duplicate...
  TestHBaseFsck.testQuarantineMissingHFile:2085->doQuarantineTest:2035 » IO Dupl...
  TestHBaseFsck.testQuarantineCorruptHFile:2003 » IO Duplicate hbck - Abort
  TestHBaseFsck.testReadOnlyProperty:2555 » IO Duplicate hbck - Abort
  TestHBaseFsck.testHbckWithExcessReplica:680 » IO Duplicate hbck - Abort
  TestHBaseFsck.testLingeringSplitParent:1546 » IO Duplicate hbck - Abort
  TestHBaseFsck.testValidLingeringSplitParent:1617 » IO Duplicate hbck - Abort
  TestHBaseFsck.testRegionBoundariesCheck:2539 » IO Duplicate hbck - Abort
  TestHBaseFsck.testRegionDeployedNotInHdfs:1753 » IO Duplicate hbck - Abort
  TestHBaseFsck.testHbckWithFewerReplica:656 » IO Duplicate hbck - Abort
  TestHBaseFsck.testFixMetaNotWorkingWithNoHdfsChecking:1857 » IO Duplicate hbck...
  TestHBaseFsck.testHDFSRegioninfoMissing:1132 » IO Duplicate hbck - Abort
  TestHBaseFsck.testNoVersionFile:1393 » IO Duplicate hbck - Abort
  TestHBaseFsck.testCheckTableLocks:2333 » IO Duplicate hbck - Abort
  TestHBaseFsck.testNoHdfsTable:1356 » IO Duplicate hbck - Abort
  TestHBaseFsck.testDupeRegion:777 » IO Duplicate hbck - Abort
  TestHBaseFsck.testHbckFixOrphanTable:515 » IO Duplicate hbck - Abort
  TestHBaseFsck.testContainedRegionOverlap:882 » IO Duplicate hbck - Abort
  TestHBaseFsck.testDupeStartKey:601 » IO Duplicate hbck - Abort
  TestHBaseFsck.testNotInHdfsWithReplicas:1288 » IO Duplicate hbck - Abort
  TestHBaseFsck.testHBaseFsck:169 » IO Duplicate hbck - Abort
  TestHBaseFsck.testMissingRegionInfoQualifier:2224->deleteTable:431 » TableNotFound
  TestHBaseFsck.testNotInMetaHole:1204 » IO Duplicate hbck - Abort
  TestHBaseFsck.testHbckWithRegionReplica:643 » IO Duplicate hbck - Abort
  TestHBaseFsck.testRegionShouldNotBeDeployed:1449 » IO Duplicate hbck - Abort
  TestHBaseFsck.testMissingLastRegion:1782 » IO Duplicate hbck - Abort
  TestHBaseFsck.testErrorReporter:2237 » IO Duplicate hbck - Abort
  TestHBaseFsck.testFixByTable:1487 » IO Duplicate hbck - Abort
  TestHBaseFsck.testSidelineOverlapRegion:927 » IO Duplicate hbck - Abort
  TestHBaseFsck.testHbckAfterRegionMerge:2527 » IO Duplicate hbck - Abort
  TestHBaseFsck.testFixAssignmentsAndNoHdfsChecking:1809 » IO Duplicate hbck - A...
  TestHBaseFsck.testMetaOffline:2400 » IO Duplicate hbck - Abort
  TestHBaseFsck.testLingeringReferenceFile:2165 » IO Duplicate hbck - Abort
  TestHBaseFsck.testFixAssignmentsWhenMETAinTransition:248 » IO Duplicate hbck -...
  TestOfflineMetaRebuildOverlap.testMetaRebuildOverlapFail:56 » NullPointer
  TestOfflineMetaRebuildBase.testMetaRebuild:48 » NullPointer
  TestHBaseFsck.testSplitDaughtersNotInMeta:1702->deleteTable:431 » RetriesExhausted
  TestOfflineMetaRebuildHole.testMetaRebuildHoleFail:53 » NullPointer
  TestHBaseFsckEncryption.testFsckWithEncryption:132 » NullPointer
  TestHBaseFsck.testOverlapAndOrphan:1033->deleteTable:431 » RetriesExhausted Ca...
  TestHBaseFsck.testRegionHole:1110->deleteTable:431 » RetriesExhausted Can't ge...
  TestHBaseFsck.testTableWithNoRegions:2484->deleteTable:431 » RetriesExhausted ...
  TestHBaseFsck.testNotInHdfs:1253->deleteTable:431 » RetriesExhausted Can't get...
  TestHBaseFsck.testNotInMetaOrDeployedHole:1183->deleteTable:431 » RetriesExhausted
  TestHBaseFsck.testDegenerateRegions:857->deleteTable:431 » RetriesExhausted Ca...
  TestHBaseFsck.testMissingFirstRegion:1732->deleteTable:431 » RetriesExhausted ...
  TestHBaseFsck.testQuarantineMissingRegionDir:2143->doQuarantineTest:2056->deleteTable:431
» RetriesExhausted
  TestHBaseFsck.testHbckThreadpooling:494->deleteTable:431 » RetriesExhausted Ca...

Tests run: 1981, Failures: 0, Errors: 50, Skipped: 24

[INFO] ------------------------------------------------------------------------
[INFO] Reactor Summary:
[INFO] 
[INFO] HBase ............................................. SUCCESS [2.718s]
[INFO] HBase - Checkstyle ................................ SUCCESS [2.548s]
[INFO] HBase - Annotations ............................... SUCCESS [0.807s]
[INFO] HBase - Common .................................... SUCCESS [57.675s]
[INFO] HBase - Protocol .................................. SUCCESS [12.077s]
[INFO] HBase - Client .................................... SUCCESS [1:07.878s]
[INFO] HBase - Hadoop Compatibility ...................... SUCCESS [6.898s]
[INFO] HBase - Hadoop Two Compatibility .................. SUCCESS [5.600s]
[INFO] HBase - Prefix Tree ............................... SUCCESS [8.221s]
[INFO] HBase - Server .................................... FAILURE [56:59.290s]
[INFO] HBase - Testing Util .............................. SKIPPED
[INFO] HBase - Thrift .................................... SKIPPED
[INFO] HBase - Shell ..................................... SKIPPED
[INFO] HBase - Integration Tests ......................... SKIPPED
[INFO] HBase - Examples .................................. SKIPPED
[INFO] HBase - Rest ...................................... SKIPPED
[INFO] HBase - Assembly .................................. SKIPPED
[INFO] ------------------------------------------------------------------------
[INFO] BUILD FAILURE
[INFO] ------------------------------------------------------------------------
[INFO] Total time: 59:44.554s
[INFO] Finished at: Sat Oct 25 16:06:13 UTC 2014
[INFO] Final Memory: 55M/607M
[INFO] ------------------------------------------------------------------------
[ERROR] Failed to execute goal org.apache.maven.plugins:maven-surefire-plugin:2.17:test (secondPartTestsExecution)
on project hbase-server: There are test failures.
[ERROR] 
[ERROR] Please refer to <https://builds.apache.org/job/HBase-TRUNK/ws/hbase-server/target/surefire-reports>
for the individual test results.
[ERROR] -> [Help 1]
[ERROR] 
[ERROR] To see the full stack trace of the errors, re-run Maven with the -e switch.
[ERROR] Re-run Maven using the -X switch to enable full debug logging.
[ERROR] 
[ERROR] For more information about the errors and possible solutions, please read the following
articles:
[ERROR] [Help 1] http://cwiki.apache.org/confluence/display/MAVEN/MojoFailureException
[ERROR] 
[ERROR] After correcting the problems, you can resume the build with the command
[ERROR]   mvn <goals> -rf :hbase-server
Build step 'Invoke top-level Maven targets' marked build as failure
[FINDBUGS] Skipping publisher since build result is FAILURE
Performing Post build task...
Match found for :.* : True
Logical operation result is TRUE
Running script  :   ZOMBIE_TESTS_COUNT=`jps | grep surefirebooter | wc -l`
  if [[ $ZOMBIE_TESTS_COUNT != 0 ]] ; then
    #It seems sometimes the tests are not dying immediately. Let's give them 10s
    echo "Suspicious java process found - waiting 10s to see if there are just slow to stop"
    sleep 10   
    ZOMBIE_TESTS_COUNT=`jps | grep surefirebooter | wc -l`
    if [[ $ZOMBIE_TESTS_COUNT != 0 ]] ; then
      echo "There are $ZOMBIE_TESTS_COUNT zombie tests, they should have been killed by surefire
but survived"
      echo "************ BEGIN zombies jstack extract"
      ZB_STACK=`jps | grep surefirebooter | cut -d ' ' -f 1 | xargs -n 1 jstack | grep ".test"
| grep "\.java"`
      jps | grep surefirebooter | cut -d ' ' -f 1 | xargs -n 1 jstack
      echo "************ END  zombies jstack extract"
      JIRA_COMMENT="$JIRA_COMMENT

     {color:red}-1 core zombie tests{color}.  There are ${ZOMBIE_TESTS_COUNT} zombie test(s):
${ZB_STACK}"
      BAD=1
      jps | grep surefirebooter | cut -d ' ' -f 1 | xargs kill -9
    else
      echo "We're ok: there is no zombie test, but some tests took some time to stop"
    fi
  else
    echo "We're ok: there is no zombie test"
  fi
[HBase-TRUNK] $ /bin/bash -xe /tmp/hudson7565057895875616609.sh
++ jps
++ grep surefirebooter
++ wc -l
+ ZOMBIE_TESTS_COUNT=0
+ [[ 0 != 0 ]]
+ echo 'We'\''re ok: there is no zombie test'
We're ok: there is no zombie test
POST BUILD TASK : SUCCESS
END OF POST BUILD TASK : 0
Archiving artifacts
Sending artifact delta relative to HBase-TRUNK #5698
Archived 1754 artifacts
Archive block size is 32768
Received 75 blocks and 401486750 bytes
Compression is 0.6%
Took 1 min 50 sec
Recording test results

Mime
View raw message