hbase-builds mailing list archives

Site index · List index
Message view « Date » · « Thread »
Top « Date » · « Thread »
From Apache Jenkins Server <jenk...@builds.apache.org>
Subject Build failed in Jenkins: HBase-0.94-security #546
Date Tue, 07 Oct 2014 08:19:10 GMT
See <https://builds.apache.org/job/HBase-0.94-security/546/changes>

Changes:

[apurtell] HBASE-12039 Lower log level for TableNotFoundException log message when throwing
(stack)

------------------------------------------
[...truncated 53424 lines...]
Running org.apache.hadoop.hbase.regionserver.TestBlocksRead
Tests run: 4, Failures: 0, Errors: 0, Skipped: 0, Time elapsed: 0.797 sec
Forking command line: /bin/sh -c cd /x1/jenkins/jenkins-slave/workspace/HBase-0.94-security
&& /x1/jenkins/tools/java/jdk1.6.0_45-32/jre/bin/java -enableassertions -Xmx1900m
-Djava.security.egd=file:/dev/./urandom -jar /x1/jenkins/jenkins-slave/workspace/HBase-0.94-security/target/surefire/surefirebooter5471720443757417821.jar
/x1/jenkins/jenkins-slave/workspace/HBase-0.94-security/target/surefire/surefire6938217167455571517tmp
/x1/jenkins/jenkins-slave/workspace/HBase-0.94-security/target/surefire/surefire_1022458795255186449583tmp
Running org.apache.hadoop.hbase.regionserver.TestSplitLogWorker
Tests run: 5, Failures: 0, Errors: 0, Skipped: 0, Time elapsed: 17.227 sec
Forking command line: /bin/sh -c cd /x1/jenkins/jenkins-slave/workspace/HBase-0.94-security
&& /x1/jenkins/tools/java/jdk1.6.0_45-32/jre/bin/java -enableassertions -Xmx1900m
-Djava.security.egd=file:/dev/./urandom -jar /x1/jenkins/jenkins-slave/workspace/HBase-0.94-security/target/surefire/surefirebooter7671792592237460355.jar
/x1/jenkins/jenkins-slave/workspace/HBase-0.94-security/target/surefire/surefire5622692424549082482tmp
/x1/jenkins/jenkins-slave/workspace/HBase-0.94-security/target/surefire/surefire_1033549882275206274712tmp
Running org.apache.hadoop.hbase.regionserver.TestStoreScanner
Tests run: 16, Failures: 0, Errors: 0, Skipped: 0, Time elapsed: 0.046 sec
Forking command line: /bin/sh -c cd /x1/jenkins/jenkins-slave/workspace/HBase-0.94-security
&& /x1/jenkins/tools/java/jdk1.6.0_45-32/jre/bin/java -enableassertions -Xmx1900m
-Djava.security.egd=file:/dev/./urandom -jar /x1/jenkins/jenkins-slave/workspace/HBase-0.94-security/target/surefire/surefirebooter7274852992840638599.jar
/x1/jenkins/jenkins-slave/workspace/HBase-0.94-security/target/surefire/surefire224282494037279721tmp
/x1/jenkins/jenkins-slave/workspace/HBase-0.94-security/target/surefire/surefire_1042444655972751461263tmp
Running org.apache.hadoop.hbase.regionserver.metrics.TestSchemaMetrics
Tests run: 6, Failures: 0, Errors: 0, Skipped: 0, Time elapsed: 12.843 sec
Forking command line: /bin/sh -c cd /x1/jenkins/jenkins-slave/workspace/HBase-0.94-security
&& /x1/jenkins/tools/java/jdk1.6.0_45-32/jre/bin/java -enableassertions -Xmx1900m
-Djava.security.egd=file:/dev/./urandom -jar /x1/jenkins/jenkins-slave/workspace/HBase-0.94-security/target/surefire/surefirebooter4061953086902794003.jar
/x1/jenkins/jenkins-slave/workspace/HBase-0.94-security/target/surefire/surefire3286697430777669918tmp
/x1/jenkins/jenkins-slave/workspace/HBase-0.94-security/target/surefire/surefire_1053723521262984669776tmp
Running org.apache.hadoop.hbase.regionserver.TestStoreFileBlockCacheSummary
Tests run: 1, Failures: 0, Errors: 0, Skipped: 0, Time elapsed: 21.324 sec
Forking command line: /bin/sh -c cd /x1/jenkins/jenkins-slave/workspace/HBase-0.94-security
&& /x1/jenkins/tools/java/jdk1.6.0_45-32/jre/bin/java -enableassertions -Xmx1900m
-Djava.security.egd=file:/dev/./urandom -jar /x1/jenkins/jenkins-slave/workspace/HBase-0.94-security/target/surefire/surefirebooter4206389248605221869.jar
/x1/jenkins/jenkins-slave/workspace/HBase-0.94-security/target/surefire/surefire5207646242838483548tmp
/x1/jenkins/jenkins-slave/workspace/HBase-0.94-security/target/surefire/surefire_1065641153714977687tmp
Running org.apache.hadoop.hbase.regionserver.TestMultiColumnScanner
Tests run: 12, Failures: 0, Errors: 0, Skipped: 0, Time elapsed: 32.472 sec
Forking command line: /bin/sh -c cd /x1/jenkins/jenkins-slave/workspace/HBase-0.94-security
&& /x1/jenkins/tools/java/jdk1.6.0_45-32/jre/bin/java -enableassertions -Xmx1900m
-Djava.security.egd=file:/dev/./urandom -jar /x1/jenkins/jenkins-slave/workspace/HBase-0.94-security/target/surefire/surefirebooter7593316854891713090.jar
/x1/jenkins/jenkins-slave/workspace/HBase-0.94-security/target/surefire/surefire2409170842073614868tmp
/x1/jenkins/jenkins-slave/workspace/HBase-0.94-security/target/surefire/surefire_1078897635879081659008tmp
Running org.apache.hadoop.hbase.regionserver.TestMasterAddressManager
Tests run: 1, Failures: 0, Errors: 0, Skipped: 0, Time elapsed: 0.857 sec
Forking command line: /bin/sh -c cd /x1/jenkins/jenkins-slave/workspace/HBase-0.94-security
&& /x1/jenkins/tools/java/jdk1.6.0_45-32/jre/bin/java -enableassertions -Xmx1900m
-Djava.security.egd=file:/dev/./urandom -jar /x1/jenkins/jenkins-slave/workspace/HBase-0.94-security/target/surefire/surefirebooter3305671576782299223.jar
/x1/jenkins/jenkins-slave/workspace/HBase-0.94-security/target/surefire/surefire8396653564121648016tmp
/x1/jenkins/jenkins-slave/workspace/HBase-0.94-security/target/surefire/surefire_1081363601067839808820tmp
Forking command line: /bin/sh -c cd /x1/jenkins/jenkins-slave/workspace/HBase-0.94-security
&& /x1/jenkins/tools/java/jdk1.6.0_45-32/jre/bin/java -enableassertions -Xmx1900m
-Djava.security.egd=file:/dev/./urandom -jar /x1/jenkins/jenkins-slave/workspace/HBase-0.94-security/target/surefire/surefirebooter7735827069704649929.jar
/x1/jenkins/jenkins-slave/workspace/HBase-0.94-security/target/surefire/surefire8672762410179349530tmp
/x1/jenkins/jenkins-slave/workspace/HBase-0.94-security/target/surefire/surefire_1092966751337202313225tmp
Running org.apache.hadoop.hbase.regionserver.TestHRegion
Tests run: 75, Failures: 0, Errors: 0, Skipped: 0, Time elapsed: 69.018 sec
Forking command line: /bin/sh -c cd /x1/jenkins/jenkins-slave/workspace/HBase-0.94-security
&& /x1/jenkins/tools/java/jdk1.6.0_45-32/jre/bin/java -enableassertions -Xmx1900m
-Djava.security.egd=file:/dev/./urandom -jar /x1/jenkins/jenkins-slave/workspace/HBase-0.94-security/target/surefire/surefirebooter7148437367401464401.jar
/x1/jenkins/jenkins-slave/workspace/HBase-0.94-security/target/surefire/surefire6229987104968469468tmp
/x1/jenkins/jenkins-slave/workspace/HBase-0.94-security/target/surefire/surefire_1106700964166303912420tmp
Running org.apache.hadoop.hbase.TestLocalHBaseCluster
Tests run: 1, Failures: 0, Errors: 0, Skipped: 0, Time elapsed: 11.241 sec
Forking command line: /bin/sh -c cd /x1/jenkins/jenkins-slave/workspace/HBase-0.94-security
&& /x1/jenkins/tools/java/jdk1.6.0_45-32/jre/bin/java -enableassertions -Xmx1900m
-Djava.security.egd=file:/dev/./urandom -jar /x1/jenkins/jenkins-slave/workspace/HBase-0.94-security/target/surefire/surefirebooter3899170394895939328.jar
/x1/jenkins/jenkins-slave/workspace/HBase-0.94-security/target/surefire/surefire862248556689848741tmp
/x1/jenkins/jenkins-slave/workspace/HBase-0.94-security/target/surefire/surefire_1116364578613407419469tmp
Running org.apache.hadoop.hbase.ipc.TestDelayedRpc
Tests run: 4, Failures: 0, Errors: 0, Skipped: 0, Time elapsed: 3.151 sec
Forking command line: /bin/sh -c cd /x1/jenkins/jenkins-slave/workspace/HBase-0.94-security
&& /x1/jenkins/tools/java/jdk1.6.0_45-32/jre/bin/java -enableassertions -Xmx1900m
-Djava.security.egd=file:/dev/./urandom -jar /x1/jenkins/jenkins-slave/workspace/HBase-0.94-security/target/surefire/surefirebooter6193543433050448846.jar
/x1/jenkins/jenkins-slave/workspace/HBase-0.94-security/target/surefire/surefire6856068340209764449tmp
/x1/jenkins/jenkins-slave/workspace/HBase-0.94-security/target/surefire/surefire_1121751596003597777011tmp
Running org.apache.hadoop.hbase.ipc.TestPBOnWritableRpc
Tests run: 1, Failures: 0, Errors: 0, Skipped: 0, Time elapsed: 0.961 sec
Forking command line: /bin/sh -c cd /x1/jenkins/jenkins-slave/workspace/HBase-0.94-security
&& /x1/jenkins/tools/java/jdk1.6.0_45-32/jre/bin/java -enableassertions -Xmx1900m
-Djava.security.egd=file:/dev/./urandom -jar /x1/jenkins/jenkins-slave/workspace/HBase-0.94-security/target/surefire/surefirebooter722539693381949077.jar
/x1/jenkins/jenkins-slave/workspace/HBase-0.94-security/target/surefire/surefire3943199172344793729tmp
/x1/jenkins/jenkins-slave/workspace/HBase-0.94-security/target/surefire/surefire_1137666831587949871477tmp
Running org.apache.hadoop.hbase.TestGlobalMemStoreSize
Tests run: 1, Failures: 0, Errors: 0, Skipped: 0, Time elapsed: 45.986 sec
Forking command line: /bin/sh -c cd /x1/jenkins/jenkins-slave/workspace/HBase-0.94-security
&& /x1/jenkins/tools/java/jdk1.6.0_45-32/jre/bin/java -enableassertions -Xmx1900m
-Djava.security.egd=file:/dev/./urandom -jar /x1/jenkins/jenkins-slave/workspace/HBase-0.94-security/target/surefire/surefirebooter1633292068925290685.jar
/x1/jenkins/jenkins-slave/workspace/HBase-0.94-security/target/surefire/surefire3966514380621054553tmp
/x1/jenkins/jenkins-slave/workspace/HBase-0.94-security/target/surefire/surefire_1146635946234871538046tmp
Running org.apache.hadoop.hbase.constraint.TestConstraint
Tests run: 5, Failures: 0, Errors: 0, Skipped: 0, Time elapsed: 46.524 sec
Forking command line: /bin/sh -c cd /x1/jenkins/jenkins-slave/workspace/HBase-0.94-security
&& /x1/jenkins/tools/java/jdk1.6.0_45-32/jre/bin/java -enableassertions -Xmx1900m
-Djava.security.egd=file:/dev/./urandom -jar /x1/jenkins/jenkins-slave/workspace/HBase-0.94-security/target/surefire/surefirebooter5521063958271664565.jar
/x1/jenkins/jenkins-slave/workspace/HBase-0.94-security/target/surefire/surefire6445513135920196667tmp
/x1/jenkins/jenkins-slave/workspace/HBase-0.94-security/target/surefire/surefire_1155138130097226067467tmp
Running org.apache.hadoop.hbase.rest.TestSchemaResource
Tests run: 2, Failures: 0, Errors: 0, Skipped: 0, Time elapsed: 36.801 sec
Forking command line: /bin/sh -c cd /x1/jenkins/jenkins-slave/workspace/HBase-0.94-security
&& /x1/jenkins/tools/java/jdk1.6.0_45-32/jre/bin/java -enableassertions -Xmx1900m
-Djava.security.egd=file:/dev/./urandom -jar /x1/jenkins/jenkins-slave/workspace/HBase-0.94-security/target/surefire/surefirebooter1199484451853355418.jar
/x1/jenkins/jenkins-slave/workspace/HBase-0.94-security/target/surefire/surefire1757595956569582258tmp
/x1/jenkins/jenkins-slave/workspace/HBase-0.94-security/target/surefire/surefire_1168165677413776976661tmp
Running org.apache.hadoop.hbase.backup.TestHFileArchiving
Tests run: 5, Failures: 0, Errors: 0, Skipped: 0, Time elapsed: 221.341 sec
Forking command line: /bin/sh -c cd /x1/jenkins/jenkins-slave/workspace/HBase-0.94-security
&& /x1/jenkins/tools/java/jdk1.6.0_45-32/jre/bin/java -enableassertions -Xmx1900m
-Djava.security.egd=file:/dev/./urandom -jar /x1/jenkins/jenkins-slave/workspace/HBase-0.94-security/target/surefire/surefirebooter2483788168343584281.jar
/x1/jenkins/jenkins-slave/workspace/HBase-0.94-security/target/surefire/surefire4383733744022983651tmp
/x1/jenkins/jenkins-slave/workspace/HBase-0.94-security/target/surefire/surefire_1175907159675458513595tmp
Running org.apache.hadoop.hbase.rest.client.TestRemoteAdmin
Tests run: 5, Failures: 0, Errors: 0, Skipped: 0, Time elapsed: 33.605 sec
Forking command line: /bin/sh -c cd /x1/jenkins/jenkins-slave/workspace/HBase-0.94-security
&& /x1/jenkins/tools/java/jdk1.6.0_45-32/jre/bin/java -enableassertions -Xmx1900m
-Djava.security.egd=file:/dev/./urandom -jar /x1/jenkins/jenkins-slave/workspace/HBase-0.94-security/target/surefire/surefirebooter3157167326477121839.jar
/x1/jenkins/jenkins-slave/workspace/HBase-0.94-security/target/surefire/surefire4383234425631851516tmp
/x1/jenkins/jenkins-slave/workspace/HBase-0.94-security/target/surefire/surefire_1181566249288600472994tmp
Running org.apache.hadoop.hbase.rest.TestTableResource
Tests run: 8, Failures: 0, Errors: 0, Skipped: 0, Time elapsed: 41.442 sec
Forking command line: /bin/sh -c cd /x1/jenkins/jenkins-slave/workspace/HBase-0.94-security
&& /x1/jenkins/tools/java/jdk1.6.0_45-32/jre/bin/java -enableassertions -Xmx1900m
-Djava.security.egd=file:/dev/./urandom -jar /x1/jenkins/jenkins-slave/workspace/HBase-0.94-security/target/surefire/surefirebooter2436434393788913513.jar
/x1/jenkins/jenkins-slave/workspace/HBase-0.94-security/target/surefire/surefire261406260783851897tmp
/x1/jenkins/jenkins-slave/workspace/HBase-0.94-security/target/surefire/surefire_1192121125343847633388tmp
Running org.apache.hadoop.hbase.rest.client.TestRemoteTable
Tests run: 9, Failures: 0, Errors: 0, Skipped: 0, Time elapsed: 64.9 sec
Forking command line: /bin/sh -c cd /x1/jenkins/jenkins-slave/workspace/HBase-0.94-security
&& /x1/jenkins/tools/java/jdk1.6.0_45-32/jre/bin/java -enableassertions -Xmx1900m
-Djava.security.egd=file:/dev/./urandom -jar /x1/jenkins/jenkins-slave/workspace/HBase-0.94-security/target/surefire/surefirebooter4998937482092504532.jar
/x1/jenkins/jenkins-slave/workspace/HBase-0.94-security/target/surefire/surefire7690984034928916628tmp
/x1/jenkins/jenkins-slave/workspace/HBase-0.94-security/target/surefire/surefire_1201012974800706007672tmp
Running org.apache.hadoop.hbase.rest.TestMultiRowResource
Tests run: 3, Failures: 0, Errors: 0, Skipped: 0, Time elapsed: 21.652 sec
Forking command line: /bin/sh -c cd /x1/jenkins/jenkins-slave/workspace/HBase-0.94-security
&& /x1/jenkins/tools/java/jdk1.6.0_45-32/jre/bin/java -enableassertions -Xmx1900m
-Djava.security.egd=file:/dev/./urandom -jar /x1/jenkins/jenkins-slave/workspace/HBase-0.94-security/target/surefire/surefirebooter6817377630284520374.jar
/x1/jenkins/jenkins-slave/workspace/HBase-0.94-security/target/surefire/surefire1240343678495737650tmp
/x1/jenkins/jenkins-slave/workspace/HBase-0.94-security/target/surefire/surefire_1213711075933399429947tmp
Running org.apache.hadoop.hbase.rest.TestGzipFilter
Tests run: 2, Failures: 0, Errors: 0, Skipped: 0, Time elapsed: 20.006 sec
Forking command line: /bin/sh -c cd /x1/jenkins/jenkins-slave/workspace/HBase-0.94-security
&& /x1/jenkins/tools/java/jdk1.6.0_45-32/jre/bin/java -enableassertions -Xmx1900m
-Djava.security.egd=file:/dev/./urandom -jar /x1/jenkins/jenkins-slave/workspace/HBase-0.94-security/target/surefire/surefirebooter1960200094244538026.jar
/x1/jenkins/jenkins-slave/workspace/HBase-0.94-security/target/surefire/surefire8784333219431896073tmp
/x1/jenkins/jenkins-slave/workspace/HBase-0.94-security/target/surefire/surefire_1221445895254872046777tmp
Running org.apache.hadoop.hbase.rest.TestRowResource
Tests run: 12, Failures: 0, Errors: 0, Skipped: 0, Time elapsed: 24.649 sec
Forking command line: /bin/sh -c cd /x1/jenkins/jenkins-slave/workspace/HBase-0.94-security
&& /x1/jenkins/tools/java/jdk1.6.0_45-32/jre/bin/java -enableassertions -Xmx1900m
-Djava.security.egd=file:/dev/./urandom -jar /x1/jenkins/jenkins-slave/workspace/HBase-0.94-security/target/surefire/surefirebooter6144262848382069764.jar
/x1/jenkins/jenkins-slave/workspace/HBase-0.94-security/target/surefire/surefire7827333015276517009tmp
/x1/jenkins/jenkins-slave/workspace/HBase-0.94-security/target/surefire/surefire_1235175810191622930279tmp
Running org.apache.hadoop.hbase.rest.TestVersionResource
Tests run: 7, Failures: 0, Errors: 0, Skipped: 0, Time elapsed: 16.753 sec
Forking command line: /bin/sh -c cd /x1/jenkins/jenkins-slave/workspace/HBase-0.94-security
&& /x1/jenkins/tools/java/jdk1.6.0_45-32/jre/bin/java -enableassertions -Xmx1900m
-Djava.security.egd=file:/dev/./urandom -jar /x1/jenkins/jenkins-slave/workspace/HBase-0.94-security/target/surefire/surefirebooter325733806347425074.jar
/x1/jenkins/jenkins-slave/workspace/HBase-0.94-security/target/surefire/surefire7233030149808696234tmp
/x1/jenkins/jenkins-slave/workspace/HBase-0.94-security/target/surefire/surefire_124254082653748346945tmp
Running org.apache.hadoop.hbase.rest.TestScannerResource
Tests run: 5, Failures: 0, Errors: 0, Skipped: 0, Time elapsed: 46.9 sec
Forking command line: /bin/sh -c cd /x1/jenkins/jenkins-slave/workspace/HBase-0.94-security
&& /x1/jenkins/tools/java/jdk1.6.0_45-32/jre/bin/java -enableassertions -Xmx1900m
-Djava.security.egd=file:/dev/./urandom -jar /x1/jenkins/jenkins-slave/workspace/HBase-0.94-security/target/surefire/surefirebooter6024106176444852124.jar
/x1/jenkins/jenkins-slave/workspace/HBase-0.94-security/target/surefire/surefire5893821786991175279tmp
/x1/jenkins/jenkins-slave/workspace/HBase-0.94-security/target/surefire/surefire_1253235015205823009958tmp
Running org.apache.hadoop.hbase.rest.TestStatusResource
Tests run: 2, Failures: 0, Errors: 0, Skipped: 0, Time elapsed: 17.302 sec
Forking command line: /bin/sh -c cd /x1/jenkins/jenkins-slave/workspace/HBase-0.94-security
&& /x1/jenkins/tools/java/jdk1.6.0_45-32/jre/bin/java -enableassertions -Xmx1900m
-Djava.security.egd=file:/dev/./urandom -jar /x1/jenkins/jenkins-slave/workspace/HBase-0.94-security/target/surefire/surefirebooter1522299464325390786.jar
/x1/jenkins/jenkins-slave/workspace/HBase-0.94-security/target/surefire/surefire159413842672003487tmp
/x1/jenkins/jenkins-slave/workspace/HBase-0.94-security/target/surefire/surefire_1266209141502670059891tmp
Running org.apache.hadoop.hbase.rest.TestGZIPResponseWrapper
Tests run: 5, Failures: 0, Errors: 0, Skipped: 0, Time elapsed: 0.26 sec
Forking command line: /bin/sh -c cd /x1/jenkins/jenkins-slave/workspace/HBase-0.94-security
&& /x1/jenkins/tools/java/jdk1.6.0_45-32/jre/bin/java -enableassertions -Xmx1900m
-Djava.security.egd=file:/dev/./urandom -jar /x1/jenkins/jenkins-slave/workspace/HBase-0.94-security/target/surefire/surefirebooter1134335417606111924.jar
/x1/jenkins/jenkins-slave/workspace/HBase-0.94-security/target/surefire/surefire6884529160671371295tmp
/x1/jenkins/jenkins-slave/workspace/HBase-0.94-security/target/surefire/surefire_1275409606318961399031tmp
Running org.apache.hadoop.hbase.rest.TestScannersWithFilters
Tests run: 10, Failures: 0, Errors: 0, Skipped: 0, Time elapsed: 25.115 sec
Forking command line: /bin/sh -c cd /x1/jenkins/jenkins-slave/workspace/HBase-0.94-security
&& /x1/jenkins/tools/java/jdk1.6.0_45-32/jre/bin/java -enableassertions -Xmx1900m
-Djava.security.egd=file:/dev/./urandom -jar /x1/jenkins/jenkins-slave/workspace/HBase-0.94-security/target/surefire/surefirebooter7205351304630094344.jar
/x1/jenkins/jenkins-slave/workspace/HBase-0.94-security/target/surefire/surefire4613140231928613836tmp
/x1/jenkins/jenkins-slave/workspace/HBase-0.94-security/target/surefire/surefire_1283473759117969633037tmp
Running org.apache.hadoop.hbase.TestHBaseFileSystem
Tests run: 2, Failures: 0, Errors: 0, Skipped: 0, Time elapsed: 25.46 sec
Forking command line: /bin/sh -c cd /x1/jenkins/jenkins-slave/workspace/HBase-0.94-security
&& /x1/jenkins/tools/java/jdk1.6.0_45-32/jre/bin/java -enableassertions -Xmx1900m
-Djava.security.egd=file:/dev/./urandom -jar /x1/jenkins/jenkins-slave/workspace/HBase-0.94-security/target/surefire/surefirebooter7339322448686715779.jar
/x1/jenkins/jenkins-slave/workspace/HBase-0.94-security/target/surefire/surefire4039602555519115707tmp
/x1/jenkins/jenkins-slave/workspace/HBase-0.94-security/target/surefire/surefire_129293512813315388608tmp
Running org.apache.hadoop.hbase.metrics.TestMetricsMBeanBase
Tests run: 3, Failures: 0, Errors: 0, Skipped: 0, Time elapsed: 1.316 sec
Forking command line: /bin/sh -c cd /x1/jenkins/jenkins-slave/workspace/HBase-0.94-security
&& /x1/jenkins/tools/java/jdk1.6.0_45-32/jre/bin/java -enableassertions -Xmx1900m
-Djava.security.egd=file:/dev/./urandom -jar /x1/jenkins/jenkins-slave/workspace/HBase-0.94-security/target/surefire/surefirebooter1679615717118161913.jar
/x1/jenkins/jenkins-slave/workspace/HBase-0.94-security/target/surefire/surefire3518471287185872539tmp
/x1/jenkins/jenkins-slave/workspace/HBase-0.94-security/target/surefire/surefire_130703312182815748609tmp
Running org.apache.hadoop.hbase.io.hfile.TestHFileSeek
Tests run: 1, Failures: 0, Errors: 0, Skipped: 0, Time elapsed: 4.575 sec
Forking command line: /bin/sh -c cd /x1/jenkins/jenkins-slave/workspace/HBase-0.94-security
&& /x1/jenkins/tools/java/jdk1.6.0_45-32/jre/bin/java -enableassertions -Xmx1900m
-Djava.security.egd=file:/dev/./urandom -jar /x1/jenkins/jenkins-slave/workspace/HBase-0.94-security/target/surefire/surefirebooter2368271828418183065.jar
/x1/jenkins/jenkins-slave/workspace/HBase-0.94-security/target/surefire/surefire5935793054634896689tmp
/x1/jenkins/jenkins-slave/workspace/HBase-0.94-security/target/surefire/surefire_1315993708270260640331tmp
Running org.apache.hadoop.hbase.io.hfile.TestLruBlockCache
Tests run: 16, Failures: 0, Errors: 0, Skipped: 0, Time elapsed: 1.08 sec
Forking command line: /bin/sh -c cd /x1/jenkins/jenkins-slave/workspace/HBase-0.94-security
&& /x1/jenkins/tools/java/jdk1.6.0_45-32/jre/bin/java -enableassertions -Xmx1900m
-Djava.security.egd=file:/dev/./urandom -jar /x1/jenkins/jenkins-slave/workspace/HBase-0.94-security/target/surefire/surefirebooter4738277647977348797.jar
/x1/jenkins/jenkins-slave/workspace/HBase-0.94-security/target/surefire/surefire6775182025309567362tmp
/x1/jenkins/jenkins-slave/workspace/HBase-0.94-security/target/surefire/surefire_1322408904813877327292tmp
Running org.apache.hadoop.hbase.io.hfile.TestHFileBlockIndex
Tests run: 10, Failures: 0, Errors: 0, Skipped: 0, Time elapsed: 7.761 sec
Forking command line: /bin/sh -c cd /x1/jenkins/jenkins-slave/workspace/HBase-0.94-security
&& /x1/jenkins/tools/java/jdk1.6.0_45-32/jre/bin/java -enableassertions -Xmx1900m
-Djava.security.egd=file:/dev/./urandom -jar /x1/jenkins/jenkins-slave/workspace/HBase-0.94-security/target/surefire/surefirebooter2587284994153780514.jar
/x1/jenkins/jenkins-slave/workspace/HBase-0.94-security/target/surefire/surefire6121786965835414273tmp
/x1/jenkins/jenkins-slave/workspace/HBase-0.94-security/target/surefire/surefire_1331563093681598180524tmp
Running org.apache.hadoop.hbase.io.hfile.TestFixedFileTrailer
Tests run: 2, Failures: 0, Errors: 0, Skipped: 0, Time elapsed: 0.61 sec
Forking command line: /bin/sh -c cd /x1/jenkins/jenkins-slave/workspace/HBase-0.94-security
&& /x1/jenkins/tools/java/jdk1.6.0_45-32/jre/bin/java -enableassertions -Xmx1900m
-Djava.security.egd=file:/dev/./urandom -jar /x1/jenkins/jenkins-slave/workspace/HBase-0.94-security/target/surefire/surefirebooter9176922803828668137.jar
/x1/jenkins/jenkins-slave/workspace/HBase-0.94-security/target/surefire/surefire9006285935837565133tmp
/x1/jenkins/jenkins-slave/workspace/HBase-0.94-security/target/surefire/surefire_1346559499077702173198tmp
Running org.apache.hadoop.hbase.io.hfile.TestHFilePerformance
Tests run: 1, Failures: 0, Errors: 0, Skipped: 0, Time elapsed: 4.536 sec
Forking command line: /bin/sh -c cd /x1/jenkins/jenkins-slave/workspace/HBase-0.94-security
&& /x1/jenkins/tools/java/jdk1.6.0_45-32/jre/bin/java -enableassertions -Xmx1900m
-Djava.security.egd=file:/dev/./urandom -jar /x1/jenkins/jenkins-slave/workspace/HBase-0.94-security/target/surefire/surefirebooter8530853976039963661.jar
/x1/jenkins/jenkins-slave/workspace/HBase-0.94-security/target/surefire/surefire8558665272935430404tmp
/x1/jenkins/jenkins-slave/workspace/HBase-0.94-security/target/surefire/surefire_1357629817107399681456tmp
Running org.apache.hadoop.hbase.io.hfile.TestHFileBlockCompatibility
Tests run: 10, Failures: 0, Errors: 0, Skipped: 0, Time elapsed: 1.016 sec
Forking command line: /bin/sh -c cd /x1/jenkins/jenkins-slave/workspace/HBase-0.94-security
&& /x1/jenkins/tools/java/jdk1.6.0_45-32/jre/bin/java -enableassertions -Xmx1900m
-Djava.security.egd=file:/dev/./urandom -jar /x1/jenkins/jenkins-slave/workspace/HBase-0.94-security/target/surefire/surefirebooter5227921405057919366.jar
/x1/jenkins/jenkins-slave/workspace/HBase-0.94-security/target/surefire/surefire1651777916858285584tmp
/x1/jenkins/jenkins-slave/workspace/HBase-0.94-security/target/surefire/surefire_1365057559414992199878tmp
Running org.apache.hadoop.hbase.io.hfile.TestCacheOnWrite
Tests run: 36, Failures: 0, Errors: 0, Skipped: 0, Time elapsed: 27.232 sec
Forking command line: /bin/sh -c cd /x1/jenkins/jenkins-slave/workspace/HBase-0.94-security
&& /x1/jenkins/tools/java/jdk1.6.0_45-32/jre/bin/java -enableassertions -Xmx1900m
-Djava.security.egd=file:/dev/./urandom -jar /x1/jenkins/jenkins-slave/workspace/HBase-0.94-security/target/surefire/surefirebooter2895153990426867681.jar
/x1/jenkins/jenkins-slave/workspace/HBase-0.94-security/target/surefire/surefire3782795555649341553tmp
/x1/jenkins/jenkins-slave/workspace/HBase-0.94-security/target/surefire/surefire_1371021936086275925234tmp
Running org.apache.hadoop.hbase.io.hfile.TestChecksum
Tests run: 3, Failures: 0, Errors: 0, Skipped: 0, Time elapsed: 0.771 sec
Forking command line: /bin/sh -c cd /x1/jenkins/jenkins-slave/workspace/HBase-0.94-security
&& /x1/jenkins/tools/java/jdk1.6.0_45-32/jre/bin/java -enableassertions -Xmx1900m
-Djava.security.egd=file:/dev/./urandom -jar /x1/jenkins/jenkins-slave/workspace/HBase-0.94-security/target/surefire/surefirebooter5868563756815975376.jar
/x1/jenkins/jenkins-slave/workspace/HBase-0.94-security/target/surefire/surefire1179392490058546519tmp
/x1/jenkins/jenkins-slave/workspace/HBase-0.94-security/target/surefire/surefire_1383937485770210033514tmp
Running org.apache.hadoop.hbase.io.hfile.TestForceCacheImportantBlocks
Tests run: 6, Failures: 0, Errors: 0, Skipped: 0, Time elapsed: 49.415 sec
Forking command line: /bin/sh -c cd /x1/jenkins/jenkins-slave/workspace/HBase-0.94-security
&& /x1/jenkins/tools/java/jdk1.6.0_45-32/jre/bin/java -enableassertions -Xmx1900m
-Djava.security.egd=file:/dev/./urandom -jar /x1/jenkins/jenkins-slave/workspace/HBase-0.94-security/target/surefire/surefirebooter4524976136444736994.jar
/x1/jenkins/jenkins-slave/workspace/HBase-0.94-security/target/surefire/surefire8031146903040991567tmp
/x1/jenkins/jenkins-slave/workspace/HBase-0.94-security/target/surefire/surefire_139856213177729081263tmp
Running org.apache.hadoop.hbase.io.hfile.slab.TestSlabCache
Tests run: 7, Failures: 0, Errors: 0, Skipped: 0, Time elapsed: 17.372 sec
Forking command line: /bin/sh -c cd /x1/jenkins/jenkins-slave/workspace/HBase-0.94-security
&& /x1/jenkins/tools/java/jdk1.6.0_45-32/jre/bin/java -enableassertions -Xmx1900m
-Djava.security.egd=file:/dev/./urandom -jar /x1/jenkins/jenkins-slave/workspace/HBase-0.94-security/target/surefire/surefirebooter2123397311394052149.jar
/x1/jenkins/jenkins-slave/workspace/HBase-0.94-security/target/surefire/surefire5136465484960975238tmp
/x1/jenkins/jenkins-slave/workspace/HBase-0.94-security/target/surefire/surefire_1407648239016893014044tmp
Running org.apache.hadoop.hbase.io.hfile.TestHFileBlock
Tests run: 16, Failures: 0, Errors: 0, Skipped: 0, Time elapsed: 50.926 sec
Forking command line: /bin/sh -c cd /x1/jenkins/jenkins-slave/workspace/HBase-0.94-security
&& /x1/jenkins/tools/java/jdk1.6.0_45-32/jre/bin/java -enableassertions -Xmx1900m
-Djava.security.egd=file:/dev/./urandom -jar /x1/jenkins/jenkins-slave/workspace/HBase-0.94-security/target/surefire/surefirebooter6840686305707734701.jar
/x1/jenkins/jenkins-slave/workspace/HBase-0.94-security/target/surefire/surefire5334427819854702359tmp
/x1/jenkins/jenkins-slave/workspace/HBase-0.94-security/target/surefire/surefire_141636427458125208019tmp
Running org.apache.hadoop.hbase.io.hfile.slab.TestSingleSizeCache
Tests run: 5, Failures: 0, Errors: 0, Skipped: 0, Time elapsed: 21.832 sec
Forking command line: /bin/sh -c cd /x1/jenkins/jenkins-slave/workspace/HBase-0.94-security
&& /x1/jenkins/tools/java/jdk1.6.0_45-32/jre/bin/java -enableassertions -Xmx1900m
-Djava.security.egd=file:/dev/./urandom -jar /x1/jenkins/jenkins-slave/workspace/HBase-0.94-security/target/surefire/surefirebooter3211031902484376285.jar
/x1/jenkins/jenkins-slave/workspace/HBase-0.94-security/target/surefire/surefire7768082848265487403tmp
/x1/jenkins/jenkins-slave/workspace/HBase-0.94-security/target/surefire/surefire_1425086830401958930014tmp
Running org.apache.hadoop.hbase.io.TestFileLink
Tests run: 3, Failures: 0, Errors: 0, Skipped: 0, Time elapsed: 21.405 sec
Forking command line: /bin/sh -c cd /x1/jenkins/jenkins-slave/workspace/HBase-0.94-security
&& /x1/jenkins/tools/java/jdk1.6.0_45-32/jre/bin/java -enableassertions -Xmx1900m
-Djava.security.egd=file:/dev/./urandom -jar /x1/jenkins/jenkins-slave/workspace/HBase-0.94-security/target/surefire/surefirebooter8096760014853865348.jar
/x1/jenkins/jenkins-slave/workspace/HBase-0.94-security/target/surefire/surefire6171764783938898932tmp
/x1/jenkins/jenkins-slave/workspace/HBase-0.94-security/target/surefire/surefire_1434296139243375619221tmp
Running org.apache.hadoop.hbase.replication.TestReplicationZookeeper
Tests run: 1, Failures: 0, Errors: 0, Skipped: 0, Time elapsed: 0.923 sec
Forking command line: /bin/sh -c cd /x1/jenkins/jenkins-slave/workspace/HBase-0.94-security
&& /x1/jenkins/tools/java/jdk1.6.0_45-32/jre/bin/java -enableassertions -Xmx1900m
-Djava.security.egd=file:/dev/./urandom -jar /x1/jenkins/jenkins-slave/workspace/HBase-0.94-security/target/surefire/surefirebooter6612690345260044.jar
/x1/jenkins/jenkins-slave/workspace/HBase-0.94-security/target/surefire/surefire2551842373737018129tmp
/x1/jenkins/jenkins-slave/workspace/HBase-0.94-security/target/surefire/surefire_1442429757463620308711tmp
Running org.apache.hadoop.hbase.io.encoding.TestLoadAndSwitchEncodeOnDisk
Tests run: 1, Failures: 0, Errors: 0, Skipped: 0, Time elapsed: 34.049 sec
Forking command line: /bin/sh -c cd /x1/jenkins/jenkins-slave/workspace/HBase-0.94-security
&& /x1/jenkins/tools/java/jdk1.6.0_45-32/jre/bin/java -enableassertions -Xmx1900m
-Djava.security.egd=file:/dev/./urandom -jar /x1/jenkins/jenkins-slave/workspace/HBase-0.94-security/target/surefire/surefirebooter478066621508729246.jar
/x1/jenkins/jenkins-slave/workspace/HBase-0.94-security/target/surefire/surefire6060194222191093687tmp
/x1/jenkins/jenkins-slave/workspace/HBase-0.94-security/target/surefire/surefire_1452135165212555583966tmp
Running org.apache.hadoop.hbase.replication.regionserver.TestReplicationSourceManager
Tests run: 3, Failures: 0, Errors: 0, Skipped: 0, Time elapsed: 2.857 sec
Forking command line: /bin/sh -c cd /x1/jenkins/jenkins-slave/workspace/HBase-0.94-security
&& /x1/jenkins/tools/java/jdk1.6.0_45-32/jre/bin/java -enableassertions -Xmx1900m
-Djava.security.egd=file:/dev/./urandom -jar /x1/jenkins/jenkins-slave/workspace/HBase-0.94-security/target/surefire/surefirebooter2540999924256871756.jar
/x1/jenkins/jenkins-slave/workspace/HBase-0.94-security/target/surefire/surefire1816585883779341571tmp
/x1/jenkins/jenkins-slave/workspace/HBase-0.94-security/target/surefire/surefire_1467030483051537587147tmp
Running org.apache.hadoop.hbase.replication.TestReplicationSource
Tests run: 1, Failures: 0, Errors: 0, Skipped: 0, Time elapsed: 5.426 sec
Forking command line: /bin/sh -c cd /x1/jenkins/jenkins-slave/workspace/HBase-0.94-security
&& /x1/jenkins/tools/java/jdk1.6.0_45-32/jre/bin/java -enableassertions -Xmx1900m
-Djava.security.egd=file:/dev/./urandom -jar /x1/jenkins/jenkins-slave/workspace/HBase-0.94-security/target/surefire/surefirebooter3459306125240586019.jar
/x1/jenkins/jenkins-slave/workspace/HBase-0.94-security/target/surefire/surefire8230432054006912823tmp
/x1/jenkins/jenkins-slave/workspace/HBase-0.94-security/target/surefire/surefire_147798820694294498910tmp
Running org.apache.hadoop.hbase.util.TestFSTableDescriptors
Tests run: 11, Failures: 0, Errors: 0, Skipped: 0, Time elapsed: 0.885 sec
Forking command line: /bin/sh -c cd /x1/jenkins/jenkins-slave/workspace/HBase-0.94-security
&& /x1/jenkins/tools/java/jdk1.6.0_45-32/jre/bin/java -enableassertions -Xmx1900m
-Djava.security.egd=file:/dev/./urandom -jar /x1/jenkins/jenkins-slave/workspace/HBase-0.94-security/target/surefire/surefirebooter1232657157685847324.jar
/x1/jenkins/jenkins-slave/workspace/HBase-0.94-security/target/surefire/surefire3467113066674867921tmp
/x1/jenkins/jenkins-slave/workspace/HBase-0.94-security/target/surefire/surefire_1481757879811475391853tmp
Running org.apache.hadoop.hbase.replication.regionserver.TestReplicationSink
Tests run: 5, Failures: 0, Errors: 0, Skipped: 0, Time elapsed: 23.44 sec
Forking command line: /bin/sh -c cd /x1/jenkins/jenkins-slave/workspace/HBase-0.94-security
&& /x1/jenkins/tools/java/jdk1.6.0_45-32/jre/bin/java -enableassertions -Xmx1900m
-Djava.security.egd=file:/dev/./urandom -jar /x1/jenkins/jenkins-slave/workspace/HBase-0.94-security/target/surefire/surefirebooter4834316149516045244.jar
/x1/jenkins/jenkins-slave/workspace/HBase-0.94-security/target/surefire/surefire6553142946045622795tmp
/x1/jenkins/jenkins-slave/workspace/HBase-0.94-security/target/surefire/surefire_1491501851657715394014tmp
Running org.apache.hadoop.hbase.util.TestEnvironmentEdgeManager
Tests run: 2, Failures: 0, Errors: 0, Skipped: 0, Time elapsed: 0.394 sec
Forking command line: /bin/sh -c cd /x1/jenkins/jenkins-slave/workspace/HBase-0.94-security
&& /x1/jenkins/tools/java/jdk1.6.0_45-32/jre/bin/java -enableassertions -Xmx1900m
-Djava.security.egd=file:/dev/./urandom -jar /x1/jenkins/jenkins-slave/workspace/HBase-0.94-security/target/surefire/surefirebooter7503021792707029366.jar
/x1/jenkins/jenkins-slave/workspace/HBase-0.94-security/target/surefire/surefire1978722854075114402tmp
/x1/jenkins/jenkins-slave/workspace/HBase-0.94-security/target/surefire/surefire_1505901928893400834880tmp
Running org.apache.hadoop.hbase.util.TestIdLock
Tests run: 1, Failures: 0, Errors: 0, Skipped: 0, Time elapsed: 15.467 sec
Forking command line: /bin/sh -c cd /x1/jenkins/jenkins-slave/workspace/HBase-0.94-security
&& /x1/jenkins/tools/java/jdk1.6.0_45-32/jre/bin/java -enableassertions -Xmx1900m
-Djava.security.egd=file:/dev/./urandom -jar /x1/jenkins/jenkins-slave/workspace/HBase-0.94-security/target/surefire/surefirebooter7954907531465654502.jar
/x1/jenkins/jenkins-slave/workspace/HBase-0.94-security/target/surefire/surefire8450849224902617900tmp
/x1/jenkins/jenkins-slave/workspace/HBase-0.94-security/target/surefire/surefire_15164545182030544463tmp
Running org.apache.hadoop.hbase.util.TestMergeTable
Tests run: 1, Failures: 0, Errors: 0, Skipped: 0, Time elapsed: 35.303 sec
Forking command line: /bin/sh -c cd /x1/jenkins/jenkins-slave/workspace/HBase-0.94-security
&& /x1/jenkins/tools/java/jdk1.6.0_45-32/jre/bin/java -enableassertions -Xmx1900m
-Djava.security.egd=file:/dev/./urandom -jar /x1/jenkins/jenkins-slave/workspace/HBase-0.94-security/target/surefire/surefirebooter8310535978565312226.jar
/x1/jenkins/jenkins-slave/workspace/HBase-0.94-security/target/surefire/surefire3127531251446257969tmp
/x1/jenkins/jenkins-slave/workspace/HBase-0.94-security/target/surefire/surefire_1523990187524329152295tmp
Running org.apache.hadoop.hbase.util.TestPoolMap$TestRoundRobinPoolType
Tests run: 3, Failures: 0, Errors: 0, Skipped: 0, Time elapsed: 0.01 sec
Running org.apache.hadoop.hbase.util.TestPoolMap$TestThreadLocalPoolType
Tests run: 3, Failures: 0, Errors: 0, Skipped: 0, Time elapsed: 0.006 sec
Running org.apache.hadoop.hbase.util.TestPoolMap$TestReusablePoolType
Tests run: 3, Failures: 0, Errors: 0, Skipped: 0, Time elapsed: 0.035 sec
Forking command line: /bin/sh -c cd /x1/jenkins/jenkins-slave/workspace/HBase-0.94-security
&& /x1/jenkins/tools/java/jdk1.6.0_45-32/jre/bin/java -enableassertions -Xmx1900m
-Djava.security.egd=file:/dev/./urandom -jar /x1/jenkins/jenkins-slave/workspace/HBase-0.94-security/target/surefire/surefirebooter1139710181158221659.jar
/x1/jenkins/jenkins-slave/workspace/HBase-0.94-security/target/surefire/surefire8437381380871524091tmp
/x1/jenkins/jenkins-slave/workspace/HBase-0.94-security/target/surefire/surefire_153780842745806923069tmp
Running org.apache.hadoop.hbase.util.TestFSUtils
Tests run: 4, Failures: 0, Errors: 0, Skipped: 0, Time elapsed: 36.355 sec
Forking command line: /bin/sh -c cd /x1/jenkins/jenkins-slave/workspace/HBase-0.94-security
&& /x1/jenkins/tools/java/jdk1.6.0_45-32/jre/bin/java -enableassertions -Xmx1900m
-Djava.security.egd=file:/dev/./urandom -jar /x1/jenkins/jenkins-slave/workspace/HBase-0.94-security/target/surefire/surefirebooter5390229622099122420.jar
/x1/jenkins/jenkins-slave/workspace/HBase-0.94-security/target/surefire/surefire5657162269116941968tmp
/x1/jenkins/jenkins-slave/workspace/HBase-0.94-security/target/surefire/surefire_1542944456939140128049tmp
Running org.apache.hadoop.hbase.util.TestRegionSplitter
Tests run: 5, Failures: 0, Errors: 0, Skipped: 0, Time elapsed: 25.16 sec
Forking command line: /bin/sh -c cd /x1/jenkins/jenkins-slave/workspace/HBase-0.94-security
&& /x1/jenkins/tools/java/jdk1.6.0_45-32/jre/bin/java -enableassertions -Xmx1900m
-Djava.security.egd=file:/dev/./urandom -jar /x1/jenkins/jenkins-slave/workspace/HBase-0.94-security/target/surefire/surefirebooter3648264795488719290.jar
/x1/jenkins/jenkins-slave/workspace/HBase-0.94-security/target/surefire/surefire6471379506560180859tmp
/x1/jenkins/jenkins-slave/workspace/HBase-0.94-security/target/surefire/surefire_1554680651001683633687tmp
Running org.apache.hadoop.hbase.util.TestFSVisitor
Tests run: 3, Failures: 0, Errors: 0, Skipped: 0, Time elapsed: 1.542 sec
Forking command line: /bin/sh -c cd /x1/jenkins/jenkins-slave/workspace/HBase-0.94-security
&& /x1/jenkins/tools/java/jdk1.6.0_45-32/jre/bin/java -enableassertions -Xmx1900m
-Djava.security.egd=file:/dev/./urandom -jar /x1/jenkins/jenkins-slave/workspace/HBase-0.94-security/target/surefire/surefirebooter4007345253687336832.jar
/x1/jenkins/jenkins-slave/workspace/HBase-0.94-security/target/surefire/surefire1209906958601634474tmp
/x1/jenkins/jenkins-slave/workspace/HBase-0.94-security/target/surefire/surefire_1568761154993687107719tmp
Running org.apache.hadoop.hbase.util.TestCoprocessorScanPolicy
Tests run: 2, Failures: 0, Errors: 0, Skipped: 0, Time elapsed: 23.263 sec
Forking command line: /bin/sh -c cd /x1/jenkins/jenkins-slave/workspace/HBase-0.94-security
&& /x1/jenkins/tools/java/jdk1.6.0_45-32/jre/bin/java -enableassertions -Xmx1900m
-Djava.security.egd=file:/dev/./urandom -jar /x1/jenkins/jenkins-slave/workspace/HBase-0.94-security/target/surefire/surefirebooter4380816010343383542.jar
/x1/jenkins/jenkins-slave/workspace/HBase-0.94-security/target/surefire/surefire7193406656165222153tmp
/x1/jenkins/jenkins-slave/workspace/HBase-0.94-security/target/surefire/surefire_1578579197410403989697tmp
Running org.apache.hadoop.hbase.util.hbck.TestOfflineMetaRebuildBase
Tests run: 1, Failures: 0, Errors: 0, Skipped: 0, Time elapsed: 37.161 sec
Forking command line: /bin/sh -c cd /x1/jenkins/jenkins-slave/workspace/HBase-0.94-security
&& /x1/jenkins/tools/java/jdk1.6.0_45-32/jre/bin/java -enableassertions -Xmx1900m
-Djava.security.egd=file:/dev/./urandom -jar /x1/jenkins/jenkins-slave/workspace/HBase-0.94-security/target/surefire/surefirebooter4462550193434131618.jar
/x1/jenkins/jenkins-slave/workspace/HBase-0.94-security/target/surefire/surefire4351876574584124396tmp
/x1/jenkins/jenkins-slave/workspace/HBase-0.94-security/target/surefire/surefire_1583051977281412759394tmp
Running org.apache.hadoop.hbase.util.hbck.TestOfflineMetaRebuildOverlap
Tests run: 1, Failures: 0, Errors: 0, Skipped: 0, Time elapsed: 34.516 sec
Forking command line: /bin/sh -c cd /x1/jenkins/jenkins-slave/workspace/HBase-0.94-security
&& /x1/jenkins/tools/java/jdk1.6.0_45-32/jre/bin/java -enableassertions -Xmx1900m
-Djava.security.egd=file:/dev/./urandom -jar /x1/jenkins/jenkins-slave/workspace/HBase-0.94-security/target/surefire/surefirebooter7760975574678958941.jar
/x1/jenkins/jenkins-slave/workspace/HBase-0.94-security/target/surefire/surefire1355122853630797546tmp
/x1/jenkins/jenkins-slave/workspace/HBase-0.94-security/target/surefire/surefire_159677110397499846965tmp
Running org.apache.hadoop.hbase.util.TestDefaultEnvironmentEdge
Tests run: 1, Failures: 0, Errors: 0, Skipped: 0, Time elapsed: 0.247 sec
Forking command line: /bin/sh -c cd /x1/jenkins/jenkins-slave/workspace/HBase-0.94-security
&& /x1/jenkins/tools/java/jdk1.6.0_45-32/jre/bin/java -enableassertions -Xmx1900m
-Djava.security.egd=file:/dev/./urandom -jar /x1/jenkins/jenkins-slave/workspace/HBase-0.94-security/target/surefire/surefirebooter4979620492774072844.jar
/x1/jenkins/jenkins-slave/workspace/HBase-0.94-security/target/surefire/surefire6652307567618242069tmp
/x1/jenkins/jenkins-slave/workspace/HBase-0.94-security/target/surefire/surefire_160866070393475396567tmp
Running org.apache.hadoop.hbase.util.TestFSHDFSUtils
Tests run: 3, Failures: 0, Errors: 0, Skipped: 0, Time elapsed: 3.899 sec
Forking command line: /bin/sh -c cd /x1/jenkins/jenkins-slave/workspace/HBase-0.94-security
&& /x1/jenkins/tools/java/jdk1.6.0_45-32/jre/bin/java -enableassertions -Xmx1900m
-Djava.security.egd=file:/dev/./urandom -jar /x1/jenkins/jenkins-slave/workspace/HBase-0.94-security/target/surefire/surefirebooter8525908624124097449.jar
/x1/jenkins/jenkins-slave/workspace/HBase-0.94-security/target/surefire/surefire205279999343807675tmp
/x1/jenkins/jenkins-slave/workspace/HBase-0.94-security/target/surefire/surefire_1615789749053706584956tmp
Running org.apache.hadoop.hbase.util.hbck.TestOfflineMetaRebuildHole
Tests run: 1, Failures: 0, Errors: 0, Skipped: 0, Time elapsed: 33.582 sec
Forking command line: /bin/sh -c cd /x1/jenkins/jenkins-slave/workspace/HBase-0.94-security
&& /x1/jenkins/tools/java/jdk1.6.0_45-32/jre/bin/java -enableassertions -Xmx1900m
-Djava.security.egd=file:/dev/./urandom -jar /x1/jenkins/jenkins-slave/workspace/HBase-0.94-security/target/surefire/surefirebooter6268899520381256284.jar
/x1/jenkins/jenkins-slave/workspace/HBase-0.94-security/target/surefire/surefire4795009577362869634tmp
/x1/jenkins/jenkins-slave/workspace/HBase-0.94-security/target/surefire/surefire_1626191446683457902278tmp
Running org.apache.hadoop.hbase.TestInfoServers
Tests run: 3, Failures: 0, Errors: 0, Skipped: 0, Time elapsed: 18.729 sec
Running org.apache.hadoop.hbase.util.TestSizeBasedThrottler
Tests run: 3, Failures: 0, Errors: 0, Skipped: 0, Time elapsed: 55.089 sec

Results :

Tests run: 930, Failures: 0, Errors: 0, Skipped: 2

[INFO] ------------------------------------------------------------------------
[INFO] BUILD FAILURE
[INFO] ------------------------------------------------------------------------
[INFO] Total time: 58:43.263s
[INFO] Finished at: Tue Oct 07 08:18:09 UTC 2014
[INFO] Final Memory: 64M/723M
[INFO] ------------------------------------------------------------------------
[ERROR] Failed to execute goal org.apache.maven.plugins:maven-surefire-plugin:2.12-TRUNK-HBASE-2:test
(secondPartTestsExecution) on project hbase: Failure or timeout -> [Help 1]
org.apache.maven.lifecycle.LifecycleExecutionException: Failed to execute goal org.apache.maven.plugins:maven-surefire-plugin:2.12-TRUNK-HBASE-2:test
(secondPartTestsExecution) on project hbase: Failure or timeout
	at org.apache.maven.lifecycle.internal.MojoExecutor.execute(MojoExecutor.java:217)
	at org.apache.maven.lifecycle.internal.MojoExecutor.execute(MojoExecutor.java:153)
	at org.apache.maven.lifecycle.internal.MojoExecutor.execute(MojoExecutor.java:145)
	at org.apache.maven.lifecycle.internal.MojoExecutor.executeForkedExecutions(MojoExecutor.java:365)
	at org.apache.maven.lifecycle.internal.MojoExecutor.execute(MojoExecutor.java:199)
	at org.apache.maven.lifecycle.internal.MojoExecutor.execute(MojoExecutor.java:153)
	at org.apache.maven.lifecycle.internal.MojoExecutor.execute(MojoExecutor.java:145)
	at org.apache.maven.lifecycle.internal.LifecycleModuleBuilder.buildProject(LifecycleModuleBuilder.java:84)
	at org.apache.maven.lifecycle.internal.LifecycleModuleBuilder.buildProject(LifecycleModuleBuilder.java:59)
	at org.apache.maven.lifecycle.internal.LifecycleStarter.singleThreadedBuild(LifecycleStarter.java:183)
	at org.apache.maven.lifecycle.internal.LifecycleStarter.execute(LifecycleStarter.java:161)
	at org.apache.maven.DefaultMaven.doExecute(DefaultMaven.java:320)
	at org.apache.maven.DefaultMaven.execute(DefaultMaven.java:156)
	at org.apache.maven.cli.MavenCli.execute(MavenCli.java:537)
	at org.apache.maven.cli.MavenCli.doMain(MavenCli.java:196)
	at org.apache.maven.cli.MavenCli.main(MavenCli.java:141)
	at sun.reflect.NativeMethodAccessorImpl.invoke0(Native Method)
	at sun.reflect.NativeMethodAccessorImpl.invoke(NativeMethodAccessorImpl.java:39)
	at sun.reflect.DelegatingMethodAccessorImpl.invoke(DelegatingMethodAccessorImpl.java:25)
	at java.lang.reflect.Method.invoke(Method.java:597)
	at org.codehaus.plexus.classworlds.launcher.Launcher.launchEnhanced(Launcher.java:290)
	at org.codehaus.plexus.classworlds.launcher.Launcher.launch(Launcher.java:230)
	at org.codehaus.plexus.classworlds.launcher.Launcher.mainWithExitCode(Launcher.java:409)
	at org.codehaus.plexus.classworlds.launcher.Launcher.main(Launcher.java:352)
Caused by: org.apache.maven.plugin.MojoExecutionException: Failure or timeout
	at org.apache.maven.plugin.surefire.SurefirePlugin.assertNoFailureOrTimeout(SurefirePlugin.java:643)
	at org.apache.maven.plugin.surefire.SurefirePlugin.handleSummary(SurefirePlugin.java:624)
	at org.apache.maven.plugin.surefire.AbstractSurefireMojo.executeAfterPreconditionsChecked(AbstractSurefireMojo.java:137)
	at org.apache.maven.plugin.surefire.AbstractSurefireMojo.execute(AbstractSurefireMojo.java:98)
	at org.apache.maven.plugin.DefaultBuildPluginManager.executeMojo(DefaultBuildPluginManager.java:101)
	at org.apache.maven.lifecycle.internal.MojoExecutor.execute(MojoExecutor.java:209)
	... 23 more
[ERROR] 
[ERROR] 
[ERROR] For more information about the errors and possible solutions, please read the following
articles:
[ERROR] [Help 1] http://cwiki.apache.org/confluence/display/MAVEN/MojoExecutionException
Build step 'Invoke top-level Maven targets' marked build as failure
Archiving artifacts
Sending artifact delta relative to HBase-0.94-security #545
Archived 957 artifacts
Archive block size is 32768
Received 45 blocks and 118365368 bytes
Compression is 1.2%
Took 47 sec
Updating HBASE-12039
Recording test results

Mime
View raw message