hbase-builds mailing list archives

Site index · List index
Message view « Date » · « Thread »
Top « Date » · « Thread »
From Apache Jenkins Server <jenk...@builds.apache.org>
Subject Build failed in Jenkins: HBase-0.98-on-Hadoop-1.1 #597
Date Wed, 22 Oct 2014 20:49:02 GMT
See <https://builds.apache.org/job/HBase-0.98-on-Hadoop-1.1/597/changes>

Changes:

[tedyu] HBASE-12306 CellCounter output's wrong value for Total Families Across all Rows in
output file (Ashish Singhi)

------------------------------------------
[...truncated 1607 lines...]
Tests run: 8, Failures: 0, Errors: 0, Skipped: 0, Time elapsed: 26.078 sec
Running org.apache.hadoop.hbase.coprocessor.TestRegionServerObserver
Tests run: 1, Failures: 0, Errors: 0, Skipped: 0, Time elapsed: 14.583 sec
Running org.apache.hadoop.hbase.coprocessor.TestRegionServerCoprocessorEndpoint
Tests run: 1, Failures: 0, Errors: 0, Skipped: 0, Time elapsed: 10.221 sec
Running org.apache.hadoop.hbase.coprocessor.TestMasterCoprocessorExceptionWithAbort
Tests run: 1, Failures: 0, Errors: 0, Skipped: 0, Time elapsed: 26.861 sec
Running org.apache.hadoop.hbase.coprocessor.TestWALObserver
Tests run: 3, Failures: 0, Errors: 0, Skipped: 0, Time elapsed: 19.732 sec
Running org.apache.hadoop.hbase.coprocessor.TestRegionServerCoprocessorExceptionWithRemove
Tests run: 1, Failures: 0, Errors: 0, Skipped: 0, Time elapsed: 23.548 sec
Running org.apache.hadoop.hbase.coprocessor.TestDoubleColumnInterpreter
Tests run: 38, Failures: 0, Errors: 0, Skipped: 0, Time elapsed: 13.938 sec
Running org.apache.hadoop.hbase.coprocessor.TestMasterObserver
Tests run: 6, Failures: 0, Errors: 0, Skipped: 0, Time elapsed: 24.557 sec
Running org.apache.hadoop.hbase.coprocessor.TestCoprocessorEndpoint
Tests run: 6, Failures: 0, Errors: 0, Skipped: 0, Time elapsed: 12.24 sec
Running org.apache.hadoop.hbase.coprocessor.TestRegionServerCoprocessorExceptionWithAbort
Tests run: 2, Failures: 0, Errors: 0, Skipped: 0, Time elapsed: 23.218 sec
Running org.apache.hadoop.hbase.coprocessor.TestMasterCoprocessorExceptionWithRemove
Tests run: 1, Failures: 0, Errors: 0, Skipped: 0, Time elapsed: 13.652 sec
Running org.apache.hadoop.hbase.coprocessor.TestBatchCoprocessorEndpoint
Tests run: 4, Failures: 0, Errors: 0, Skipped: 0, Time elapsed: 11.941 sec
Running org.apache.hadoop.hbase.coprocessor.TestRowProcessorEndpoint
Tests run: 4, Failures: 0, Errors: 0, Skipped: 0, Time elapsed: 17.479 sec
Running org.apache.hadoop.hbase.coprocessor.TestOpenTableInCoprocessor
Tests run: 2, Failures: 0, Errors: 0, Skipped: 0, Time elapsed: 16.707 sec
Running org.apache.hadoop.hbase.coprocessor.TestBigDecimalColumnInterpreter
Tests run: 38, Failures: 0, Errors: 0, Skipped: 0, Time elapsed: 13.512 sec
Running org.apache.hadoop.hbase.coprocessor.TestRegionObserverInterface
Tests run: 12, Failures: 0, Errors: 0, Skipped: 0, Time elapsed: 52.205 sec
Running org.apache.hadoop.hbase.coprocessor.TestCoprocessorStop
Tests run: 1, Failures: 0, Errors: 0, Skipped: 0, Time elapsed: 26.247 sec
Running org.apache.hadoop.hbase.coprocessor.TestAggregateProtocol
Tests run: 44, Failures: 0, Errors: 0, Skipped: 0, Time elapsed: 14.771 sec
Running org.apache.hadoop.hbase.coprocessor.TestRegionObserverBypass
Tests run: 2, Failures: 0, Errors: 0, Skipped: 0, Time elapsed: 11.782 sec
Running org.apache.hadoop.hbase.coprocessor.TestHTableWrapper
Tests run: 1, Failures: 0, Errors: 0, Skipped: 0, Time elapsed: 11.67 sec
Running org.apache.hadoop.hbase.backup.example.TestZooKeeperTableArchiveClient
Tests run: 3, Failures: 0, Errors: 0, Skipped: 0, Time elapsed: 4.208 sec
Running org.apache.hadoop.hbase.regionserver.TestHRegionServerBulkLoad
Tests run: 1, Failures: 0, Errors: 0, Skipped: 0, Time elapsed: 43.52 sec
Running org.apache.hadoop.hbase.regionserver.TestRegionFavoredNodes
Tests run: 1, Failures: 0, Errors: 0, Skipped: 1, Time elapsed: 0.486 sec
Running org.apache.hadoop.hbase.regionserver.TestReversibleScanners
Tests run: 5, Failures: 0, Errors: 0, Skipped: 0, Time elapsed: 3.262 sec
Running org.apache.hadoop.hbase.regionserver.TestEndToEndSplitTransaction
Tests run: 2, Failures: 0, Errors: 0, Skipped: 0, Time elapsed: 33.301 sec
Running org.apache.hadoop.hbase.backup.TestHFileArchiving
Tests run: 5, Failures: 0, Errors: 0, Skipped: 0, Time elapsed: 104.225 sec
Running org.apache.hadoop.hbase.regionserver.TestRegionServerNoMaster
Tests run: 9, Failures: 0, Errors: 0, Skipped: 0, Time elapsed: 27.611 sec
Running org.apache.hadoop.hbase.regionserver.TestMajorCompaction
Tests run: 7, Failures: 0, Errors: 0, Skipped: 0, Time elapsed: 24.383 sec
Running org.apache.hadoop.hbase.regionserver.TestClusterId
Tests run: 2, Failures: 0, Errors: 0, Skipped: 0, Time elapsed: 35.29 sec
Running org.apache.hadoop.hbase.regionserver.TestEncryptionKeyRotation
Tests run: 2, Failures: 0, Errors: 0, Skipped: 0, Time elapsed: 23.757 sec
Running org.apache.hadoop.hbase.regionserver.TestPriorityRpc
Tests run: 3, Failures: 0, Errors: 0, Skipped: 0, Time elapsed: 1.418 sec
Running org.apache.hadoop.hbase.regionserver.TestServerCustomProtocol
Tests run: 7, Failures: 0, Errors: 0, Skipped: 0, Time elapsed: 27.778 sec
Running org.apache.hadoop.hbase.regionserver.TestBlocksRead
Tests run: 4, Failures: 0, Errors: 0, Skipped: 0, Time elapsed: 1.571 sec
Running org.apache.hadoop.hbase.regionserver.TestSplitLogWorker
Tests run: 7, Failures: 0, Errors: 0, Skipped: 0, Time elapsed: 23.972 sec
Running org.apache.hadoop.hbase.regionserver.TestZKLessMergeOnCluster
Tests run: 3, Failures: 0, Errors: 0, Skipped: 0, Time elapsed: 22.8 sec
Running org.apache.hadoop.hbase.regionserver.TestJoinedScanners
Tests run: 1, Failures: 0, Errors: 0, Skipped: 0, Time elapsed: 35.805 sec
Running org.apache.hadoop.hbase.regionserver.TestZKLessSplitOnCluster
Tests run: 12, Failures: 0, Errors: 0, Skipped: 0, Time elapsed: 46.005 sec
Running org.apache.hadoop.hbase.regionserver.TestMinorCompaction
Tests run: 6, Failures: 0, Errors: 0, Skipped: 0, Time elapsed: 2.543 sec
Running org.apache.hadoop.hbase.regionserver.TestRegionServerMetrics
Tests run: 9, Failures: 0, Errors: 0, Skipped: 0, Time elapsed: 19.711 sec
Running org.apache.hadoop.hbase.regionserver.TestTags
Tests run: 4, Failures: 0, Errors: 0, Skipped: 0, Time elapsed: 16.99 sec
Running org.apache.hadoop.hbase.regionserver.TestHRegionOnCluster
Tests run: 1, Failures: 0, Errors: 0, Skipped: 0, Time elapsed: 13.111 sec
Running org.apache.hadoop.hbase.regionserver.TestSCVFWithMiniCluster
Tests run: 5, Failures: 0, Errors: 0, Skipped: 0, Time elapsed: 6.841 sec
Running org.apache.hadoop.hbase.regionserver.TestSeekOptimizations
Tests run: 6, Failures: 0, Errors: 0, Skipped: 0, Time elapsed: 3.265 sec
Running org.apache.hadoop.hbase.regionserver.TestCompactionWithCoprocessor
Tests run: 5, Failures: 0, Errors: 0, Skipped: 0, Time elapsed: 9.128 sec
Running org.apache.hadoop.hbase.regionserver.TestStoreScanner
Tests run: 16, Failures: 0, Errors: 0, Skipped: 0, Time elapsed: 0.682 sec
Running org.apache.hadoop.hbase.regionserver.TestCacheOnWriteInSchema
Tests run: 3, Failures: 0, Errors: 0, Skipped: 0, Time elapsed: 2.13 sec
Running org.apache.hadoop.hbase.regionserver.TestCompactionState
Tests run: 5, Failures: 0, Errors: 0, Skipped: 0, Time elapsed: 73.788 sec
Running org.apache.hadoop.hbase.regionserver.wal.TestReadOldRootAndMetaEdits
Tests run: 1, Failures: 0, Errors: 0, Skipped: 0, Time elapsed: 1.053 sec
Running org.apache.hadoop.hbase.regionserver.wal.TestWALReplayCompressed
Tests run: 9, Failures: 0, Errors: 0, Skipped: 0, Time elapsed: 66.777 sec
Running org.apache.hadoop.hbase.regionserver.wal.TestHLogFiltering
Tests run: 1, Failures: 0, Errors: 0, Skipped: 0, Time elapsed: 26.264 sec
Running org.apache.hadoop.hbase.regionserver.wal.TestHLogSplitCompressed
Tests run: 33, Failures: 0, Errors: 0, Skipped: 1, Time elapsed: 158.489 sec
Running org.apache.hadoop.hbase.regionserver.wal.TestSecureWALReplay
Tests run: 9, Failures: 0, Errors: 0, Skipped: 0, Time elapsed: 67.031 sec
Running org.apache.hadoop.hbase.regionserver.wal.TestWALReplay
Tests run: 9, Failures: 0, Errors: 0, Skipped: 0, Time elapsed: 67.89 sec
Running org.apache.hadoop.hbase.regionserver.wal.TestHLogReaderOnSecureHLog
Tests run: 2, Failures: 0, Errors: 0, Skipped: 0, Time elapsed: 1.742 sec
Running org.apache.hadoop.hbase.regionserver.wal.TestSecureHLog
Tests run: 1, Failures: 0, Errors: 0, Skipped: 0, Time elapsed: 1.409 sec
Running org.apache.hadoop.hbase.regionserver.wal.TestLogRollAbort
Tests run: 1, Failures: 0, Errors: 0, Skipped: 0, Time elapsed: 162.164 sec
Running org.apache.hadoop.hbase.regionserver.wal.TestHLogSplit
Tests run: 33, Failures: 0, Errors: 0, Skipped: 1, Time elapsed: 167.561 sec
Running org.apache.hadoop.hbase.regionserver.wal.TestDurability
Tests run: 2, Failures: 0, Errors: 0, Skipped: 0, Time elapsed: 5.583 sec
Running org.apache.hadoop.hbase.regionserver.wal.TestLogRollPeriod
Tests run: 2, Failures: 0, Errors: 0, Skipped: 0, Time elapsed: 60.962 sec
Running org.apache.hadoop.hbase.regionserver.wal.TestHLog
Tests run: 17, Failures: 0, Errors: 0, Skipped: 0, Time elapsed: 72.85 sec
Running org.apache.hadoop.hbase.regionserver.TestScannerWithBulkload
Tests run: 3, Failures: 0, Errors: 0, Skipped: 0, Time elapsed: 20.26 sec
Running org.apache.hadoop.hbase.regionserver.TestEncryptionRandomKeying
Tests run: 1, Failures: 0, Errors: 0, Skipped: 0, Time elapsed: 11.454 sec
Running org.apache.hadoop.hbase.regionserver.handler.TestOpenRegionHandler
Tests run: 6, Failures: 0, Errors: 0, Skipped: 0, Time elapsed: 1.84 sec
Running org.apache.hadoop.hbase.regionserver.handler.TestCloseRegionHandler
Tests run: 3, Failures: 0, Errors: 0, Skipped: 0, Time elapsed: 1.856 sec
Running org.apache.hadoop.hbase.regionserver.TestMasterAddressTracker
Tests run: 1, Failures: 0, Errors: 0, Skipped: 0, Time elapsed: 1.007 sec
Running org.apache.hadoop.hbase.regionserver.TestMemStore
Tests run: 23, Failures: 0, Errors: 0, Skipped: 0, Time elapsed: 41.615 sec
Running org.apache.hadoop.hbase.regionserver.TestSplitTransactionOnCluster
Tests run: 12, Failures: 0, Errors: 0, Skipped: 0, Time elapsed: 51.39 sec
Running org.apache.hadoop.hbase.regionserver.TestParallelPut
Tests run: 2, Failures: 0, Errors: 0, Skipped: 0, Time elapsed: 4.724 sec
Running org.apache.hadoop.hbase.regionserver.TestCompaction
Tests run: 5, Failures: 0, Errors: 0, Skipped: 0, Time elapsed: 8.841 sec
Running org.apache.hadoop.hbase.regionserver.TestRegionMergeTransactionOnCluster
Tests run: 3, Failures: 0, Errors: 0, Skipped: 0, Time elapsed: 23.398 sec
Running org.apache.hadoop.hbase.regionserver.TestGetClosestAtOrBefore
Tests run: 3, Failures: 0, Errors: 0, Skipped: 0, Time elapsed: 1.583 sec
Running org.apache.hadoop.hbase.regionserver.TestCompoundBloomFilter
Tests run: 3, Failures: 0, Errors: 0, Skipped: 0, Time elapsed: 22.691 sec
Running org.apache.hadoop.hbase.regionserver.wal.TestLogRolling
Tests run: 4, Failures: 0, Errors: 0, Skipped: 0, Time elapsed: 653.333 sec
Running org.apache.hadoop.hbase.regionserver.TestAtomicOperation
Tests run: 6, Failures: 0, Errors: 0, Skipped: 0, Time elapsed: 25.352 sec
Running org.apache.hadoop.hbase.regionserver.TestFSErrorsExposed
Tests run: 3, Failures: 0, Errors: 0, Skipped: 0, Time elapsed: 23.208 sec
Running org.apache.hadoop.hbase.regionserver.TestHRegion
Tests run: 73, Failures: 0, Errors: 0, Skipped: 0, Time elapsed: 81.941 sec
Running org.apache.hadoop.hbase.regionserver.TestStore
Tests run: 16, Failures: 0, Errors: 0, Skipped: 0, Time elapsed: 12.167 sec
Running org.apache.hadoop.hbase.regionserver.TestMultiColumnScanner
Tests run: 12, Failures: 0, Errors: 0, Skipped: 0, Time elapsed: 37.822 sec

Results :

Tests in error: 
  testLogFilesAreArchived(org.apache.hadoop.hbase.master.TestSplitLogManager): test timed
out after 60000 milliseconds

Tests run: 1967, Failures: 0, Errors: 1, Skipped: 23

[INFO] ------------------------------------------------------------------------
[INFO] Reactor Summary:
[INFO] 
[INFO] HBase ............................................. SUCCESS [3.114s]
[INFO] HBase - Checkstyle ................................ SUCCESS [0.981s]
[INFO] HBase - Annotations ............................... SUCCESS [1.290s]
[INFO] HBase - Common .................................... SUCCESS [23.037s]
[INFO] HBase - Protocol .................................. SUCCESS [20.830s]
[INFO] HBase - Client .................................... SUCCESS [38.683s]
[INFO] HBase - Hadoop Compatibility ...................... SUCCESS [5.507s]
[INFO] HBase - Hadoop One Compatibility .................. SUCCESS [1.345s]
[INFO] HBase - Prefix Tree ............................... SUCCESS [3.244s]
[INFO] HBase - Server .................................... FAILURE [2:10:29.418s]
[INFO] HBase - Testing Util .............................. SKIPPED
[INFO] HBase - Thrift .................................... SKIPPED
[INFO] HBase - Rest ...................................... SKIPPED
[INFO] HBase - Shell ..................................... SKIPPED
[INFO] HBase - Integration Tests ......................... SKIPPED
[INFO] HBase - Examples .................................. SKIPPED
[INFO] HBase - Assembly .................................. SKIPPED
[INFO] ------------------------------------------------------------------------
[INFO] BUILD FAILURE
[INFO] ------------------------------------------------------------------------
[INFO] Total time: 2:12:08.329s
[INFO] Finished at: Wed Oct 22 20:46:07 UTC 2014
[INFO] Final Memory: 32M/477M
[INFO] ------------------------------------------------------------------------
[ERROR] Failed to execute goal org.apache.maven.plugins:maven-surefire-plugin:2.12-TRUNK-HBASE-2:test
(secondPartTestsExecution) on project hbase-server: There are test failures.
[ERROR] 
[ERROR] Please refer to <https://builds.apache.org/job/HBase-0.98-on-Hadoop-1.1/ws/hbase-server/target/surefire-reports>
for the individual test results.
[ERROR] -> [Help 1]
[ERROR] 
[ERROR] To see the full stack trace of the errors, re-run Maven with the -e switch.
[ERROR] Re-run Maven using the -X switch to enable full debug logging.
[ERROR] 
[ERROR] For more information about the errors and possible solutions, please read the following
articles:
[ERROR] [Help 1] http://cwiki.apache.org/confluence/display/MAVEN/MojoFailureException
[ERROR] 
[ERROR] After correcting the problems, you can resume the build with the command
[ERROR]   mvn <goals> -rf :hbase-server
Build step 'Invoke top-level Maven targets' marked build as failure
Performing Post build task...
Match found for :.* : True
Logical operation result is TRUE
Running script  :   ZOMBIE_TESTS_COUNT=`jps | grep surefirebooter | wc -l`
  if [[ $ZOMBIE_TESTS_COUNT != 0 ]] ; then
    #It seems sometimes the tests are not dying immediately. Let's give them 10s
    echo "Suspicious java process found - waiting 10s to see if there are just slow to stop"
    sleep 10
    ZOMBIE_TESTS_COUNT=`jps | grep surefirebooter | wc -l`
    if [[ $ZOMBIE_TESTS_COUNT != 0 ]] ; then
      echo "There are $ZOMBIE_TESTS_COUNT zombie tests, they should have been killed by surefire
but survived"
      echo "************ BEGIN zombies jstack extract"
      ZB_STACK=`jps | grep surefirebooter | cut -d ' ' -f 1 | xargs -n 1 jstack | grep ".test"
| grep "\.java"`
      jps | grep surefirebooter | cut -d ' ' -f 1 | xargs -n 1 jstack
      echo "************ END  zombies jstack extract"
      JIRA_COMMENT="$JIRA_COMMENT

     {color:red}-1 core zombie tests{color}.  There are ${ZOMBIE_TESTS_COUNT} zombie test(s):
${ZB_STACK}"
      BAD=1
      jps | grep surefirebooter | cut -d ' ' -f 1 | xargs kill -9
    else
      echo "We're ok: there is no zombie test, but some tests took some time to stop"
    fi
  else
    echo "We're ok: there is no zombie test"
  fi
[HBase-0.98-on-Hadoop-1.1] $ /bin/bash -xe /tmp/hudson6382877828030741391.sh
++ jps
++ grep surefirebooter
++ wc -l
+ ZOMBIE_TESTS_COUNT=0
+ [[ 0 != 0 ]]
+ echo 'We'\''re ok: there is no zombie test'
We're ok: there is no zombie test
POST BUILD TASK : SUCCESS
END OF POST BUILD TASK : 0
Archiving artifacts
Sending artifact delta relative to HBase-0.98-on-Hadoop-1.1 #593
Archived 1619 artifacts
Archive block size is 32768
Received 50 blocks and 395389747 bytes
Compression is 0.4%
Took 1 min 48 sec
Recording test results
Updating HBASE-12306

Mime
View raw message