hbase-builds mailing list archives

Site index · List index
Message view « Date » · « Thread »
Top « Date » · « Thread »
From Apache Jenkins Server <jenk...@builds.apache.org>
Subject Build failed in Jenkins: HBase-TRUNK #5608
Date Thu, 02 Oct 2014 18:17:01 GMT
See <https://builds.apache.org/job/HBase-TRUNK/5608/changes>

Changes:

[stack] HBASE-12133 Add FastLongHistogram for metric computation (Yi Deng)

[stack] HBASE-12158 TestHttpServerLifecycle.testStartedServerWithRequestLog goes zombie on
occasion

------------------------------------------
[...truncated 11 lines...]
 > git --version
 > git fetch --tags --progress https://git-wip-us.apache.org/repos/asf/hbase.git +refs/heads/*:refs/remotes/origin/*
 > git rev-parse origin/master^{commit}
Checking out Revision 6f104e3ac6f3916b7ca01120a3fb1ac4ddf2692d (origin/master)
 > git config core.sparsecheckout
 > git checkout -f 6f104e3ac6f3916b7ca01120a3fb1ac4ddf2692d
 > git rev-list e92036cd54ac313482a5c6cc3416add560c7600c
[HBase-TRUNK] $ /bin/bash -xe /tmp/hudson8907358614374417327.sh
+ which java
/home/jenkins/tools/java/latest1.7/bin/java
+ java -version
java version "1.7.0_25"
Java(TM) SE Runtime Environment (build 1.7.0_25-b15)
Java HotSpot(TM) Server VM (build 23.25-b01, mixed mode)
+ ulimit -a
core file size          (blocks, -c) 0
data seg size           (kbytes, -d) unlimited
scheduling priority             (-e) 0
file size               (blocks, -f) unlimited
pending signals                 (-i) 386178
max locked memory       (kbytes, -l) 64
max memory size         (kbytes, -m) unlimited
open files                      (-n) 60000
pipe size            (512 bytes, -p) 8
POSIX message queues     (bytes, -q) 819200
real-time priority              (-r) 0
stack size              (kbytes, -s) 8192
cpu time               (seconds, -t) unlimited
max user processes              (-u) 10240
virtual memory          (kbytes, -v) unlimited
file locks                      (-x) unlimited
+ rm -rf /tmp/hbase-jenkins/hbase
[HBase-TRUNK] $ /home/jenkins/jenkins-slave/tools/hudson.tasks.Maven_MavenInstallation/Maven_3.0.3/bin/mvn
-PrunAllTests -Dmaven.test.redirectTestOutputToFile=true install -Dsurefire.secondPartThreadCount=2
-Dit.test=noItTest
[INFO] Scanning for projects...
[INFO] ------------------------------------------------------------------------
[INFO] Reactor Build Order:
[INFO] 
[INFO] HBase
[INFO] HBase - Annotations
[INFO] HBase - Common
[INFO] HBase - Protocol
[INFO] HBase - Client
[INFO] HBase - Hadoop Compatibility
[INFO] HBase - Hadoop Two Compatibility
[INFO] HBase - Prefix Tree
[INFO] HBase - Server
[INFO] HBase - Testing Util
[INFO] HBase - Thrift
[INFO] HBase - Shell
[INFO] HBase - Integration Tests
[INFO] HBase - Examples
[INFO] HBase - Assembly
[INFO]                                                                         
[INFO] ------------------------------------------------------------------------
[INFO] Building HBase 2.0.0-SNAPSHOT
[INFO] ------------------------------------------------------------------------
[INFO] 
[INFO] --- maven-remote-resources-plugin:1.4:process (default) @ hbase ---
[INFO] 
[INFO] --- findbugs-maven-plugin:2.5.2:findbugs (default) @ hbase ---
[INFO] 
[INFO] --- maven-site-plugin:3.3:attach-descriptor (attach-descriptor) @ hbase ---
[INFO] 
[INFO] --- maven-install-plugin:2.3.1:install (default-install) @ hbase ---
[INFO] Installing <https://builds.apache.org/job/HBase-TRUNK/ws/pom.xml> to /home/jenkins/.m2/repository/org/apache/hbase/hbase/2.0.0-SNAPSHOT/hbase-2.0.0-SNAPSHOT.pom
[INFO] Installing <https://builds.apache.org/job/HBase-TRUNK/ws/target/hbase-2.0.0-SNAPSHOT-site.xml>
to /home/jenkins/.m2/repository/org/apache/hbase/hbase/2.0.0-SNAPSHOT/hbase-2.0.0-SNAPSHOT-site.xml
[INFO]                                                                         
[INFO] ------------------------------------------------------------------------
[INFO] Building HBase - Annotations 2.0.0-SNAPSHOT
[INFO] ------------------------------------------------------------------------
[INFO] 
[INFO] --- maven-remote-resources-plugin:1.4:process (default) @ hbase-annotations ---
[INFO] 
[INFO] --- maven-resources-plugin:2.6:resources (default-resources) @ hbase-annotations ---
[INFO] Using 'UTF-8' encoding to copy filtered resources.
[INFO] skip non existing resourceDirectory <https://builds.apache.org/job/HBase-TRUNK/ws/hbase-annotations/src/main/resources>
[INFO] Copying 3 resources
[INFO] 
[INFO] --- maven-compiler-plugin:2.5.1:compile (default-compile) @ hbase-annotations ---
[INFO] Compiling 25 source files to <https://builds.apache.org/job/HBase-TRUNK/ws/hbase-annotations/target/classes>
[INFO] 
[INFO] --- maven-resources-plugin:2.6:testResources (default-testResources) @ hbase-annotations
---
[INFO] Using 'UTF-8' encoding to copy filtered resources.
[INFO] skip non existing resourceDirectory <https://builds.apache.org/job/HBase-TRUNK/ws/hbase-annotations/src/test/resources>
[INFO] Copying 3 resources
[INFO] 
[INFO] --- maven-compiler-plugin:2.5.1:testCompile (default-testCompile) @ hbase-annotations
---
[INFO] No sources to compile
[INFO] 
[INFO] --- maven-surefire-plugin:2.17:test (default-test) @ hbase-annotations ---
[INFO] 
[INFO] --- maven-surefire-plugin:2.17:test (secondPartTestsExecution) @ hbase-annotations
---
[INFO] 
[INFO] --- maven-jar-plugin:2.4:test-jar (default) @ hbase-annotations ---
[INFO] Building jar: <https://builds.apache.org/job/HBase-TRUNK/ws/hbase-annotations/target/hbase-annotations-2.0.0-SNAPSHOT-tests.jar>
[INFO] 
[INFO] --- maven-jar-plugin:2.4:jar (default-jar) @ hbase-annotations ---
[INFO] Building jar: <https://builds.apache.org/job/HBase-TRUNK/ws/hbase-annotations/target/hbase-annotations-2.0.0-SNAPSHOT.jar>
[INFO] 
[INFO] --- maven-install-plugin:2.3.1:install (default-install) @ hbase-annotations ---
[INFO] Installing <https://builds.apache.org/job/HBase-TRUNK/ws/hbase-annotations/target/hbase-annotations-2.0.0-SNAPSHOT.jar>
to /home/jenkins/.m2/repository/org/apache/hbase/hbase-annotations/2.0.0-SNAPSHOT/hbase-annotations-2.0.0-SNAPSHOT.jar
[INFO] Installing <https://builds.apache.org/job/HBase-TRUNK/ws/hbase-annotations/pom.xml>
to /home/jenkins/.m2/repository/org/apache/hbase/hbase-annotations/2.0.0-SNAPSHOT/hbase-annotations-2.0.0-SNAPSHOT.pom
[INFO] Installing <https://builds.apache.org/job/HBase-TRUNK/ws/hbase-annotations/target/hbase-annotations-2.0.0-SNAPSHOT-tests.jar>
to /home/jenkins/.m2/repository/org/apache/hbase/hbase-annotations/2.0.0-SNAPSHOT/hbase-annotations-2.0.0-SNAPSHOT-tests.jar
[INFO]                                                                         
[INFO] ------------------------------------------------------------------------
[INFO] Building HBase - Common 2.0.0-SNAPSHOT
[INFO] ------------------------------------------------------------------------
[INFO] 
[INFO] --- maven-antrun-plugin:1.6:run (generate) @ hbase-common ---
[INFO] Executing tasks

main:
     [exec] ~/jenkins-slave/workspace/HBase-TRUNK/hbase-common ~/jenkins-slave/workspace/HBase-TRUNK/hbase-common
     [exec] ~/jenkins-slave/workspace/HBase-TRUNK/hbase-common
[INFO] Executed tasks
[INFO] 
[INFO] --- build-helper-maven-plugin:1.5:add-source (versionInfo-source) @ hbase-common ---
[INFO] Source directory: <https://builds.apache.org/job/HBase-TRUNK/ws/hbase-common/target/generated-sources/java>
added.
[INFO] 
[INFO] --- maven-remote-resources-plugin:1.4:process (default) @ hbase-common ---
[INFO] 
[INFO] --- maven-resources-plugin:2.6:resources (default-resources) @ hbase-common ---
[INFO] Using 'UTF-8' encoding to copy filtered resources.
[INFO] Copying 1 resource
[INFO] Copying 3 resources
[INFO] 
[INFO] --- maven-antrun-plugin:1.6:run (default) @ hbase-common ---
[INFO] Executing tasks

main:
    [mkdir] Created dir: <https://builds.apache.org/job/HBase-TRUNK/ws/hbase-common/target/nativelib>
     [exec] tar: hadoop-snappy-nativelibs.tar: Cannot open: No such file or directory
     [exec] tar: Error is not recoverable: exiting now
     [exec] Result: 2
[INFO] Executed tasks
[INFO] 
[INFO] --- maven-compiler-plugin:2.5.1:compile (default-compile) @ hbase-common ---
[INFO] Compiling 174 source files to <https://builds.apache.org/job/HBase-TRUNK/ws/hbase-common/target/classes>
[WARNING] <https://builds.apache.org/job/HBase-TRUNK/ws/hbase-common/src/main/java/org/apache/hadoop/hbase/util/Bytes.java>:[54,15]
Unsafe is internal proprietary API and may be removed in a future release
[WARNING] <https://builds.apache.org/job/HBase-TRUNK/ws/hbase-common/src/main/java/org/apache/hadoop/hbase/util/Bytes.java>:[1488,19]
Unsafe is internal proprietary API and may be removed in a future release
[WARNING] <https://builds.apache.org/job/HBase-TRUNK/ws/hbase-common/src/main/java/org/apache/hadoop/hbase/util/Bytes.java>:[1494,21]
Unsafe is internal proprietary API and may be removed in a future release
[WARNING] <https://builds.apache.org/job/HBase-TRUNK/ws/hbase-common/src/main/java/org/apache/hadoop/hbase/util/Bytes.java>:[1499,28]
Unsafe is internal proprietary API and may be removed in a future release
[INFO] 
[INFO] --- maven-dependency-plugin:2.1:build-classpath (create-mrapp-generated-classpath)
@ hbase-common ---
[INFO] Wrote classpath file '<https://builds.apache.org/job/HBase-TRUNK/ws/hbase-common/target/test-classes/mrapp-generated-classpath'.>
[INFO] 
[INFO] --- maven-resources-plugin:2.6:testResources (default-testResources) @ hbase-common
---
[INFO] Using 'UTF-8' encoding to copy filtered resources.
[INFO] Copying 1 resource
[INFO] Copying 3 resources
[INFO] 
[INFO] --- maven-compiler-plugin:2.5.1:testCompile (default-testCompile) @ hbase-common ---
[INFO] Compiling 53 source files to <https://builds.apache.org/job/HBase-TRUNK/ws/hbase-common/target/test-classes>
[INFO] -------------------------------------------------------------
[ERROR] COMPILATION ERROR : 
[INFO] -------------------------------------------------------------
[ERROR] <https://builds.apache.org/job/HBase-TRUNK/ws/hbase-common/src/test/java/org/apache/hadoop/hbase/util/TestFastLongHistogram.java>:[23,30]
error: cannot find symbol
[ERROR]   symbol:   class SmallTests
  location: package org.apache.hadoop.hbase
<https://builds.apache.org/job/HBase-TRUNK/ws/hbase-common/src/test/java/org/apache/hadoop/hbase/util/TestFastLongHistogram.java>:[31,12]
error: cannot find symbol
[INFO] 2 errors 
[INFO] -------------------------------------------------------------
[INFO] ------------------------------------------------------------------------
[INFO] Reactor Summary:
[INFO] 
[INFO] HBase ............................................. SUCCESS [2.437s]
[INFO] HBase - Annotations ............................... SUCCESS [1.432s]
[INFO] HBase - Common .................................... FAILURE [6.492s]
[INFO] HBase - Protocol .................................. SKIPPED
[INFO] HBase - Client .................................... SKIPPED
[INFO] HBase - Hadoop Compatibility ...................... SKIPPED
[INFO] HBase - Hadoop Two Compatibility .................. SKIPPED
[INFO] HBase - Prefix Tree ............................... SKIPPED
[INFO] HBase - Server .................................... SKIPPED
[INFO] HBase - Testing Util .............................. SKIPPED
[INFO] HBase - Thrift .................................... SKIPPED
[INFO] HBase - Shell ..................................... SKIPPED
[INFO] HBase - Integration Tests ......................... SKIPPED
[INFO] HBase - Examples .................................. SKIPPED
[INFO] HBase - Assembly .................................. SKIPPED
[INFO] ------------------------------------------------------------------------
[INFO] BUILD FAILURE
[INFO] ------------------------------------------------------------------------
[INFO] Total time: 11.174s
[INFO] Finished at: Thu Oct 02 18:16:44 UTC 2014
[INFO] Final Memory: 44M/463M
[INFO] ------------------------------------------------------------------------
[ERROR] Failed to execute goal org.apache.maven.plugins:maven-compiler-plugin:2.5.1:testCompile
(default-testCompile) on project hbase-common: Compilation failure: Compilation failure:
[ERROR] <https://builds.apache.org/job/HBase-TRUNK/ws/hbase-common/src/test/java/org/apache/hadoop/hbase/util/TestFastLongHistogram.java>:[23,30]
error: cannot find symbol
[ERROR] symbol:   class SmallTests
[ERROR] location: package org.apache.hadoop.hbase
[ERROR] <https://builds.apache.org/job/HBase-TRUNK/ws/hbase-common/src/test/java/org/apache/hadoop/hbase/util/TestFastLongHistogram.java>:[31,12]
error: cannot find symbol
[ERROR] -> [Help 1]
[ERROR] 
[ERROR] To see the full stack trace of the errors, re-run Maven with the -e switch.
[ERROR] Re-run Maven using the -X switch to enable full debug logging.
[ERROR] 
[ERROR] For more information about the errors and possible solutions, please read the following
articles:
[ERROR] [Help 1] http://cwiki.apache.org/confluence/display/MAVEN/MojoFailureException
[ERROR] 
[ERROR] After correcting the problems, you can resume the build with the command
[ERROR]   mvn <goals> -rf :hbase-common
Build step 'Invoke top-level Maven targets' marked build as failure
Performing Post build task...
Match found for :.* : True
Logical operation result is TRUE
Running script  :   ZOMBIE_TESTS_COUNT=`jps | grep surefirebooter | wc -l`
  if [[ $ZOMBIE_TESTS_COUNT != 0 ]] ; then
    #It seems sometimes the tests are not dying immediately. Let's give them 10s
    echo "Suspicious java process found - waiting 10s to see if there are just slow to stop"
    sleep 10   
    ZOMBIE_TESTS_COUNT=`jps | grep surefirebooter | wc -l`
    if [[ $ZOMBIE_TESTS_COUNT != 0 ]] ; then
      echo "There are $ZOMBIE_TESTS_COUNT zombie tests, they should have been killed by surefire
but survived"
      echo "************ BEGIN zombies jstack extract"
      ZB_STACK=`jps | grep surefirebooter | cut -d ' ' -f 1 | xargs -n 1 jstack | grep ".test"
| grep "\.java"`
      jps | grep surefirebooter | cut -d ' ' -f 1 | xargs -n 1 jstack
      echo "************ END  zombies jstack extract"
      JIRA_COMMENT="$JIRA_COMMENT

     {color:red}-1 core zombie tests{color}.  There are ${ZOMBIE_TESTS_COUNT} zombie test(s):
${ZB_STACK}"
      BAD=1
      jps | grep surefirebooter | cut -d ' ' -f 1 | xargs kill -9
    else
      echo "We're ok: there is no zombie test, but some tests took some time to stop"
    fi
  else
    echo "We're ok: there is no zombie test"
  fi
[HBase-TRUNK] $ /bin/bash -xe /tmp/hudson2780980280274693160.sh
++ jps
++ grep surefirebooter
++ wc -l
+ ZOMBIE_TESTS_COUNT=0
+ [[ 0 != 0 ]]
+ echo 'We'\''re ok: there is no zombie test'
We're ok: there is no zombie test
POST BUILD TASK : SUCCESS
END OF POST BUILD TASK : 0
Archiving artifacts
Sending artifact delta relative to HBase-TRUNK #5564
Archived 14 artifacts
Archive block size is 32768
Received 8 blocks and 51233 bytes
Compression is 83.7%
Took 9.8 sec
Recording test results
Updating HBASE-12133
Updating HBASE-12158

Mime
View raw message