hbase-builds mailing list archives

Site index · List index
Message view « Date » · « Thread »
Top « Date » · « Thread »
From Apache Jenkins Server <jenk...@builds.apache.org>
Subject Build failed in Jenkins: HBase-1.0 #336
Date Tue, 21 Oct 2014 20:50:49 GMT
See <https://builds.apache.org/job/HBase-1.0/336/changes>

Changes:

[tedyu] HBASE-12302 VisibilityClient getAuths does not propagate remote service exception
correctly (Jerry He)

------------------------------------------
Started by an SCM change
Building remotely on jenkins-ubuntu-1404-4gb-bdb (jenkins-cloud-4GB Ubuntu ubuntu) in workspace
<https://builds.apache.org/job/HBase-1.0/ws/>
Cloning the remote Git repository
Cloning repository https://git-wip-us.apache.org/repos/asf/hbase.git
 > git init <https://builds.apache.org/job/HBase-1.0/ws/>
Fetching upstream changes from https://git-wip-us.apache.org/repos/asf/hbase.git
 > git --version
 > git fetch --tags --progress https://git-wip-us.apache.org/repos/asf/hbase.git +refs/heads/*:refs/remotes/origin/*
 > git config remote.origin.url https://git-wip-us.apache.org/repos/asf/hbase.git
 > git config remote.origin.fetch +refs/heads/*:refs/remotes/origin/*
 > git config remote.origin.url https://git-wip-us.apache.org/repos/asf/hbase.git
Cleaning workspace
 > git rev-parse --verify HEAD
No valid HEAD. Skipping the resetting
 > git clean -fdx
Fetching upstream changes from https://git-wip-us.apache.org/repos/asf/hbase.git
 > git fetch --tags --progress https://git-wip-us.apache.org/repos/asf/hbase.git +refs/heads/*:refs/remotes/origin/*
 > git rev-parse origin/branch-1^{commit}
Checking out Revision 89191230ea84ebb917fb01d41a3a0c17fc2d4bec (origin/branch-1)
 > git config core.sparsecheckout
 > git checkout -f 89191230ea84ebb917fb01d41a3a0c17fc2d4bec
 > git rev-list 3306679a6841edd08ac1236484a4853ccd8c4fe5
[HBase-1.0] $ /bin/bash -xe /tmp/hudson6060309574129009495.sh
+ ulimit -a
core file size          (blocks, -c) 0
data seg size           (kbytes, -d) unlimited
scheduling priority             (-e) 0
file size               (blocks, -f) unlimited
pending signals                 (-i) 31591
max locked memory       (kbytes, -l) 64
max memory size         (kbytes, -m) unlimited
open files                      (-n) 60000
pipe size            (512 bytes, -p) 8
POSIX message queues     (bytes, -q) 819200
real-time priority              (-r) 0
stack size              (kbytes, -s) 8192
cpu time               (seconds, -t) unlimited
max user processes              (-u) 10240
virtual memory          (kbytes, -v) unlimited
file locks                      (-x) unlimited
+ rm -rf /tmp/hbase-jenkins/hbase
[HBase-1.0] $ /jenkins/tools/hudson.tasks.Maven_MavenInstallation/Maven_3.0.3/bin/mvn -PrunAllTests
-Dmaven.test.redirectTestOutputToFile=true install -Dsurefire.secondPartThreadCount=2 -Dit.test=noItTest
[INFO] Scanning for projects...
[ERROR] The build could not read 1 project -> [Help 1]
[ERROR]   
[ERROR]   The project org.apache.hbase:hbase-checkstyle:0.99.2-SNAPSHOT (<https://builds.apache.org/job/HBase-1.0/ws/hbase-checkstyle/pom.xml)>
has 1 error
[ERROR]     Non-resolvable parent POM: Could not find artifact org.apache.hbase:hbase:pom:2.0.0-SNAPSHOT
and 'parent.relativePath' points at wrong local POM @ line 31, column 11 -> [Help 2]
[ERROR] 
[ERROR] To see the full stack trace of the errors, re-run Maven with the -e switch.
[ERROR] Re-run Maven using the -X switch to enable full debug logging.
[ERROR] 
[ERROR] For more information about the errors and possible solutions, please read the following
articles:
[ERROR] [Help 1] http://cwiki.apache.org/confluence/display/MAVEN/ProjectBuildingException
[ERROR] [Help 2] http://cwiki.apache.org/confluence/display/MAVEN/UnresolvableModelException
Build step 'Invoke top-level Maven targets' marked build as failure
Performing Post build task...
Match found for :.* : True
Logical operation result is TRUE
Running script  :   ZOMBIE_TESTS_COUNT=`jps | grep surefirebooter | wc -l`
  if [[ $ZOMBIE_TESTS_COUNT != 0 ]] ; then
    #It seems sometimes the tests are not dying immediately. Let's give them 10s
    echo "Suspicious java process found - waiting 10s to see if there are just slow to stop"
    sleep 10   
    ZOMBIE_TESTS_COUNT=`jps | grep surefirebooter | wc -l`
    if [[ $ZOMBIE_TESTS_COUNT != 0 ]] ; then
      echo "There are $ZOMBIE_TESTS_COUNT zombie tests, they should have been killed by surefire
but survived"
      echo "************ BEGIN zombies jstack extract"
      ZB_STACK=`jps | grep surefirebooter | cut -d ' ' -f 1 | xargs -n 1 jstack | grep ".test"
| grep "\.java"`
      jps | grep surefirebooter | cut -d ' ' -f 1 | xargs -n 1 jstack
      echo "************ END  zombies jstack extract"
      JIRA_COMMENT="$JIRA_COMMENT

     {color:red}-1 core zombie tests{color}.  There are ${ZOMBIE_TESTS_COUNT} zombie test(s):
${ZB_STACK}"
      BAD=1
      jps | grep surefirebooter | cut -d ' ' -f 1 | xargs kill -9
    else
      echo "We're ok: there is no zombie test, but some tests took some time to stop"
    fi
  else
    echo "We're ok: there is no zombie test"
  fi
[HBase-1.0] $ /bin/bash -xe /tmp/hudson8221732518944607571.sh
++ jps
++ grep surefirebooter
++ wc -l
+ ZOMBIE_TESTS_COUNT=0
+ [[ 0 != 0 ]]
+ echo 'We'\''re ok: there is no zombie test'
We're ok: there is no zombie test
POST BUILD TASK : SUCCESS
END OF POST BUILD TASK : 0
Archiving artifacts
Sending artifact delta relative to HBase-1.0 #326
Archived 14 artifacts
Archive block size is 32768
Received 3 blocks and 50765 bytes
Compression is 65.9%
Took 12 sec
Recording test results
Updating HBASE-12302

Mime
View raw message