hbase-builds mailing list archives

Site index · List index
Message view « Date » · « Thread »
Top « Date » · « Thread »
From Apache Jenkins Server <jenk...@builds.apache.org>
Subject Build failed in Jenkins: HBase-0.98 #591
Date Fri, 10 Oct 2014 19:08:01 GMT
See <https://builds.apache.org/job/HBase-0.98/591/changes>

Changes:

[stack] HBASE-11394 Replication can have data loss if peer id contains hyphen "-"

------------------------------------------
[...truncated 604 lines...]
[INFO] Building jar: <https://builds.apache.org/job/HBase-0.98/ws/hbase-hadoop2-compat/target/hbase-hadoop2-compat-0.98.7-tests.jar>
[INFO] 
[INFO] --- maven-jar-plugin:2.4:jar (default-jar) @ hbase-hadoop2-compat ---
[INFO] Building jar: <https://builds.apache.org/job/HBase-0.98/ws/hbase-hadoop2-compat/target/hbase-hadoop2-compat-0.98.7.jar>
[INFO] 
[INFO] --- maven-install-plugin:2.3.1:install (default-install) @ hbase-hadoop2-compat ---
[INFO] Installing <https://builds.apache.org/job/HBase-0.98/ws/hbase-hadoop2-compat/target/hbase-hadoop2-compat-0.98.7.jar>
to /home/jenkins/.m2/repository/org/apache/hbase/hbase-hadoop2-compat/0.98.7/hbase-hadoop2-compat-0.98.7.jar
[INFO] Installing <https://builds.apache.org/job/HBase-0.98/ws/hbase-hadoop2-compat/pom.xml>
to /home/jenkins/.m2/repository/org/apache/hbase/hbase-hadoop2-compat/0.98.7/hbase-hadoop2-compat-0.98.7.pom
[INFO] Installing <https://builds.apache.org/job/HBase-0.98/ws/hbase-hadoop2-compat/target/hbase-hadoop2-compat-0.98.7-sources.jar>
to /home/jenkins/.m2/repository/org/apache/hbase/hbase-hadoop2-compat/0.98.7/hbase-hadoop2-compat-0.98.7-sources.jar
[INFO] Installing <https://builds.apache.org/job/HBase-0.98/ws/hbase-hadoop2-compat/target/hbase-hadoop2-compat-0.98.7-tests.jar>
to /home/jenkins/.m2/repository/org/apache/hbase/hbase-hadoop2-compat/0.98.7/hbase-hadoop2-compat-0.98.7-tests.jar
[INFO]                                                                         
[INFO] ------------------------------------------------------------------------
[INFO] Building HBase - Prefix Tree 0.98.7
[INFO] ------------------------------------------------------------------------
[INFO] 
[INFO] --- jacoco-maven-plugin:0.6.2.201302030002:prepare-agent (prepare-agent) @ hbase-prefix-tree
---
[INFO] Skipping JaCoCo execution
[INFO] argLine set to 
[INFO] 
[INFO] --- maven-remote-resources-plugin:1.4:process (default) @ hbase-prefix-tree ---
[INFO] 
[INFO] --- maven-resources-plugin:2.6:resources (default-resources) @ hbase-prefix-tree ---
[INFO] Using 'UTF-8' encoding to copy filtered resources.
[INFO] skip non existing resourceDirectory <https://builds.apache.org/job/HBase-0.98/ws/hbase-prefix-tree/src/main/resources>
[INFO] Copying 3 resources
[INFO] 
[INFO] --- maven-compiler-plugin:2.5.1:compile (default-compile) @ hbase-prefix-tree ---
[INFO] Compiling 39 source files to <https://builds.apache.org/job/HBase-0.98/ws/hbase-prefix-tree/target/classes>
[INFO] 
[INFO] --- maven-resources-plugin:2.6:testResources (default-testResources) @ hbase-prefix-tree
---
[INFO] Using 'UTF-8' encoding to copy filtered resources.
[INFO] skip non existing resourceDirectory <https://builds.apache.org/job/HBase-0.98/ws/hbase-prefix-tree/src/test/resources>
[INFO] Copying 3 resources
[INFO] 
[INFO] --- maven-compiler-plugin:2.5.1:testCompile (default-testCompile) @ hbase-prefix-tree
---
[INFO] Compiling 47 source files to <https://builds.apache.org/job/HBase-0.98/ws/hbase-prefix-tree/target/test-classes>
[INFO] 
[INFO] --- maven-surefire-plugin:2.12-TRUNK-HBASE-2:test (default-test) @ hbase-prefix-tree
---
[INFO] Surefire report directory: <https://builds.apache.org/job/HBase-0.98/ws/hbase-prefix-tree/target/surefire-reports>
[INFO] Using configured provider org.apache.maven.surefire.junitcore.JUnitCoreProvider

-------------------------------------------------------
 T E S T S
-------------------------------------------------------
Running org.apache.hadoop.hbase.util.vint.TestVIntTool
Tests run: 6, Failures: 0, Errors: 0, Skipped: 0, Time elapsed: 0.051 sec
Running org.apache.hadoop.hbase.util.vint.TestFIntTool
Tests run: 7, Failures: 0, Errors: 0, Skipped: 0, Time elapsed: 0.002 sec
Running org.apache.hadoop.hbase.util.vint.TestVLongTool
Tests run: 6, Failures: 0, Errors: 0, Skipped: 0, Time elapsed: 0.052 sec
Running org.apache.hadoop.hbase.util.bytes.TestByteRange
Tests run: 1, Failures: 0, Errors: 0, Skipped: 0, Time elapsed: 0.002 sec
Running org.apache.hadoop.hbase.codec.keyvalue.TestKeyValueTool
Tests run: 18, Failures: 0, Errors: 0, Skipped: 0, Time elapsed: 0.014 sec
Running org.apache.hadoop.hbase.codec.prefixtree.timestamp.TestTimestampEncoder
Tests run: 12, Failures: 0, Errors: 0, Skipped: 0, Time elapsed: 0.001 sec
Running org.apache.hadoop.hbase.codec.prefixtree.blockmeta.TestBlockMeta
Tests run: 1, Failures: 0, Errors: 0, Skipped: 0, Time elapsed: 0.002 sec
Running org.apache.hadoop.hbase.codec.prefixtree.column.TestColumnBuilder
Tests run: 17, Failures: 0, Errors: 0, Skipped: 0, Time elapsed: 0.348 sec
Running org.apache.hadoop.hbase.codec.prefixtree.builder.TestTokenizer
Tests run: 4, Failures: 0, Errors: 0, Skipped: 0, Time elapsed: 0.002 sec
Running org.apache.hadoop.hbase.codec.prefixtree.builder.TestTreeDepth
Tests run: 7, Failures: 0, Errors: 0, Skipped: 0, Time elapsed: 0 sec
Running org.apache.hadoop.hbase.codec.prefixtree.row.TestPrefixTreeSearcher
Tests run: 108, Failures: 0, Errors: 0, Skipped: 0, Time elapsed: 0.327 sec
Running org.apache.hadoop.hbase.codec.prefixtree.row.TestRowEncoder
Tests run: 90, Failures: 0, Errors: 0, Skipped: 0, Time elapsed: 1.306 sec

Results :

Tests run: 277, Failures: 0, Errors: 0, Skipped: 0

[INFO] 
[INFO] --- maven-surefire-plugin:2.12-TRUNK-HBASE-2:test (secondPartTestsExecution) @ hbase-prefix-tree
---
[INFO] Tests are skipped.
[INFO] 
[INFO] --- jacoco-maven-plugin:0.6.2.201302030002:report (report) @ hbase-prefix-tree ---
[INFO] Skipping JaCoCo execution
[INFO] 
[INFO] --- maven-source-plugin:2.2.1:jar-no-fork (attach-sources) @ hbase-prefix-tree ---
[INFO] Building jar: <https://builds.apache.org/job/HBase-0.98/ws/hbase-prefix-tree/target/hbase-prefix-tree-0.98.7-sources.jar>
[INFO] 
[INFO] --- maven-jar-plugin:2.4:test-jar (default) @ hbase-prefix-tree ---
[INFO] Building jar: <https://builds.apache.org/job/HBase-0.98/ws/hbase-prefix-tree/target/hbase-prefix-tree-0.98.7-tests.jar>
[INFO] 
[INFO] --- maven-jar-plugin:2.4:jar (default-jar) @ hbase-prefix-tree ---
[INFO] Building jar: <https://builds.apache.org/job/HBase-0.98/ws/hbase-prefix-tree/target/hbase-prefix-tree-0.98.7.jar>
[INFO] 
[INFO] --- maven-install-plugin:2.3.1:install (default-install) @ hbase-prefix-tree ---
[INFO] Installing <https://builds.apache.org/job/HBase-0.98/ws/hbase-prefix-tree/target/hbase-prefix-tree-0.98.7.jar>
to /home/jenkins/.m2/repository/org/apache/hbase/hbase-prefix-tree/0.98.7/hbase-prefix-tree-0.98.7.jar
[INFO] Installing <https://builds.apache.org/job/HBase-0.98/ws/hbase-prefix-tree/pom.xml>
to /home/jenkins/.m2/repository/org/apache/hbase/hbase-prefix-tree/0.98.7/hbase-prefix-tree-0.98.7.pom
[INFO] Installing <https://builds.apache.org/job/HBase-0.98/ws/hbase-prefix-tree/target/hbase-prefix-tree-0.98.7-sources.jar>
to /home/jenkins/.m2/repository/org/apache/hbase/hbase-prefix-tree/0.98.7/hbase-prefix-tree-0.98.7-sources.jar
[INFO] Installing <https://builds.apache.org/job/HBase-0.98/ws/hbase-prefix-tree/target/hbase-prefix-tree-0.98.7-tests.jar>
to /home/jenkins/.m2/repository/org/apache/hbase/hbase-prefix-tree/0.98.7/hbase-prefix-tree-0.98.7-tests.jar
[INFO]                                                                         
[INFO] ------------------------------------------------------------------------
[INFO] Building HBase - Server 0.98.7
[INFO] ------------------------------------------------------------------------
[INFO] 
[INFO] --- jacoco-maven-plugin:0.6.2.201302030002:prepare-agent (prepare-agent) @ hbase-server
---
[INFO] Skipping JaCoCo execution
[INFO] argLine set to 
[INFO] 
[INFO] --- maven-antrun-plugin:1.6:run (generate) @ hbase-server ---
[INFO] Executing tasks

main:
    [mkdir] Created dir: <https://builds.apache.org/job/HBase-0.98/ws/hbase-server/target/hbase-webapps>
     [copy] Copying 20 files to <https://builds.apache.org/job/HBase-0.98/ws/hbase-server/target/hbase-webapps>
log4j:WARN No appenders could be found for logger (org.mortbay.log).
log4j:WARN Please initialize the log4j system properly.
log4j:WARN See http://logging.apache.org/log4j/1.2/faq.html#noconfig for more info.
    [mkdir] Created dir: <https://builds.apache.org/job/HBase-0.98/ws/hbase-server/target/hbase-webapps/master/WEB-INF>
    [mkdir] Created dir: <https://builds.apache.org/job/HBase-0.98/ws/hbase-server/target/hbase-webapps/regionserver/WEB-INF>
[INFO] Executed tasks
[INFO] 
[INFO] --- build-helper-maven-plugin:1.5:add-source (jspcSource-packageInfo-source) @ hbase-server
---
[INFO] Source directory: <https://builds.apache.org/job/HBase-0.98/ws/hbase-server/target/generated-jamon>
added.
[INFO] Source directory: <https://builds.apache.org/job/HBase-0.98/ws/hbase-server/target/generated-sources/java>
added.
[INFO] 
[INFO] --- jamon-maven-plugin:2.3.4:translate (default) @ hbase-server ---
[INFO] Translating 10 templates from <https://builds.apache.org/job/HBase-0.98/ws/hbase-server/src/main/jamon>
to <https://builds.apache.org/job/HBase-0.98/ws/hbase-server/target/generated-jamon>
[INFO] 
[INFO] --- maven-remote-resources-plugin:1.4:process (default) @ hbase-server ---
[INFO] 
[INFO] --- maven-resources-plugin:2.6:resources (default-resources) @ hbase-server ---
[INFO] Using 'UTF-8' encoding to copy filtered resources.
[INFO] Copying 22 resources
[INFO] Copying 3 resources
[INFO] 
[INFO] --- maven-compiler-plugin:2.5.1:compile (default-compile) @ hbase-server ---
[INFO] Compiling 637 source files to <https://builds.apache.org/job/HBase-0.98/ws/hbase-server/target/classes>
[INFO] 
[INFO] --- maven-dependency-plugin:2.1:build-classpath (create-mrapp-generated-classpath)
@ hbase-server ---
[INFO] Wrote classpath file '<https://builds.apache.org/job/HBase-0.98/ws/hbase-server/target/test-classes/mrapp-generated-classpath'.>
[INFO] 
[INFO] --- maven-resources-plugin:2.6:testResources (default-testResources) @ hbase-server
---
[INFO] Using 'UTF-8' encoding to copy filtered resources.
[INFO] Copying 9 resources
[INFO] Copying 3 resources
[INFO] 
[INFO] --- maven-compiler-plugin:2.5.1:testCompile (default-testCompile) @ hbase-server ---
[INFO] Compiling 584 source files to <https://builds.apache.org/job/HBase-0.98/ws/hbase-server/target/test-classes>
[INFO] -------------------------------------------------------------
[ERROR] COMPILATION ERROR : 
[INFO] -------------------------------------------------------------
[ERROR] <https://builds.apache.org/job/HBase-0.98/ws/hbase-server/src/test/java/org/apache/hadoop/hbase/replication/TestReplicationTrackerZKImpl.java>:[181,24]
cannot find symbol
symbol  : class ReplicationPeerConfig
location: class org.apache.hadoop.hbase.replication.TestReplicationTrackerZKImpl
[ERROR] <https://builds.apache.org/job/HBase-0.98/ws/hbase-server/src/test/java/org/apache/hadoop/hbase/replication/TestReplicationTrackerZKImpl.java>:[184,26]
cannot find symbol
symbol  : class ReplicationPeerConfig
location: class org.apache.hadoop.hbase.replication.TestReplicationTrackerZKImpl
[ERROR] <https://builds.apache.org/job/HBase-0.98/ws/hbase-server/src/test/java/org/apache/hadoop/hbase/replication/TestReplicationTrackerZKImpl.java>:[190,30]
cannot find symbol
symbol  : class ReplicationPeerConfig
location: class org.apache.hadoop.hbase.replication.TestReplicationTrackerZKImpl
[INFO] 3 errors 
[INFO] -------------------------------------------------------------
[INFO] ------------------------------------------------------------------------
[INFO] Reactor Summary:
[INFO] 
[INFO] HBase ............................................. SUCCESS [3.113s]
[INFO] HBase - Annotations ............................... SUCCESS [1.873s]
[INFO] HBase - Common .................................... SUCCESS [22.264s]
[INFO] HBase - Protocol .................................. SUCCESS [19.472s]
[INFO] HBase - Client .................................... SUCCESS [38.528s]
[INFO] HBase - Hadoop Compatibility ...................... SUCCESS [5.323s]
[INFO] HBase - Hadoop Two Compatibility .................. SUCCESS [1.502s]
[INFO] HBase - Prefix Tree ............................... SUCCESS [3.383s]
[INFO] HBase - Server .................................... FAILURE [9.928s]
[INFO] HBase - Testing Util .............................. SKIPPED
[INFO] HBase - Thrift .................................... SKIPPED
[INFO] HBase - Rest ...................................... SKIPPED
[INFO] HBase - Shell ..................................... SKIPPED
[INFO] HBase - Integration Tests ......................... SKIPPED
[INFO] HBase - Examples .................................. SKIPPED
[INFO] HBase - Assembly .................................. SKIPPED
[INFO] ------------------------------------------------------------------------
[INFO] BUILD FAILURE
[INFO] ------------------------------------------------------------------------
[INFO] Total time: 1:46.217s
[INFO] Finished at: Fri Oct 10 19:07:49 UTC 2014
[INFO] Final Memory: 60M/951M
[INFO] ------------------------------------------------------------------------
[ERROR] Failed to execute goal org.apache.maven.plugins:maven-compiler-plugin:2.5.1:testCompile
(default-testCompile) on project hbase-server: Compilation failure: Compilation failure:
[ERROR] <https://builds.apache.org/job/HBase-0.98/ws/hbase-server/src/test/java/org/apache/hadoop/hbase/replication/TestReplicationTrackerZKImpl.java>:[181,24]
cannot find symbol
[ERROR] symbol  : class ReplicationPeerConfig
[ERROR] location: class org.apache.hadoop.hbase.replication.TestReplicationTrackerZKImpl
[ERROR] <https://builds.apache.org/job/HBase-0.98/ws/hbase-server/src/test/java/org/apache/hadoop/hbase/replication/TestReplicationTrackerZKImpl.java>:[184,26]
cannot find symbol
[ERROR] symbol  : class ReplicationPeerConfig
[ERROR] location: class org.apache.hadoop.hbase.replication.TestReplicationTrackerZKImpl
[ERROR] <https://builds.apache.org/job/HBase-0.98/ws/hbase-server/src/test/java/org/apache/hadoop/hbase/replication/TestReplicationTrackerZKImpl.java>:[190,30]
cannot find symbol
[ERROR] symbol  : class ReplicationPeerConfig
[ERROR] location: class org.apache.hadoop.hbase.replication.TestReplicationTrackerZKImpl
[ERROR] -> [Help 1]
[ERROR] 
[ERROR] To see the full stack trace of the errors, re-run Maven with the -e switch.
[ERROR] Re-run Maven using the -X switch to enable full debug logging.
[ERROR] 
[ERROR] For more information about the errors and possible solutions, please read the following
articles:
[ERROR] [Help 1] http://cwiki.apache.org/confluence/display/MAVEN/MojoFailureException
[ERROR] 
[ERROR] After correcting the problems, you can resume the build with the command
[ERROR]   mvn <goals> -rf :hbase-server
Build step 'Invoke top-level Maven targets' marked build as failure
Performing Post build task...
Match found for :.* : True
Logical operation result is TRUE
Running script  :   ZOMBIE_TESTS_COUNT=`jps | grep surefirebooter | wc -l`
  if [[ $ZOMBIE_TESTS_COUNT != 0 ]] ; then
    #It seems sometimes the tests are not dying immediately. Let's give them 10s
    echo "Suspicious java process found - waiting 10s to see if there are just slow to stop"
    sleep 10   
    ZOMBIE_TESTS_COUNT=`jps | grep surefirebooter | wc -l`
    if [[ $ZOMBIE_TESTS_COUNT != 0 ]] ; then
      echo "There are $ZOMBIE_TESTS_COUNT zombie tests, they should have been killed by surefire
but survived"
      echo "************ BEGIN zombies jstack extract"
      ZB_STACK=`jps | grep surefirebooter | cut -d ' ' -f 1 | xargs -n 1 jstack | grep ".test"
| grep "\.java"`
      jps | grep surefirebooter | cut -d ' ' -f 1 | xargs -n 1 jstack
      echo "************ END  zombies jstack extract"
      JIRA_COMMENT="$JIRA_COMMENT

     {color:red}-1 core zombie tests{color}.  There are ${ZOMBIE_TESTS_COUNT} zombie test(s):
${ZB_STACK}"
      BAD=1
      jps | grep surefirebooter | cut -d ' ' -f 1 | xargs kill -9
    else
      echo "We're ok: there is no zombie test, but some tests took some time to stop"
    fi
  else
    echo "We're ok: there is no zombie test"
  fi
[HBase-0.98] $ /bin/bash -xe /tmp/hudson5284731034235156470.sh
++ jps
++ grep surefirebooter
++ wc -l
+ ZOMBIE_TESTS_COUNT=0
+ [[ 0 != 0 ]]
+ echo 'We'\''re ok: there is no zombie test'
We're ok: there is no zombie test
POST BUILD TASK : SUCCESS
END OF POST BUILD TASK : 0
Archiving artifacts
Sending artifact delta relative to HBase-0.98 #589
Archived 213 artifacts
Archive block size is 32768
Received 4 blocks and 799142 bytes
Compression is 14.1%
Took 5.4 sec
Recording test results
Updating HBASE-11394

Mime
View raw message