hbase-builds mailing list archives

Site index · List index
Message view « Date » · « Thread »
Top « Date » · « Thread »
From Apache Jenkins Server <jenk...@builds.apache.org>
Subject Build failed in Jenkins: HBase-0.98-on-Hadoop-1.1 #500
Date Fri, 19 Sep 2014 19:39:46 GMT
See <https://builds.apache.org/job/HBase-0.98-on-Hadoop-1.1/500/changes>

Changes:

[jxiang] HBASE-11960 Provide a sample to show how to use Thrift client authentication

------------------------------------------
[...truncated 1524 lines...]
Running org.apache.hadoop.hbase.security.access.TestAccessControlFilter
Tests run: 1, Failures: 0, Errors: 0, Skipped: 0, Time elapsed: 13.296 sec
Running org.apache.hadoop.hbase.security.access.TestCellACLs
Tests run: 2, Failures: 0, Errors: 2, Skipped: 0, Time elapsed: 13.364 sec <<< FAILURE!
Running org.apache.hadoop.hbase.security.access.TestNamespaceCommands
Tests run: 3, Failures: 0, Errors: 0, Skipped: 0, Time elapsed: 12.11 sec
Running org.apache.hadoop.hbase.security.access.TestAccessController
Tests run: 44, Failures: 44, Errors: 0, Skipped: 0, Time elapsed: 80.817 sec <<<
FAILURE!
Running org.apache.hadoop.hbase.security.access.TestZKPermissionsWatcher
Tests run: 1, Failures: 0, Errors: 0, Skipped: 0, Time elapsed: 12.893 sec
Running org.apache.hadoop.hbase.security.access.TestScanEarlyTermination
Tests run: 1, Failures: 0, Errors: 1, Skipped: 0, Time elapsed: 13.17 sec <<< FAILURE!
Running org.apache.hadoop.hbase.security.token.TestZKSecretWatcher
Tests run: 1, Failures: 0, Errors: 0, Skipped: 0, Time elapsed: 14.679 sec
Running org.apache.hadoop.hbase.security.token.TestTokenAuthentication
Tests run: 2, Failures: 0, Errors: 0, Skipped: 0, Time elapsed: 1.909 sec
Running org.apache.hadoop.hbase.security.access.TestCellACLWithMultipleVersions
Tests run: 8, Failures: 0, Errors: 8, Skipped: 0, Time elapsed: 23.418 sec <<< FAILURE!
Running org.apache.hadoop.hbase.TestHBaseTestingUtility
Tests run: 7, Failures: 0, Errors: 0, Skipped: 0, Time elapsed: 60.037 sec
Running org.apache.hadoop.hbase.TestZooKeeper
Running org.apache.hadoop.hbase.snapshot.TestSnapshotDescriptionUtils
Tests run: 2, Failures: 0, Errors: 0, Skipped: 0, Time elapsed: 0.736 sec
Tests run: 10, Failures: 0, Errors: 0, Skipped: 0, Time elapsed: 96.737 sec
Running org.apache.hadoop.hbase.snapshot.TestFlushSnapshotFromClient
Tests run: 9, Failures: 0, Errors: 0, Skipped: 0, Time elapsed: 71.534 sec
Running org.apache.hadoop.hbase.snapshot.TestExportSnapshot
Tests run: 9, Failures: 0, Errors: 0, Skipped: 0, Time elapsed: 268.557 sec
Running org.apache.hadoop.hbase.snapshot.TestSecureExportSnapshot
Tests run: 9, Failures: 0, Errors: 0, Skipped: 0, Time elapsed: 375.494 sec
Running org.apache.hadoop.hbase.TestInfoServers
Tests run: 3, Failures: 0, Errors: 0, Skipped: 0, Time elapsed: 11.875 sec
Running org.apache.hadoop.hbase.procedure.TestZKProcedureControllers
Tests run: 4, Failures: 0, Errors: 0, Skipped: 0, Time elapsed: 1.939 sec
Running org.apache.hadoop.hbase.procedure.TestZKProcedure
Tests run: 4, Failures: 0, Errors: 0, Skipped: 0, Time elapsed: 1.88 sec
Running org.apache.hadoop.hbase.snapshot.TestRestoreFlushSnapshotFromClient
Tests run: 5, Failures: 0, Errors: 0, Skipped: 0, Time elapsed: 69.66 sec
Running org.apache.hadoop.hbase.io.hfile.TestForceCacheImportantBlocks
Tests run: 4, Failures: 0, Errors: 0, Skipped: 0, Time elapsed: 58.124 sec
Running org.apache.hadoop.hbase.io.hfile.TestHFileBlock
Tests run: 28, Failures: 0, Errors: 0, Skipped: 0, Time elapsed: 98.872 sec
Running org.apache.hadoop.hbase.io.hfile.TestCacheOnWrite
Tests run: 72, Failures: 0, Errors: 0, Skipped: 0, Time elapsed: 186.959 sec
Running org.apache.hadoop.hbase.io.hfile.TestHFileBlockIndex
Tests run: 10, Failures: 0, Errors: 0, Skipped: 0, Time elapsed: 10.367 sec
Running org.apache.hadoop.hbase.io.hfile.TestHFileSeek
Tests run: 1, Failures: 0, Errors: 0, Skipped: 0, Time elapsed: 3.965 sec
Running org.apache.hadoop.hbase.io.hfile.slab.TestSlabCache
Tests run: 7, Failures: 0, Errors: 0, Skipped: 0, Time elapsed: 20.926 sec
Running org.apache.hadoop.hbase.io.hfile.TestScannerSelectionUsingTTL
Tests run: 6, Failures: 0, Errors: 0, Skipped: 0, Time elapsed: 61.87 sec
Running org.apache.hadoop.hbase.io.hfile.slab.TestSingleSizeCache
Tests run: 5, Failures: 0, Errors: 0, Skipped: 0, Time elapsed: 41.138 sec
Running org.apache.hadoop.hbase.io.encoding.TestEncodedSeekers
Tests run: 20, Failures: 0, Errors: 0, Skipped: 0, Time elapsed: 105.847 sec
Running org.apache.hadoop.hbase.io.encoding.TestBufferedDataBlockEncoder
Tests run: 1, Failures: 0, Errors: 0, Skipped: 0, Time elapsed: 21.059 sec
Running org.apache.hadoop.hbase.io.encoding.TestChangingEncoding
Tests run: 3, Failures: 0, Errors: 0, Skipped: 0, Time elapsed: 87.382 sec
Running org.apache.hadoop.hbase.io.encoding.TestDataBlockEncoders
Tests run: 28, Failures: 0, Errors: 0, Skipped: 0, Time elapsed: 221.744 sec
Running org.apache.hadoop.hbase.io.encoding.TestPrefixTree
Tests run: 1, Failures: 0, Errors: 0, Skipped: 0, Time elapsed: 11.396 sec
Running org.apache.hadoop.hbase.io.TestFileLink
Tests run: 3, Failures: 0, Errors: 0, Skipped: 0, Time elapsed: 13.529 sec
Running org.apache.hadoop.hbase.io.encoding.TestLoadAndSwitchEncodeOnDisk
Tests run: 1, Failures: 0, Errors: 0, Skipped: 0, Time elapsed: 23.395 sec
Running org.apache.hadoop.hbase.zookeeper.TestZKLeaderManager
Tests run: 1, Failures: 0, Errors: 0, Skipped: 0, Time elapsed: 0.883 sec
Running org.apache.hadoop.hbase.zookeeper.TestZooKeeperNodeTracker
Tests run: 3, Failures: 0, Errors: 0, Skipped: 0, Time elapsed: 1.187 sec
Running org.apache.hadoop.hbase.zookeeper.TestZooKeeperACL
Tests run: 6, Failures: 0, Errors: 0, Skipped: 0, Time elapsed: 7.967 sec
Running org.apache.hadoop.hbase.zookeeper.TestRecoverableZooKeeper
Tests run: 1, Failures: 0, Errors: 0, Skipped: 0, Time elapsed: 1.795 sec
Running org.apache.hadoop.hbase.zookeeper.TestZKTable
Tests run: 1, Failures: 0, Errors: 0, Skipped: 0, Time elapsed: 0.983 sec
Running org.apache.hadoop.hbase.zookeeper.TestZKMulti
Tests run: 6, Failures: 0, Errors: 0, Skipped: 0, Time elapsed: 0.971 sec
Running org.apache.hadoop.hbase.zookeeper.TestHQuorumPeer
Tests run: 3, Failures: 0, Errors: 0, Skipped: 0, Time elapsed: 1.373 sec
Running org.apache.hadoop.hbase.TestIOFencing
Tests run: 2, Failures: 0, Errors: 0, Skipped: 2, Time elapsed: 0.01 sec
Running org.apache.hadoop.hbase.constraint.TestConstraint
Tests run: 5, Failures: 0, Errors: 0, Skipped: 0, Time elapsed: 20.098 sec
Running org.apache.hadoop.hbase.zookeeper.lock.TestZKInterProcessReadWriteLock
Tests run: 6, Failures: 0, Errors: 0, Skipped: 0, Time elapsed: 25.146 sec
Running org.apache.hadoop.hbase.backup.example.TestZooKeeperTableArchiveClient
Tests run: 3, Failures: 0, Errors: 0, Skipped: 0, Time elapsed: 4.348 sec
Running org.apache.hadoop.hbase.TestHColumnDescriptorDefaultVersions
Tests run: 3, Failures: 0, Errors: 0, Skipped: 0, Time elapsed: 30.534 sec
Running org.apache.hadoop.hbase.ipc.TestProtoBufRpc
Tests run: 1, Failures: 0, Errors: 0, Skipped: 0, Time elapsed: 1.183 sec
Running org.apache.hadoop.hbase.ipc.TestDelayedRpc
Tests run: 4, Failures: 0, Errors: 0, Skipped: 0, Time elapsed: 3.252 sec
Running org.apache.hadoop.hbase.ipc.TestHBaseClient
Tests run: 1, Failures: 0, Errors: 0, Skipped: 0, Time elapsed: 0.266 sec
Running org.apache.hadoop.hbase.TestNamespace
Tests run: 9, Failures: 0, Errors: 0, Skipped: 1, Time elapsed: 17.618 sec
Running org.apache.hadoop.hbase.backup.TestHFileArchiving
Tests run: 5, Failures: 0, Errors: 0, Skipped: 0, Time elapsed: 98.873 sec

Results :

Failed tests:   testCreateWithCorrectOwner(org.apache.hadoop.hbase.security.access.TestAccessController2)
  testGlobalPermissionList(org.apache.hadoop.hbase.security.access.TestAccessController):
expected:<4> but was:<3>
  testPreCompactSelection(org.apache.hadoop.hbase.security.access.TestAccessController): expected:<4>
but was:<3>
  testCheckPermissions(org.apache.hadoop.hbase.security.access.TestAccessController): expected:<4>
but was:<3>
  testFlush(org.apache.hadoop.hbase.security.access.TestAccessController): expected:<4>
but was:<3>
  testSplit(org.apache.hadoop.hbase.security.access.TestAccessController): expected:<4>
but was:<3>
  testWrite(org.apache.hadoop.hbase.security.access.TestAccessController): expected:<4>
but was:<3>
  testMove(org.apache.hadoop.hbase.security.access.TestAccessController): expected:<4>
but was:<3>
  testRead(org.apache.hadoop.hbase.security.access.TestAccessController): expected:<4>
but was:<3>
  testStopRegionServer(org.apache.hadoop.hbase.security.access.TestAccessController): expected:<4>
but was:<3>
  testRegionOffline(org.apache.hadoop.hbase.security.access.TestAccessController): expected:<4>
but was:<3>
  testTableDescriptorsEnumeration(org.apache.hadoop.hbase.security.access.TestAccessController):
expected:<4> but was:<3>
  testTableCreate(org.apache.hadoop.hbase.security.access.TestAccessController): expected:<4>
but was:<3>
  testTableDelete(org.apache.hadoop.hbase.security.access.TestAccessController): expected:<4>
but was:<3>
  testTableEnable(org.apache.hadoop.hbase.security.access.TestAccessController): expected:<4>
but was:<3>
  testBalance(org.apache.hadoop.hbase.security.access.TestAccessController): expected:<4>
but was:<3>
  testBulkLoad(org.apache.hadoop.hbase.security.access.TestAccessController): expected:<4>
but was:<3>
  testTableModify(org.apache.hadoop.hbase.security.access.TestAccessController): expected:<4>
but was:<3>
  testCloseRegion(org.apache.hadoop.hbase.security.access.TestAccessController): expected:<4>
but was:<3>
  testPostGrantRevokeAtQualifierLevel(org.apache.hadoop.hbase.security.access.TestAccessController):
expected:<4> but was:<3>
  testGrantRevoke(org.apache.hadoop.hbase.security.access.TestAccessController): expected:<4>
but was:<3>
  testReadWrite(org.apache.hadoop.hbase.security.access.TestAccessController): expected:<4>
but was:<3>
  testOpenRegion(org.apache.hadoop.hbase.security.access.TestAccessController): expected:<4>
but was:<3>
  testDeleteColumn(org.apache.hadoop.hbase.security.access.TestAccessController): expected:<4>
but was:<3>
  testTableDisable(org.apache.hadoop.hbase.security.access.TestAccessController): expected:<4>
but was:<3>
  testUnassign(org.apache.hadoop.hbase.security.access.TestAccessController): expected:<4>
but was:<3>
  testAddColumn(org.apache.hadoop.hbase.security.access.TestAccessController): expected:<4>
but was:<3>
  testRollWALWriterRequest(org.apache.hadoop.hbase.security.access.TestAccessController):
expected:<4> but was:<3>
  testShutdown(org.apache.hadoop.hbase.security.access.TestAccessController): expected:<4>
but was:<3>
  testCompact(org.apache.hadoop.hbase.security.access.TestAccessController): expected:<4>
but was:<3>
  testCoprocessorExec(org.apache.hadoop.hbase.security.access.TestAccessController): expected:<4>
but was:<3>
  testModifyColumn(org.apache.hadoop.hbase.security.access.TestAccessController): expected:<4>
but was:<3>
  testTableDeletion(org.apache.hadoop.hbase.security.access.TestAccessController): expected:<4>
but was:<3>
  testSplitWithSplitRow(org.apache.hadoop.hbase.security.access.TestAccessController): expected:<4>
but was:<3>
  testSnapshot(org.apache.hadoop.hbase.security.access.TestAccessController): expected:<4>
but was:<3>
  testPostGrantRevoke(org.apache.hadoop.hbase.security.access.TestAccessController): expected:<4>
but was:<3>
  testAppend(org.apache.hadoop.hbase.security.access.TestAccessController): expected:<4>
but was:<3>
  testAssign(org.apache.hadoop.hbase.security.access.TestAccessController): expected:<4>
but was:<3>
  testMergeRegions(org.apache.hadoop.hbase.security.access.TestAccessController): expected:<4>
but was:<3>
  testNamespaceUserGrant(org.apache.hadoop.hbase.security.access.TestAccessController): expected:<4>
but was:<3>
  testBalanceSwitch(org.apache.hadoop.hbase.security.access.TestAccessController): expected:<4>
but was:<3>
  testPermissionList(org.apache.hadoop.hbase.security.access.TestAccessController): expected:<4>
but was:<3>
  testReservedCellTags(org.apache.hadoop.hbase.security.access.TestAccessController): expected:<4>
but was:<3>
  testStopMaster(org.apache.hadoop.hbase.security.access.TestAccessController): expected:<4>
but was:<3>
  testGlobalAuthorizationForNewRegisteredRS(org.apache.hadoop.hbase.security.access.TestAccessController):
expected:<4> but was:<3>

Tests in error: 
  testCoveringCheck(org.apache.hadoop.hbase.security.access.TestCellACLs): Failed 1 action:
org.apache.hadoop.hbase.security.AccessDeniedException: Insufficient permissions (user=owner,
scope=testCoveringCheck, family=f1:q1, action=WRITE)(..)
  testCellPermissions(org.apache.hadoop.hbase.security.access.TestCellACLs): Failed 1 action:
org.apache.hadoop.hbase.security.AccessDeniedException: Insufficient permissions (user=owner,
scope=testCellPermissions, family=f1:q1, action=WRITE)(..)
  testEarlyScanTermination(org.apache.hadoop.hbase.security.access.TestScanEarlyTermination):
Failed 1 action: org.apache.hadoop.hbase.security.AccessDeniedException: Insufficient permissions
(user=owner, scope=testEarlyScanTermination, family=f1:q1, action=WRITE)(..)
  testDeleteWithFutureTimestamp(org.apache.hadoop.hbase.security.access.TestCellACLWithMultipleVersions):
Failed 1 action: org.apache.hadoop.hbase.security.AccessDeniedException: Insufficient permissions
(user=owner, scope=testDeleteWithFutureTimestamp, family=f1:q1, action=WRITE)(..)
  testCellPermissionsWithDeleteExactVersion(org.apache.hadoop.hbase.security.access.TestCellACLWithMultipleVersions):
Failed 1 action: org.apache.hadoop.hbase.security.AccessDeniedException: Insufficient permissions
(user=owner, scope=testCellPermissionsWithDeleteExactVersion, family=f1:q1, action=WRITE)(..)
  testCellPermissionsForCheckAndDelete(org.apache.hadoop.hbase.security.access.TestCellACLWithMultipleVersions):
Failed 1 action: org.apache.hadoop.hbase.security.AccessDeniedException: Insufficient permissions
(user=owner, scope=testCellPermissionsForCheckAndDelete, family=f1:q1|f1:q2, action=WRITE)(..)
  testCellPermissionsForPutWithMultipleVersions(org.apache.hadoop.hbase.security.access.TestCellACLWithMultipleVersions):
Failed 1 action: org.apache.hadoop.hbase.security.AccessDeniedException: Insufficient permissions
(user=owner, scope=testCellPermissionsForPutWithMultipleVersions, family=f1:q1, action=WRITE)(..)
  testCellPermissionsWithDeleteWithUserTs(org.apache.hadoop.hbase.security.access.TestCellACLWithMultipleVersions):
Failed 1 action: org.apache.hadoop.hbase.security.AccessDeniedException: Insufficient permissions
(user=owner, scope=testCellPermissionsWithDeleteWithUserTs, family=f1:q1|f1:q2, action=WRITE)(..)
  testCellPermissionsWithDeleteMutipleVersions(org.apache.hadoop.hbase.security.access.TestCellACLWithMultipleVersions):
Failed 1 action: org.apache.hadoop.hbase.security.AccessDeniedException: Insufficient permissions
(user=owner, scope=testCellPermissionsWithDeleteMutipleVersions, family=f1:q1|f1:q2, action=WRITE)(..)
  testCellPermissionwithVersions(org.apache.hadoop.hbase.security.access.TestCellACLWithMultipleVersions):
Failed 1 action: org.apache.hadoop.hbase.security.AccessDeniedException: Insufficient permissions
(user=owner, scope=testCellPermissionwithVersions, family=f1:q1, action=WRITE)(..)
  testCellPermissionsForIncrementWithMultipleVersions(org.apache.hadoop.hbase.security.access.TestCellACLWithMultipleVersions):
Failed 1 action: org.apache.hadoop.hbase.security.AccessDeniedException: Insufficient permissions
(user=owner, scope=testCellPermissionsForIncrementWithMultipleVersions, family=f1:q1, action=WRITE)(..)

Tests run: 2009, Failures: 45, Errors: 11, Skipped: 25

[INFO] ------------------------------------------------------------------------
[INFO] Reactor Summary:
[INFO] 
[INFO] HBase ............................................. SUCCESS [3.186s]
[INFO] HBase - Common .................................... SUCCESS [23.184s]
[INFO] HBase - Protocol .................................. SUCCESS [20.584s]
[INFO] HBase - Client .................................... SUCCESS [38.226s]
[INFO] HBase - Hadoop Compatibility ...................... SUCCESS [5.426s]
[INFO] HBase - Hadoop One Compatibility .................. SUCCESS [1.329s]
[INFO] HBase - Prefix Tree ............................... SUCCESS [3.772s]
[INFO] HBase - Server .................................... FAILURE [2:14:54.121s]
[INFO] HBase - Testing Util .............................. SKIPPED
[INFO] HBase - Thrift .................................... SKIPPED
[INFO] HBase - Shell ..................................... SKIPPED
[INFO] HBase - Integration Tests ......................... SKIPPED
[INFO] HBase - Examples .................................. SKIPPED
[INFO] HBase - Assembly .................................. SKIPPED
[INFO] ------------------------------------------------------------------------
[INFO] BUILD FAILURE
[INFO] ------------------------------------------------------------------------
[INFO] Total time: 2:16:30.612s
[INFO] Finished at: Fri Sep 19 19:34:34 UTC 2014
[INFO] Final Memory: 27M/717M
[INFO] ------------------------------------------------------------------------
[ERROR] Failed to execute goal org.apache.maven.plugins:maven-surefire-plugin:2.12-TRUNK-HBASE-2:test
(secondPartTestsExecution) on project hbase-server: There are test failures.
[ERROR] 
[ERROR] Please refer to <https://builds.apache.org/job/HBase-0.98-on-Hadoop-1.1/ws/hbase-server/target/surefire-reports>
for the individual test results.
[ERROR] -> [Help 1]
[ERROR] 
[ERROR] To see the full stack trace of the errors, re-run Maven with the -e switch.
[ERROR] Re-run Maven using the -X switch to enable full debug logging.
[ERROR] 
[ERROR] For more information about the errors and possible solutions, please read the following
articles:
[ERROR] [Help 1] http://cwiki.apache.org/confluence/display/MAVEN/MojoFailureException
[ERROR] 
[ERROR] After correcting the problems, you can resume the build with the command
[ERROR]   mvn <goals> -rf :hbase-server
Build step 'Invoke top-level Maven targets' marked build as failure
Performing Post build task...
Match found for :.* : True
Logical operation result is TRUE
Running script  :   ZOMBIE_TESTS_COUNT=`jps | grep surefirebooter | wc -l`
  if [[ $ZOMBIE_TESTS_COUNT != 0 ]] ; then
    #It seems sometimes the tests are not dying immediately. Let's give them 10s
    echo "Suspicious java process found - waiting 10s to see if there are just slow to stop"
    sleep 10
    ZOMBIE_TESTS_COUNT=`jps | grep surefirebooter | wc -l`
    if [[ $ZOMBIE_TESTS_COUNT != 0 ]] ; then
      echo "There are $ZOMBIE_TESTS_COUNT zombie tests, they should have been killed by surefire
but survived"
      echo "************ BEGIN zombies jstack extract"
      ZB_STACK=`jps | grep surefirebooter | cut -d ' ' -f 1 | xargs -n 1 jstack | grep ".test"
| grep "\.java"`
      jps | grep surefirebooter | cut -d ' ' -f 1 | xargs -n 1 jstack
      echo "************ END  zombies jstack extract"
      JIRA_COMMENT="$JIRA_COMMENT

     {color:red}-1 core zombie tests{color}.  There are ${ZOMBIE_TESTS_COUNT} zombie test(s):
${ZB_STACK}"
      BAD=1
      jps | grep surefirebooter | cut -d ' ' -f 1 | xargs kill -9
    else
      echo "We're ok: there is no zombie test, but some tests took some time to stop"
    fi
  else
    echo "We're ok: there is no zombie test"
  fi
[HBase-0.98-on-Hadoop-1.1] $ /bin/bash -xe /tmp/hudson5386885439211552740.sh
++ jps
++ grep surefirebooter
++ wc -l
+ ZOMBIE_TESTS_COUNT=0
+ [[ 0 != 0 ]]
+ echo 'We'\''re ok: there is no zombie test'
We're ok: there is no zombie test
POST BUILD TASK : SUCCESS
END OF POST BUILD TASK : 0
Archiving artifacts
Sending artifact delta relative to HBase-0.98-on-Hadoop-1.1 #492
Archived 1688 artifacts
Archive block size is 32768
Received 49 blocks and 404147077 bytes
Compression is 0.4%
Took 2 min 9 sec
Recording test results
Updating HBASE-11960

Mime
View raw message