hbase-builds mailing list archives

Site index · List index
Message view « Date » · « Thread »
Top « Date » · « Thread »
From Apache Jenkins Server <jenk...@builds.apache.org>
Subject Build failed in Jenkins: HBase-TRUNK #5549
Date Wed, 24 Sep 2014 00:26:16 GMT
See <https://builds.apache.org/job/HBase-TRUNK/5549/changes>

Changes:

[eclark] HBASE-12059 Create hbase-annotations module

------------------------------------------
[...truncated 1216 lines...]
[ERROR] Command was /bin/sh -c cd <https://builds.apache.org/job/HBase-TRUNK/ws/hbase-server>
&& /home/jenkins/tools/java/jdk1.7.0_25-32/jre/bin/java -enableassertions -XX:MaxDirectMemorySize=1G
-Xmx1900m -XX:MaxPermSize=256m -Djava.security.egd=file:/dev/./urandom -Djava.net.preferIPv4Stack=true
-Djava.awt.headless=true -jar <https://builds.apache.org/job/HBase-TRUNK/ws/hbase-server/target/surefire/surefirebooter2088712007395876949.jar>
<https://builds.apache.org/job/HBase-TRUNK/ws/hbase-server/target/surefire/surefire5990585959620391920tmp>
<https://builds.apache.org/job/HBase-TRUNK/ws/hbase-server/target/surefire/surefire_190890147662847775251tmp>
[ERROR] -> [Help 1]
[ERROR] 
[ERROR] To see the full stack trace of the errors, re-run Maven with the -e switch.
[ERROR] Re-run Maven using the -X switch to enable full debug logging.
[ERROR] 
[ERROR] For more information about the errors and possible solutions, please read the following
articles:
[ERROR] [Help 1] http://cwiki.apache.org/confluence/display/MAVEN/MojoFailureException
[ERROR] 
[ERROR] After correcting the problems, you can resume the build with the command
[ERROR]   mvn <goals> -rf :hbase-server
Build step 'Invoke top-level Maven targets' marked build as failure
Performing Post build task...
Match found for :.* : True
Logical operation result is TRUE
Running script  :   ZOMBIE_TESTS_COUNT=`jps | grep surefirebooter | wc -l`
  if [[ $ZOMBIE_TESTS_COUNT != 0 ]] ; then
    #It seems sometimes the tests are not dying immediately. Let's give them 10s
    echo "Suspicious java process found - waiting 10s to see if there are just slow to stop"
    sleep 10   
    ZOMBIE_TESTS_COUNT=`jps | grep surefirebooter | wc -l`
    if [[ $ZOMBIE_TESTS_COUNT != 0 ]] ; then
      echo "There are $ZOMBIE_TESTS_COUNT zombie tests, they should have been killed by surefire
but survived"
      echo "************ BEGIN zombies jstack extract"
      ZB_STACK=`jps | grep surefirebooter | cut -d ' ' -f 1 | xargs -n 1 jstack | grep ".test"
| grep "\.java"`
      jps | grep surefirebooter | cut -d ' ' -f 1 | xargs -n 1 jstack
      echo "************ END  zombies jstack extract"
      JIRA_COMMENT="$JIRA_COMMENT

     {color:red}-1 core zombie tests{color}.  There are ${ZOMBIE_TESTS_COUNT} zombie test(s):
${ZB_STACK}"
      BAD=1
      jps | grep surefirebooter | cut -d ' ' -f 1 | xargs kill -9
    else
      echo "We're ok: there is no zombie test, but some tests took some time to stop"
    fi
  else
    echo "We're ok: there is no zombie test"
  fi
[HBase-TRUNK] $ /bin/bash -xe /tmp/hudson7104429701863936331.sh
++ jps
++ grep surefirebooter
++ wc -l
+ ZOMBIE_TESTS_COUNT=1
+ [[ 1 != 0 ]]
+ echo 'Suspicious java process found - waiting 10s to see if there are just slow to stop'
Suspicious java process found - waiting 10s to see if there are just slow to stop
+ sleep 10
++ jps
++ grep surefirebooter
++ wc -l
+ ZOMBIE_TESTS_COUNT=1
+ [[ 1 != 0 ]]
+ echo 'There are 1 zombie tests, they should have been killed by surefire but survived'
There are 1 zombie tests, they should have been killed by surefire but survived
+ echo '************ BEGIN zombies jstack extract'
************ BEGIN zombies jstack extract
++ jps
++ grep surefirebooter
++ cut -d ' ' -f 1
++ grep .test
++ xargs -n 1 jstack
++ grep '\.java'
+ ZB_STACK='	at org.apache.blur.lucene.warmup.IndexWarmupTest.testIndexWarmup(IndexWarmupTest.java:55)'
+ jps
+ grep surefirebooter
+ cut -d ' ' -f 1
+ xargs -n 1 jstack
2014-09-24 00:24:34
Full thread dump Java HotSpot(TM) Server VM (20.45-b01 mixed mode):

"Attach Listener" daemon prio=10 tid=0xaa300800 nid=0x6434 waiting on condition [0x00000000]
   java.lang.Thread.State: RUNNABLE

"Lucene Merge Thread #1" daemon prio=10 tid=0xa9815400 nid=0x53a9 in Object.wait() [0xf207d000]
   java.lang.Thread.State: TIMED_WAITING (on object monitor)
	at java.lang.Object.wait(Native Method)
	at org.apache.blur.lucene.warmup.SlowAccessDirectory$SlowAccessIndexInput.delay(SlowAccessDirectory.java:48)
	- locked <0xb5093310> (a org.apache.blur.lucene.warmup.SlowAccessDirectory$SlowAccessIndexInput)
	at org.apache.blur.lucene.warmup.SlowAccessDirectory$SlowAccessIndexInput.readInternal(SlowAccessDirectory.java:72)
	at org.apache.lucene.store.BufferedIndexInput.refill(BufferedIndexInput.java:272)
	at org.apache.lucene.store.BufferedIndexInput.readByte(BufferedIndexInput.java:51)
	at org.apache.blur.lucene.warmup.TraceableIndexInput.readByte(TraceableIndexInput.java:62)
	at org.apache.lucene.store.DataInput.readVInt(DataInput.java:108)
	at org.apache.lucene.codecs.BlockTreeTermsReader$FieldReader$SegmentTermsEnum$Frame.loadBlock(BlockTreeTermsReader.java:2357)
	at org.apache.lucene.codecs.BlockTreeTermsReader$FieldReader$SegmentTermsEnum.next(BlockTreeTermsReader.java:2148)
	at org.apache.lucene.index.MultiTermsEnum.pushTop(MultiTermsEnum.java:292)
	at org.apache.lucene.index.MultiTermsEnum.next(MultiTermsEnum.java:318)
	at org.apache.lucene.codecs.TermsConsumer.merge(TermsConsumer.java:156)
	at org.apache.lucene.codecs.FieldsConsumer.merge(FieldsConsumer.java:72)
	at org.apache.lucene.index.SegmentMerger.mergeTerms(SegmentMerger.java:365)
	at org.apache.lucene.index.SegmentMerger.merge(SegmentMerger.java:98)
	at org.apache.lucene.index.IndexWriter.mergeMiddle(IndexWriter.java:3709)
	at org.apache.lucene.index.IndexWriter.merge(IndexWriter.java:3313)
	at org.apache.lucene.index.ConcurrentMergeScheduler.doMerge(ConcurrentMergeScheduler.java:401)
	at org.apache.lucene.index.ConcurrentMergeScheduler$MergeThread.run(ConcurrentMergeScheduler.java:478)

"Lucene Merge Thread #0" daemon prio=10 tid=0xa9158000 nid=0x512a in Object.wait() [0xf226e000]
   java.lang.Thread.State: TIMED_WAITING (on object monitor)
	at java.lang.Object.wait(Native Method)
	at org.apache.lucene.index.MergePolicy$OneMerge.checkAborted(MergePolicy.java:211)
	- locked <0xbf7411e0> (a org.apache.lucene.index.MergePolicy$OneMerge)
	at org.apache.lucene.index.MergeState$CheckAbort.work(MergeState.java:197)
	at org.apache.lucene.codecs.TermsConsumer.merge(TermsConsumer.java:171)
	at org.apache.lucene.codecs.FieldsConsumer.merge(FieldsConsumer.java:72)
	at org.apache.lucene.index.SegmentMerger.mergeTerms(SegmentMerger.java:365)
	at org.apache.lucene.index.SegmentMerger.merge(SegmentMerger.java:98)
	at org.apache.lucene.index.IndexWriter.mergeMiddle(IndexWriter.java:3709)
	at org.apache.lucene.index.IndexWriter.merge(IndexWriter.java:3313)
	at org.apache.lucene.index.ConcurrentMergeScheduler.doMerge(ConcurrentMergeScheduler.java:401)
	at org.apache.lucene.index.ConcurrentMergeScheduler$MergeThread.run(ConcurrentMergeScheduler.java:478)

"Low Memory Detector" daemon prio=10 tid=0xaa95b800 nid=0x4e4b runnable [0x00000000]
   java.lang.Thread.State: RUNNABLE

"C2 CompilerThread1" daemon prio=10 tid=0xaa959c00 nid=0x4e4a waiting on condition [0x00000000]
   java.lang.Thread.State: RUNNABLE

"C2 CompilerThread0" daemon prio=10 tid=0xaa958000 nid=0x4e49 waiting on condition [0x00000000]
   java.lang.Thread.State: RUNNABLE

"Signal Dispatcher" daemon prio=10 tid=0xaa956800 nid=0x4e48 runnable [0x00000000]
   java.lang.Thread.State: RUNNABLE

"Surrogate Locker Thread (Concurrent GC)" daemon prio=10 tid=0xaa955000 nid=0x4e47 waiting
on condition [0x00000000]
   java.lang.Thread.State: RUNNABLE

"Finalizer" daemon prio=10 tid=0xaa947400 nid=0x4e46 in Object.wait() [0xf307d000]
   java.lang.Thread.State: WAITING (on object monitor)
	at java.lang.Object.wait(Native Method)
	- waiting on <0xb5d10428> (a java.lang.ref.ReferenceQueue$Lock)
	at java.lang.ref.ReferenceQueue.remove(ReferenceQueue.java:118)
	- locked <0xb5d10428> (a java.lang.ref.ReferenceQueue$Lock)
	at java.lang.ref.ReferenceQueue.remove(ReferenceQueue.java:134)
	at java.lang.ref.Finalizer$FinalizerThread.run(Finalizer.java:171)

"Reference Handler" daemon prio=10 tid=0xaa946000 nid=0x4e45 in Object.wait() [0xf327d000]
   java.lang.Thread.State: WAITING (on object monitor)
	at java.lang.Object.wait(Native Method)
	- waiting on <0xb5d10438> (a java.lang.ref.Reference$Lock)
	at java.lang.Object.wait(Object.java:485)
	at java.lang.ref.Reference$ReferenceHandler.run(Reference.java:116)
	- locked <0xb5d10438> (a java.lang.ref.Reference$Lock)

"main" prio=10 tid=0xf6805400 nid=0x4e31 in Object.wait() [0xf6967000]
   java.lang.Thread.State: WAITING (on object monitor)
	at java.lang.Object.wait(Native Method)
	at java.lang.Object.wait(Object.java:485)
	at org.apache.lucene.index.ConcurrentMergeScheduler.merge(ConcurrentMergeScheduler.java:349)
	- locked <0xb615b0f0> (a org.apache.lucene.index.ConcurrentMergeScheduler)
	at org.apache.lucene.index.IndexWriter.maybeMerge(IndexWriter.java:1859)
	at org.apache.lucene.index.IndexWriter.updateDocument(IndexWriter.java:1496)
	at org.apache.lucene.index.IndexWriter.addDocument(IndexWriter.java:1160)
	at org.apache.lucene.index.IndexWriter.addDocument(IndexWriter.java:1141)
	at org.apache.blur.lucene.warmup.IndexWarmupTest.addDocs(IndexWarmupTest.java:149)
	at org.apache.blur.lucene.warmup.IndexWarmupTest.populate(IndexWarmupTest.java:143)
	at org.apache.blur.lucene.warmup.IndexWarmupTest.getIndexReader(IndexWarmupTest.java:131)
	at org.apache.blur.lucene.warmup.IndexWarmupTest.testIndexWarmup(IndexWarmupTest.java:55)
	at sun.reflect.NativeMethodAccessorImpl.invoke0(Native Method)
	at sun.reflect.NativeMethodAccessorImpl.invoke(NativeMethodAccessorImpl.java:39)
	at sun.reflect.DelegatingMethodAccessorImpl.invoke(DelegatingMethodAccessorImpl.java:25)
	at java.lang.reflect.Method.invoke(Method.java:597)
	at org.junit.runners.model.FrameworkMethod$1.runReflectiveCall(FrameworkMethod.java:44)
	at org.junit.internal.runners.model.ReflectiveCallable.run(ReflectiveCallable.java:15)
	at org.junit.runners.model.FrameworkMethod.invokeExplosively(FrameworkMethod.java:41)
	at org.junit.internal.runners.statements.InvokeMethod.evaluate(InvokeMethod.java:20)
	at org.junit.runners.ParentRunner.runLeaf(ParentRunner.java:263)
	at org.junit.runners.BlockJUnit4ClassRunner.runChild(BlockJUnit4ClassRunner.java:69)
	at org.junit.runners.BlockJUnit4ClassRunner.runChild(BlockJUnit4ClassRunner.java:48)
	at org.junit.runners.ParentRunner$3.run(ParentRunner.java:231)
	at org.junit.runners.ParentRunner$1.schedule(ParentRunner.java:60)
	at org.junit.runners.ParentRunner.runChildren(ParentRunner.java:229)
	at org.junit.runners.ParentRunner.access$000(ParentRunner.java:50)
	at org.junit.runners.ParentRunner$2.evaluate(ParentRunner.java:222)
	at org.junit.runners.ParentRunner.run(ParentRunner.java:292)
	at org.apache.maven.surefire.junit4.JUnit4Provider.execute(JUnit4Provider.java:252)
	at org.apache.maven.surefire.junit4.JUnit4Provider.executeTestSet(JUnit4Provider.java:141)
	at org.apache.maven.surefire.junit4.JUnit4Provider.invoke(JUnit4Provider.java:112)
	at sun.reflect.NativeMethodAccessorImpl.invoke0(Native Method)
	at sun.reflect.NativeMethodAccessorImpl.invoke(NativeMethodAccessorImpl.java:39)
	at sun.reflect.DelegatingMethodAccessorImpl.invoke(DelegatingMethodAccessorImpl.java:25)
	at java.lang.reflect.Method.invoke(Method.java:597)
	at org.apache.maven.surefire.util.ReflectionUtils.invokeMethodWithArray(ReflectionUtils.java:189)
	at org.apache.maven.surefire.booter.ProviderFactory$ProviderProxy.invoke(ProviderFactory.java:165)
	at org.apache.maven.surefire.booter.ProviderFactory.invokeProvider(ProviderFactory.java:85)
	at org.apache.maven.surefire.booter.ForkedBooter.runSuitesInProcess(ForkedBooter.java:115)
	at org.apache.maven.surefire.booter.ForkedBooter.main(ForkedBooter.java:75)

"VM Thread" prio=10 tid=0xaa942400 nid=0x4e44 runnable 

"Gang worker#0 (Parallel GC Threads)" prio=10 tid=0xf6809c00 nid=0x4e32 runnable 

"Gang worker#1 (Parallel GC Threads)" prio=10 tid=0xf680b000 nid=0x4e33 runnable 

"Gang worker#2 (Parallel GC Threads)" prio=10 tid=0xf680c800 nid=0x4e34 runnable 

"Gang worker#3 (Parallel GC Threads)" prio=10 tid=0xf680dc00 nid=0x4e35 runnable 

"Gang worker#4 (Parallel GC Threads)" prio=10 tid=0xf680f400 nid=0x4e36 runnable 

"Gang worker#5 (Parallel GC Threads)" prio=10 tid=0xf6810800 nid=0x4e37 runnable 

"Gang worker#6 (Parallel GC Threads)" prio=10 tid=0xf6812000 nid=0x4e38 runnable 

"Gang worker#7 (Parallel GC Threads)" prio=10 tid=0xf6813400 nid=0x4e39 runnable 

"Gang worker#8 (Parallel GC Threads)" prio=10 tid=0xf6814c00 nid=0x4e3a runnable 

"Gang worker#9 (Parallel GC Threads)" prio=10 tid=0xf6816000 nid=0x4e3b runnable 

"Gang worker#10 (Parallel GC Threads)" prio=10 tid=0xf6817800 nid=0x4e3c runnable 

"Gang worker#11 (Parallel GC Threads)" prio=10 tid=0xf6818c00 nid=0x4e3d runnable 

"Gang worker#12 (Parallel GC Threads)" prio=10 tid=0xf681a400 nid=0x4e3e runnable 

"Concurrent Mark-Sweep GC Thread" prio=10 tid=0xad8fa400 nid=0x4e43 runnable 
"Gang worker#0 (Parallel CMS Threads)" prio=10 tid=0xad8b4400 nid=0x4e3f runnable 

"Gang worker#1 (Parallel CMS Threads)" prio=10 tid=0xad8b5c00 nid=0x4e40 runnable 

"Gang worker#2 (Parallel CMS Threads)" prio=10 tid=0xad8b7000 nid=0x4e41 runnable 

"Gang worker#3 (Parallel CMS Threads)" prio=10 tid=0xad8b8800 nid=0x4e42 runnable 

"VM Periodic Task Thread" prio=10 tid=0xaa95d800 nid=0x4e4c waiting on condition 

JNI global references: 1165

+ echo '************ END  zombies jstack extract'
************ END  zombies jstack extract
+ JIRA_COMMENT='

     {color:red}-1 core zombie tests{color}.  There are 1 zombie test(s): 	at org.apache.blur.lucene.warmup.IndexWarmupTest.testIndexWarmup(IndexWarmupTest.java:55)'
+ BAD=1
+ jps
+ grep surefirebooter
+ cut -d ' ' -f 1
+ xargs kill -9
POST BUILD TASK : SUCCESS
END OF POST BUILD TASK : 0
Archiving artifacts
Sending artifact delta relative to HBase-TRUNK #5546
Archived 901 artifacts
Archive block size is 32768
Received 8 blocks and 33772563 bytes
Compression is 0.8%
Took 44 sec
Recording test results
Updating HBASE-12059

Mime
View raw message