hbase-builds mailing list archives

Site index · List index
Message view « Date » · « Thread »
Top « Date » · « Thread »
From Apache Jenkins Server <jenk...@builds.apache.org>
Subject Build failed in Jenkins: HBase-0.98-on-Hadoop-1.1 #499
Date Fri, 19 Sep 2014 02:53:04 GMT
See <https://builds.apache.org/job/HBase-0.98-on-Hadoop-1.1/499/changes>

Changes:

[stack] HBASE-12019 hbase-daemon.sh overwrite HBASE_ROOT_LOGGER and HBASE_SECURITY_LOGGER
variables (Sebastien Barrier)

------------------------------------------
[...truncated 1525 lines...]
Tests run: 1, Failures: 1, Errors: 0, Skipped: 0, Time elapsed: 13.62 sec <<< FAILURE!
Running org.apache.hadoop.hbase.security.token.TestZKSecretWatcher
Tests run: 1, Failures: 0, Errors: 0, Skipped: 0, Time elapsed: 14.976 sec
Running org.apache.hadoop.hbase.security.token.TestTokenAuthentication
Tests run: 2, Failures: 0, Errors: 0, Skipped: 0, Time elapsed: 2.333 sec
Running org.apache.hadoop.hbase.security.visibility.TestEnforcingScanLabelGenerator
Tests run: 1, Failures: 0, Errors: 0, Skipped: 0, Time elapsed: 13.921 sec
Running org.apache.hadoop.hbase.security.visibility.TestVisibilityWithCheckAuths
Tests run: 2, Failures: 0, Errors: 0, Skipped: 0, Time elapsed: 13.292 sec
Running org.apache.hadoop.hbase.security.access.TestAccessController
Running org.apache.hadoop.hbase.security.visibility.TestVisibilityLabelsWithSLGStack
Tests run: 1, Failures: 0, Errors: 0, Skipped: 0, Time elapsed: 13.132 sec
Tests run: 44, Failures: 44, Errors: 0, Skipped: 0, Time elapsed: 79.341 sec <<<
FAILURE!
Running org.apache.hadoop.hbase.security.visibility.TestVisibilityLabelsOpWithDifferentUsersNoACL
Tests run: 1, Failures: 0, Errors: 0, Skipped: 0, Time elapsed: 12.243 sec
Running org.apache.hadoop.hbase.security.visibility.TestVisibilityLabelsWithACL
Tests run: 5, Failures: 0, Errors: 0, Skipped: 0, Time elapsed: 17.435 sec
Running org.apache.hadoop.hbase.security.visibility.TestVisibilityLabelsWithDistributedLogReplay
Tests run: 21, Failures: 0, Errors: 0, Skipped: 0, Time elapsed: 38.06 sec
Running org.apache.hadoop.hbase.security.visibility.TestVisibilityLabelsWithDefaultVisLabelService
Tests run: 21, Failures: 0, Errors: 0, Skipped: 0, Time elapsed: 37.629 sec
Running org.apache.hadoop.hbase.security.visibility.TestVisibilityLabelsWithCustomVisLabService
Tests run: 19, Failures: 0, Errors: 0, Skipped: 0, Time elapsed: 36.03 sec
Running org.apache.hadoop.hbase.fs.TestBlockReorder
Tests run: 3, Failures: 0, Errors: 0, Skipped: 0, Time elapsed: 28.892 sec
Running org.apache.hadoop.hbase.security.visibility.TestVisibilityLabelsWithDeletes
Tests run: 37, Failures: 0, Errors: 0, Skipped: 0, Time elapsed: 79.365 sec
Running org.apache.hadoop.hbase.TestInfoServers
Tests run: 3, Failures: 0, Errors: 0, Skipped: 0, Time elapsed: 13.62 sec
Running org.apache.hadoop.hbase.backup.example.TestZooKeeperTableArchiveClient
Tests run: 3, Failures: 0, Errors: 0, Skipped: 0, Time elapsed: 4.679 sec
Running org.apache.hadoop.hbase.zookeeper.TestZKTable
Tests run: 1, Failures: 0, Errors: 0, Skipped: 0, Time elapsed: 1.552 sec
Running org.apache.hadoop.hbase.zookeeper.TestHQuorumPeer
Tests run: 3, Failures: 0, Errors: 0, Skipped: 0, Time elapsed: 1.854 sec
Running org.apache.hadoop.hbase.zookeeper.lock.TestZKInterProcessReadWriteLock
Tests run: 6, Failures: 0, Errors: 0, Skipped: 0, Time elapsed: 25.466 sec
Running org.apache.hadoop.hbase.zookeeper.TestRecoverableZooKeeper
Tests run: 1, Failures: 0, Errors: 0, Skipped: 0, Time elapsed: 1.913 sec
Running org.apache.hadoop.hbase.zookeeper.TestZKLeaderManager
Tests run: 1, Failures: 0, Errors: 0, Skipped: 0, Time elapsed: 1.056 sec
Running org.apache.hadoop.hbase.zookeeper.TestZooKeeperACL
Tests run: 6, Failures: 0, Errors: 0, Skipped: 0, Time elapsed: 8.732 sec
Running org.apache.hadoop.hbase.zookeeper.TestZooKeeperNodeTracker
Tests run: 3, Failures: 0, Errors: 0, Skipped: 0, Time elapsed: 1.417 sec
Running org.apache.hadoop.hbase.zookeeper.TestZKMulti
Tests run: 6, Failures: 0, Errors: 0, Skipped: 0, Time elapsed: 1.249 sec
Running org.apache.hadoop.hbase.backup.TestHFileArchiving
Tests run: 5, Failures: 0, Errors: 0, Skipped: 0, Time elapsed: 99.828 sec
Running org.apache.hadoop.hbase.mapreduce.TestTableMapReduce
Tests run: 2, Failures: 0, Errors: 0, Skipped: 0, Time elapsed: 229.587 sec
Running org.apache.hadoop.hbase.mapreduce.TestHLogRecordReader
Tests run: 2, Failures: 0, Errors: 0, Skipped: 0, Time elapsed: 5.152 sec
Running org.apache.hadoop.hbase.mapreduce.TestTableInputFormatScan2
Tests run: 7, Failures: 0, Errors: 0, Skipped: 0, Time elapsed: 387.968 sec
Running org.apache.hadoop.hbase.mapreduce.TestWALPlayer
Tests run: 3, Failures: 0, Errors: 0, Skipped: 0, Time elapsed: 166.86 sec
Running org.apache.hadoop.hbase.mapreduce.TestImportExport
Tests run: 11, Failures: 0, Errors: 0, Skipped: 0, Time elapsed: 368.452 sec
Running org.apache.hadoop.hbase.mapreduce.TestImportTSVWithOperationAttributes
Tests run: 2, Failures: 0, Errors: 0, Skipped: 0, Time elapsed: 77.492 sec
Running org.apache.hadoop.hbase.mapreduce.TestCopyTable
Tests run: 4, Failures: 0, Errors: 0, Skipped: 0, Time elapsed: 217.029 sec
Running org.apache.hadoop.hbase.mapreduce.TestRowCounter
Tests run: 5, Failures: 0, Errors: 0, Skipped: 0, Time elapsed: 96.809 sec
Running org.apache.hadoop.hbase.mapreduce.TestSecureLoadIncrementalHFiles
Tests run: 12, Failures: 0, Errors: 0, Skipped: 0, Time elapsed: 72.737 sec
Running org.apache.hadoop.hbase.mapreduce.TestTimeRangeMapRed
Tests run: 1, Failures: 0, Errors: 0, Skipped: 0, Time elapsed: 39.343 sec
Running org.apache.hadoop.hbase.mapreduce.TestImportTsv
Tests run: 7, Failures: 0, Errors: 0, Skipped: 0, Time elapsed: 279.98 sec
Running org.apache.hadoop.hbase.mapreduce.TestLoadIncrementalHFiles
Tests run: 12, Failures: 0, Errors: 0, Skipped: 0, Time elapsed: 67.256 sec
Running org.apache.hadoop.hbase.mapreduce.TestHRegionPartitioner
Tests run: 1, Failures: 0, Errors: 0, Skipped: 0, Time elapsed: 75.579 sec
Running org.apache.hadoop.hbase.mapreduce.TestLoadIncrementalHFilesSplitRecovery
Tests run: 5, Failures: 0, Errors: 0, Skipped: 0, Time elapsed: 50.896 sec
Running org.apache.hadoop.hbase.mapreduce.TestTableSnapshotInputFormat
Tests run: 7, Failures: 0, Errors: 0, Skipped: 0, Time elapsed: 420.571 sec
Running org.apache.hadoop.hbase.mapreduce.TestImportTSVWithVisibilityLabels
Tests run: 5, Failures: 0, Errors: 0, Skipped: 0, Time elapsed: 186.209 sec
Running org.apache.hadoop.hbase.mapreduce.TestMultithreadedTableMapper
Tests run: 1, Failures: 0, Errors: 0, Skipped: 0, Time elapsed: 102.245 sec
Running org.apache.hadoop.hbase.mapreduce.TestHFileOutputFormat
Tests run: 13, Failures: 0, Errors: 0, Skipped: 1, Time elapsed: 330.83 sec
Running org.apache.hadoop.hbase.mapreduce.TestHFileOutputFormat2
Tests run: 13, Failures: 0, Errors: 0, Skipped: 1, Time elapsed: 201.714 sec
Running org.apache.hadoop.hbase.mapreduce.TestCellCounter
Tests run: 2, Failures: 0, Errors: 0, Skipped: 0, Time elapsed: 111.175 sec
Running org.apache.hadoop.hbase.mapreduce.TestSecureLoadIncrementalHFilesSplitRecovery
Tests run: 5, Failures: 0, Errors: 0, Skipped: 0, Time elapsed: 62.051 sec
Running org.apache.hadoop.hbase.filter.TestFilterWithScanLimits
Tests run: 1, Failures: 0, Errors: 0, Skipped: 0, Time elapsed: 13.792 sec
Running org.apache.hadoop.hbase.filter.TestFuzzyRowAndColumnRangeFilter
Tests run: 1, Failures: 0, Errors: 0, Skipped: 0, Time elapsed: 14.267 sec
Running org.apache.hadoop.hbase.filter.TestColumnRangeFilter
Tests run: 1, Failures: 0, Errors: 0, Skipped: 0, Time elapsed: 21.526 sec
Running org.apache.hadoop.hbase.filter.TestFilterWrapper
Tests run: 1, Failures: 0, Errors: 0, Skipped: 0, Time elapsed: 14.953 sec
Running org.apache.hadoop.hbase.mapreduce.TestTableInputFormatScan1
Tests run: 5, Failures: 0, Errors: 0, Skipped: 0, Time elapsed: 339.406 sec

Results :

Failed tests:   testCreateWithCorrectOwner(org.apache.hadoop.hbase.security.access.TestAccessController2)
  testGlobalPermissionList(org.apache.hadoop.hbase.security.access.TestAccessController):
expected:<4> but was:<3>
  testPreCompactSelection(org.apache.hadoop.hbase.security.access.TestAccessController): expected:<4>
but was:<3>
  testCheckPermissions(org.apache.hadoop.hbase.security.access.TestAccessController): expected:<4>
but was:<3>
  testFlush(org.apache.hadoop.hbase.security.access.TestAccessController): expected:<4>
but was:<3>
  testSplit(org.apache.hadoop.hbase.security.access.TestAccessController): expected:<4>
but was:<3>
  testWrite(org.apache.hadoop.hbase.security.access.TestAccessController): expected:<4>
but was:<3>
  testMove(org.apache.hadoop.hbase.security.access.TestAccessController): expected:<4>
but was:<3>
  testRead(org.apache.hadoop.hbase.security.access.TestAccessController): expected:<4>
but was:<3>
  testStopRegionServer(org.apache.hadoop.hbase.security.access.TestAccessController): expected:<4>
but was:<3>
  testRegionOffline(org.apache.hadoop.hbase.security.access.TestAccessController): expected:<4>
but was:<3>
  testTableDescriptorsEnumeration(org.apache.hadoop.hbase.security.access.TestAccessController):
expected:<4> but was:<3>
  testTableCreate(org.apache.hadoop.hbase.security.access.TestAccessController): expected:<4>
but was:<3>
  testTableDelete(org.apache.hadoop.hbase.security.access.TestAccessController): expected:<4>
but was:<3>
  testTableEnable(org.apache.hadoop.hbase.security.access.TestAccessController): expected:<4>
but was:<3>
  testBalance(org.apache.hadoop.hbase.security.access.TestAccessController): expected:<4>
but was:<3>
  testBulkLoad(org.apache.hadoop.hbase.security.access.TestAccessController): expected:<4>
but was:<3>
  testTableModify(org.apache.hadoop.hbase.security.access.TestAccessController): expected:<4>
but was:<3>
  testCloseRegion(org.apache.hadoop.hbase.security.access.TestAccessController): expected:<4>
but was:<3>
  testPostGrantRevokeAtQualifierLevel(org.apache.hadoop.hbase.security.access.TestAccessController):
expected:<4> but was:<3>
  testGrantRevoke(org.apache.hadoop.hbase.security.access.TestAccessController): expected:<4>
but was:<3>
  testReadWrite(org.apache.hadoop.hbase.security.access.TestAccessController): expected:<4>
but was:<3>
  testOpenRegion(org.apache.hadoop.hbase.security.access.TestAccessController): expected:<4>
but was:<3>
  testDeleteColumn(org.apache.hadoop.hbase.security.access.TestAccessController): expected:<4>
but was:<3>
  testTableDisable(org.apache.hadoop.hbase.security.access.TestAccessController): expected:<4>
but was:<3>
  testUnassign(org.apache.hadoop.hbase.security.access.TestAccessController): expected:<4>
but was:<3>
  testAddColumn(org.apache.hadoop.hbase.security.access.TestAccessController): expected:<4>
but was:<3>
  testRollWALWriterRequest(org.apache.hadoop.hbase.security.access.TestAccessController):
expected:<4> but was:<3>
  testShutdown(org.apache.hadoop.hbase.security.access.TestAccessController): expected:<4>
but was:<3>
  testCompact(org.apache.hadoop.hbase.security.access.TestAccessController): expected:<4>
but was:<3>
  testCoprocessorExec(org.apache.hadoop.hbase.security.access.TestAccessController): expected:<4>
but was:<3>
  testModifyColumn(org.apache.hadoop.hbase.security.access.TestAccessController): expected:<4>
but was:<3>
  testTableDeletion(org.apache.hadoop.hbase.security.access.TestAccessController): expected:<4>
but was:<3>
  testSplitWithSplitRow(org.apache.hadoop.hbase.security.access.TestAccessController): expected:<4>
but was:<3>
  testSnapshot(org.apache.hadoop.hbase.security.access.TestAccessController): expected:<4>
but was:<3>
  testPostGrantRevoke(org.apache.hadoop.hbase.security.access.TestAccessController): expected:<4>
but was:<3>
  testAppend(org.apache.hadoop.hbase.security.access.TestAccessController): expected:<4>
but was:<3>
  testAssign(org.apache.hadoop.hbase.security.access.TestAccessController): expected:<4>
but was:<3>
  testMergeRegions(org.apache.hadoop.hbase.security.access.TestAccessController): expected:<4>
but was:<3>
  testNamespaceUserGrant(org.apache.hadoop.hbase.security.access.TestAccessController): expected:<4>
but was:<3>
  testBalanceSwitch(org.apache.hadoop.hbase.security.access.TestAccessController): expected:<4>
but was:<3>
  testPermissionList(org.apache.hadoop.hbase.security.access.TestAccessController): expected:<4>
but was:<3>
  testReservedCellTags(org.apache.hadoop.hbase.security.access.TestAccessController): expected:<4>
but was:<3>
  testStopMaster(org.apache.hadoop.hbase.security.access.TestAccessController): expected:<4>
but was:<3>
  testGlobalAuthorizationForNewRegisteredRS(org.apache.hadoop.hbase.security.access.TestAccessController):
expected:<4> but was:<3>

Tests in error: 
  testLogFilesAreArchived(org.apache.hadoop.hbase.master.TestSplitLogManager): test timed
out after 60000 milliseconds
  testEarlyScanTermination(org.apache.hadoop.hbase.security.access.TestScanEarlyTermination):
Failed 1 action: org.apache.hadoop.hbase.security.AccessDeniedException: Insufficient permissions
(user=owner, scope=testEarlyScanTermination, family=f1:q1, action=WRITE)(..)
  testCoveringCheck(org.apache.hadoop.hbase.security.access.TestCellACLs): Failed 1 action:
org.apache.hadoop.hbase.security.AccessDeniedException: Insufficient permissions (user=owner,
scope=testCoveringCheck, family=f1:q1, action=WRITE)(..)
  testCellPermissions(org.apache.hadoop.hbase.security.access.TestCellACLs): Failed 1 action:
org.apache.hadoop.hbase.security.AccessDeniedException: Insufficient permissions (user=owner,
scope=testCellPermissions, family=f1:q1, action=WRITE)(..)
  testDeleteWithFutureTimestamp(org.apache.hadoop.hbase.security.access.TestCellACLWithMultipleVersions):
Failed 1 action: org.apache.hadoop.hbase.security.AccessDeniedException: Insufficient permissions
(user=owner, scope=testDeleteWithFutureTimestamp, family=f1:q1, action=WRITE)(..)
  testCellPermissionsWithDeleteExactVersion(org.apache.hadoop.hbase.security.access.TestCellACLWithMultipleVersions):
Failed 1 action: org.apache.hadoop.hbase.security.AccessDeniedException: Insufficient permissions
(user=owner, scope=testCellPermissionsWithDeleteExactVersion, family=f1:q1, action=WRITE)(..)
  testCellPermissionsForCheckAndDelete(org.apache.hadoop.hbase.security.access.TestCellACLWithMultipleVersions):
Failed 1 action: org.apache.hadoop.hbase.security.AccessDeniedException: Insufficient permissions
(user=owner, scope=testCellPermissionsForCheckAndDelete, family=f1:q1|f1:q2, action=WRITE)(..)
  testCellPermissionsForPutWithMultipleVersions(org.apache.hadoop.hbase.security.access.TestCellACLWithMultipleVersions):
Failed 1 action: org.apache.hadoop.hbase.security.AccessDeniedException: Insufficient permissions
(user=owner, scope=testCellPermissionsForPutWithMultipleVersions, family=f1:q1, action=WRITE)(..)
  testCellPermissionsWithDeleteWithUserTs(org.apache.hadoop.hbase.security.access.TestCellACLWithMultipleVersions):
Failed 1 action: org.apache.hadoop.hbase.security.AccessDeniedException: Insufficient permissions
(user=owner, scope=testCellPermissionsWithDeleteWithUserTs, family=f1:q1|f1:q2, action=WRITE)(..)
  testCellPermissionsWithDeleteMutipleVersions(org.apache.hadoop.hbase.security.access.TestCellACLWithMultipleVersions):
Failed 1 action: org.apache.hadoop.hbase.security.AccessDeniedException: Insufficient permissions
(user=owner, scope=testCellPermissionsWithDeleteMutipleVersions, family=f1:q1|f1:q2, action=WRITE)(..)
  testCellPermissionwithVersions(org.apache.hadoop.hbase.security.access.TestCellACLWithMultipleVersions):
Failed 1 action: org.apache.hadoop.hbase.security.AccessDeniedException: Insufficient permissions
(user=owner, scope=testCellPermissionwithVersions, family=f1:q1, action=WRITE)(..)
  testCellPermissionsForIncrementWithMultipleVersions(org.apache.hadoop.hbase.security.access.TestCellACLWithMultipleVersions):
Failed 1 action: org.apache.hadoop.hbase.security.AccessDeniedException: Insufficient permissions
(user=owner, scope=testCellPermissionsForIncrementWithMultipleVersions, family=f1:q1, action=WRITE)(..)

Tests run: 2009, Failures: 45, Errors: 12, Skipped: 25

[INFO] ------------------------------------------------------------------------
[INFO] Reactor Summary:
[INFO] 
[INFO] HBase ............................................. SUCCESS [6.463s]
[INFO] HBase - Common .................................... SUCCESS [54.959s]
[INFO] HBase - Protocol .................................. SUCCESS [46.462s]
[INFO] HBase - Client .................................... SUCCESS [46.688s]
[INFO] HBase - Hadoop Compatibility ...................... SUCCESS [10.235s]
[INFO] HBase - Hadoop One Compatibility .................. SUCCESS [6.424s]
[INFO] HBase - Prefix Tree ............................... SUCCESS [13.961s]
[INFO] HBase - Server .................................... FAILURE [2:26:41.777s]
[INFO] HBase - Testing Util .............................. SKIPPED
[INFO] HBase - Thrift .................................... SKIPPED
[INFO] HBase - Shell ..................................... SKIPPED
[INFO] HBase - Integration Tests ......................... SKIPPED
[INFO] HBase - Examples .................................. SKIPPED
[INFO] HBase - Assembly .................................. SKIPPED
[INFO] ------------------------------------------------------------------------
[INFO] BUILD FAILURE
[INFO] ------------------------------------------------------------------------
[INFO] Total time: 2:29:48.877s
[INFO] Finished at: Fri Sep 19 02:49:08 UTC 2014
[INFO] Final Memory: 36M/979M
[INFO] ------------------------------------------------------------------------
[ERROR] Failed to execute goal org.apache.maven.plugins:maven-surefire-plugin:2.12-TRUNK-HBASE-2:test
(secondPartTestsExecution) on project hbase-server: There are test failures.
[ERROR] 
[ERROR] Please refer to <https://builds.apache.org/job/HBase-0.98-on-Hadoop-1.1/ws/hbase-server/target/surefire-reports>
for the individual test results.
[ERROR] -> [Help 1]
[ERROR] 
[ERROR] To see the full stack trace of the errors, re-run Maven with the -e switch.
[ERROR] Re-run Maven using the -X switch to enable full debug logging.
[ERROR] 
[ERROR] For more information about the errors and possible solutions, please read the following
articles:
[ERROR] [Help 1] http://cwiki.apache.org/confluence/display/MAVEN/MojoFailureException
[ERROR] 
[ERROR] After correcting the problems, you can resume the build with the command
[ERROR]   mvn <goals> -rf :hbase-server
Build step 'Invoke top-level Maven targets' marked build as failure
Performing Post build task...
Match found for :.* : True
Logical operation result is TRUE
Running script  :   ZOMBIE_TESTS_COUNT=`jps | grep surefirebooter | wc -l`
  if [[ $ZOMBIE_TESTS_COUNT != 0 ]] ; then
    #It seems sometimes the tests are not dying immediately. Let's give them 10s
    echo "Suspicious java process found - waiting 10s to see if there are just slow to stop"
    sleep 10
    ZOMBIE_TESTS_COUNT=`jps | grep surefirebooter | wc -l`
    if [[ $ZOMBIE_TESTS_COUNT != 0 ]] ; then
      echo "There are $ZOMBIE_TESTS_COUNT zombie tests, they should have been killed by surefire
but survived"
      echo "************ BEGIN zombies jstack extract"
      ZB_STACK=`jps | grep surefirebooter | cut -d ' ' -f 1 | xargs -n 1 jstack | grep ".test"
| grep "\.java"`
      jps | grep surefirebooter | cut -d ' ' -f 1 | xargs -n 1 jstack
      echo "************ END  zombies jstack extract"
      JIRA_COMMENT="$JIRA_COMMENT

     {color:red}-1 core zombie tests{color}.  There are ${ZOMBIE_TESTS_COUNT} zombie test(s):
${ZB_STACK}"
      BAD=1
      jps | grep surefirebooter | cut -d ' ' -f 1 | xargs kill -9
    else
      echo "We're ok: there is no zombie test, but some tests took some time to stop"
    fi
  else
    echo "We're ok: there is no zombie test"
  fi
[HBase-0.98-on-Hadoop-1.1] $ /bin/bash -xe /tmp/hudson9156111985657184166.sh
++ jps
++ grep surefirebooter
++ wc -l
+ ZOMBIE_TESTS_COUNT=0
+ [[ 0 != 0 ]]
+ echo 'We'\''re ok: there is no zombie test'
We're ok: there is no zombie test
POST BUILD TASK : SUCCESS
END OF POST BUILD TASK : 0
Archiving artifacts
Sending artifact delta relative to HBase-0.98-on-Hadoop-1.1 #492
Archived 1688 artifacts
Archive block size is 32768
Received 49 blocks and 385898970 bytes
Compression is 0.4%
Took 2 min 5 sec
Recording test results
Updating HBASE-12019

Mime
View raw message