hbase-builds mailing list archives

Site index · List index
Message view « Date » · « Thread »
Top « Date » · « Thread »
From Apache Jenkins Server <jenk...@builds.apache.org>
Subject Build failed in Jenkins: HBase-0.94-security #528
Date Wed, 24 Sep 2014 20:28:10 GMT
See <https://builds.apache.org/job/HBase-0.94-security/528/changes>

Changes:

[apurtell] HBASE-12077 FilterLists create many ArrayList objects per row (Lars Hofhansl)

------------------------------------------
[...truncated 54105 lines...]
Forking command line: /bin/sh -c cd <https://builds.apache.org/job/HBase-0.94-security/ws/>
&& /home/jenkins/tools/java/jdk1.6.0_45-32/jre/bin/java -enableassertions -Xmx1900m
-Djava.security.egd=file:/dev/./urandom -jar <https://builds.apache.org/job/HBase-0.94-security/ws/target/surefire/surefirebooter4095727565722230635.jar>
<https://builds.apache.org/job/HBase-0.94-security/ws/target/surefire/surefire4448986330507637236tmp>
<https://builds.apache.org/job/HBase-0.94-security/ws/target/surefire/surefire_1021694274273776440556tmp>
Running org.apache.hadoop.hbase.io.encoding.TestLoadAndSwitchEncodeOnDisk
Tests run: 1, Failures: 0, Errors: 0, Skipped: 0, Time elapsed: 22.949 sec
Forking command line: /bin/sh -c cd <https://builds.apache.org/job/HBase-0.94-security/ws/>
&& /home/jenkins/tools/java/jdk1.6.0_45-32/jre/bin/java -enableassertions -Xmx1900m
-Djava.security.egd=file:/dev/./urandom -jar <https://builds.apache.org/job/HBase-0.94-security/ws/target/surefire/surefirebooter1001460928589001526.jar>
<https://builds.apache.org/job/HBase-0.94-security/ws/target/surefire/surefire1164047837891534378tmp>
<https://builds.apache.org/job/HBase-0.94-security/ws/target/surefire/surefire_1035833548086334913295tmp>
Running org.apache.hadoop.hbase.mapreduce.TestImportExport
Tests run: 4, Failures: 0, Errors: 0, Skipped: 0, Time elapsed: 101.318 sec
Forking command line: /bin/sh -c cd <https://builds.apache.org/job/HBase-0.94-security/ws/>
&& /home/jenkins/tools/java/jdk1.6.0_45-32/jre/bin/java -enableassertions -Xmx1900m
-Djava.security.egd=file:/dev/./urandom -jar <https://builds.apache.org/job/HBase-0.94-security/ws/target/surefire/surefirebooter7979400054776249024.jar>
<https://builds.apache.org/job/HBase-0.94-security/ws/target/surefire/surefire2601442574229945153tmp>
<https://builds.apache.org/job/HBase-0.94-security/ws/target/surefire/surefire_10484506812120688770tmp>
Running org.apache.hadoop.hbase.mapreduce.TestHLogRecordReader
Tests run: 2, Failures: 0, Errors: 0, Skipped: 0, Time elapsed: 4.931 sec
Forking command line: /bin/sh -c cd <https://builds.apache.org/job/HBase-0.94-security/ws/>
&& /home/jenkins/tools/java/jdk1.6.0_45-32/jre/bin/java -enableassertions -Xmx1900m
-Djava.security.egd=file:/dev/./urandom -jar <https://builds.apache.org/job/HBase-0.94-security/ws/target/surefire/surefirebooter5436358541953111384.jar>
<https://builds.apache.org/job/HBase-0.94-security/ws/target/surefire/surefire1483511712130894676tmp>
<https://builds.apache.org/job/HBase-0.94-security/ws/target/surefire/surefire_1056984146258487773093tmp>
Running org.apache.hadoop.hbase.catalog.TestCatalogTracker
Tests run: 10, Failures: 0, Errors: 0, Skipped: 1, Time elapsed: 8.597 sec
Forking command line: /bin/sh -c cd <https://builds.apache.org/job/HBase-0.94-security/ws/>
&& /home/jenkins/tools/java/jdk1.6.0_45-32/jre/bin/java -enableassertions -Xmx1900m
-Djava.security.egd=file:/dev/./urandom -jar <https://builds.apache.org/job/HBase-0.94-security/ws/target/surefire/surefirebooter1681793639284026636.jar>
<https://builds.apache.org/job/HBase-0.94-security/ws/target/surefire/surefire8761966043282206261tmp>
<https://builds.apache.org/job/HBase-0.94-security/ws/target/surefire/surefire_106580115991288495725tmp>
Running org.apache.hadoop.hbase.catalog.TestMetaReaderEditor
Tests run: 5, Failures: 0, Errors: 0, Skipped: 0, Time elapsed: 21.233 sec
Forking command line: /bin/sh -c cd <https://builds.apache.org/job/HBase-0.94-security/ws/>
&& /home/jenkins/tools/java/jdk1.6.0_45-32/jre/bin/java -enableassertions -Xmx1900m
-Djava.security.egd=file:/dev/./urandom -jar <https://builds.apache.org/job/HBase-0.94-security/ws/target/surefire/surefirebooter4464740071835468264.jar>
<https://builds.apache.org/job/HBase-0.94-security/ws/target/surefire/surefire8100621110551636235tmp>
<https://builds.apache.org/job/HBase-0.94-security/ws/target/surefire/surefire_1074825198945094123941tmp>
Running org.apache.hadoop.hbase.catalog.TestMetaReaderEditorNoCluster
Tests run: 1, Failures: 1, Errors: 0, Skipped: 0, Time elapsed: 5.152 sec <<< FAILURE!
Forking command line: /bin/sh -c cd <https://builds.apache.org/job/HBase-0.94-security/ws/>
&& /home/jenkins/tools/java/jdk1.6.0_45-32/jre/bin/java -enableassertions -Xmx1900m
-Djava.security.egd=file:/dev/./urandom -jar <https://builds.apache.org/job/HBase-0.94-security/ws/target/surefire/surefirebooter2892118423030607157.jar>
<https://builds.apache.org/job/HBase-0.94-security/ws/target/surefire/surefire4402810864455747832tmp>
<https://builds.apache.org/job/HBase-0.94-security/ws/target/surefire/surefire_1083649034459315237201tmp>
Running org.apache.hadoop.hbase.rest.client.TestRemoteTable
Tests run: 9, Failures: 0, Errors: 0, Skipped: 0, Time elapsed: 41.76 sec
Forking command line: /bin/sh -c cd <https://builds.apache.org/job/HBase-0.94-security/ws/>
&& /home/jenkins/tools/java/jdk1.6.0_45-32/jre/bin/java -enableassertions -Xmx1900m
-Djava.security.egd=file:/dev/./urandom -jar <https://builds.apache.org/job/HBase-0.94-security/ws/target/surefire/surefirebooter5414555509160082778.jar>
<https://builds.apache.org/job/HBase-0.94-security/ws/target/surefire/surefire1796313365003579786tmp>
<https://builds.apache.org/job/HBase-0.94-security/ws/target/surefire/surefire_1093562035506043601524tmp>
Running org.apache.hadoop.hbase.rest.client.TestRemoteAdmin
Tests run: 5, Failures: 0, Errors: 0, Skipped: 0, Time elapsed: 16.101 sec
Forking command line: /bin/sh -c cd <https://builds.apache.org/job/HBase-0.94-security/ws/>
&& /home/jenkins/tools/java/jdk1.6.0_45-32/jre/bin/java -enableassertions -Xmx1900m
-Djava.security.egd=file:/dev/./urandom -jar <https://builds.apache.org/job/HBase-0.94-security/ws/target/surefire/surefirebooter7042662029014852486.jar>
<https://builds.apache.org/job/HBase-0.94-security/ws/target/surefire/surefire840171935876635230tmp>
<https://builds.apache.org/job/HBase-0.94-security/ws/target/surefire/surefire_1103508457055315281076tmp>
Running org.apache.hadoop.hbase.rest.TestStatusResource
Tests run: 2, Failures: 0, Errors: 0, Skipped: 0, Time elapsed: 13.038 sec
Forking command line: /bin/sh -c cd <https://builds.apache.org/job/HBase-0.94-security/ws/>
&& /home/jenkins/tools/java/jdk1.6.0_45-32/jre/bin/java -enableassertions -Xmx1900m
-Djava.security.egd=file:/dev/./urandom -jar <https://builds.apache.org/job/HBase-0.94-security/ws/target/surefire/surefirebooter751997449093337790.jar>
<https://builds.apache.org/job/HBase-0.94-security/ws/target/surefire/surefire2567610090372107451tmp>
<https://builds.apache.org/job/HBase-0.94-security/ws/target/surefire/surefire_11151893109137011791tmp>
Running org.apache.hadoop.hbase.mapreduce.TestImportTsv
Tests run: 13, Failures: 0, Errors: 0, Skipped: 0, Time elapsed: 222.349 sec
Forking command line: /bin/sh -c cd <https://builds.apache.org/job/HBase-0.94-security/ws/>
&& /home/jenkins/tools/java/jdk1.6.0_45-32/jre/bin/java -enableassertions -Xmx1900m
-Djava.security.egd=file:/dev/./urandom -jar <https://builds.apache.org/job/HBase-0.94-security/ws/target/surefire/surefirebooter6817814959545531521.jar>
<https://builds.apache.org/job/HBase-0.94-security/ws/target/surefire/surefire5745954200504714432tmp>
<https://builds.apache.org/job/HBase-0.94-security/ws/target/surefire/surefire_1128749348275104999593tmp>
Running org.apache.hadoop.hbase.rest.TestRowResource
Tests run: 12, Failures: 0, Errors: 0, Skipped: 0, Time elapsed: 16.794 sec
Forking command line: /bin/sh -c cd <https://builds.apache.org/job/HBase-0.94-security/ws/>
&& /home/jenkins/tools/java/jdk1.6.0_45-32/jre/bin/java -enableassertions -Xmx1900m
-Djava.security.egd=file:/dev/./urandom -jar <https://builds.apache.org/job/HBase-0.94-security/ws/target/surefire/surefirebooter2869543612698981934.jar>
<https://builds.apache.org/job/HBase-0.94-security/ws/target/surefire/surefire1959492965849018693tmp>
<https://builds.apache.org/job/HBase-0.94-security/ws/target/surefire/surefire_1136300720532664892787tmp>
Running org.apache.hadoop.hbase.rest.TestTableResource
Tests run: 8, Failures: 0, Errors: 0, Skipped: 0, Time elapsed: 26.204 sec
Forking command line: /bin/sh -c cd <https://builds.apache.org/job/HBase-0.94-security/ws/>
&& /home/jenkins/tools/java/jdk1.6.0_45-32/jre/bin/java -enableassertions -Xmx1900m
-Djava.security.egd=file:/dev/./urandom -jar <https://builds.apache.org/job/HBase-0.94-security/ws/target/surefire/surefirebooter6238968815625835526.jar>
<https://builds.apache.org/job/HBase-0.94-security/ws/target/surefire/surefire7357995554210711054tmp>
<https://builds.apache.org/job/HBase-0.94-security/ws/target/surefire/surefire_1147163270328905053606tmp>
Running org.apache.hadoop.hbase.rest.TestGZIPResponseWrapper
Tests run: 5, Failures: 0, Errors: 0, Skipped: 0, Time elapsed: 0.235 sec
Forking command line: /bin/sh -c cd <https://builds.apache.org/job/HBase-0.94-security/ws/>
&& /home/jenkins/tools/java/jdk1.6.0_45-32/jre/bin/java -enableassertions -Xmx1900m
-Djava.security.egd=file:/dev/./urandom -jar <https://builds.apache.org/job/HBase-0.94-security/ws/target/surefire/surefirebooter1676264321129410743.jar>
<https://builds.apache.org/job/HBase-0.94-security/ws/target/surefire/surefire5199777270925255841tmp>
<https://builds.apache.org/job/HBase-0.94-security/ws/target/surefire/surefire_1154146592319999259156tmp>
Running org.apache.hadoop.hbase.rest.TestVersionResource
Tests run: 7, Failures: 0, Errors: 0, Skipped: 0, Time elapsed: 13.024 sec
Forking command line: /bin/sh -c cd <https://builds.apache.org/job/HBase-0.94-security/ws/>
&& /home/jenkins/tools/java/jdk1.6.0_45-32/jre/bin/java -enableassertions -Xmx1900m
-Djava.security.egd=file:/dev/./urandom -jar <https://builds.apache.org/job/HBase-0.94-security/ws/target/surefire/surefirebooter3747650188369709109.jar>
<https://builds.apache.org/job/HBase-0.94-security/ws/target/surefire/surefire5776972225298788324tmp>
<https://builds.apache.org/job/HBase-0.94-security/ws/target/surefire/surefire_116888480134239799027tmp>
Running org.apache.hadoop.hbase.rest.TestGzipFilter
Tests run: 2, Failures: 0, Errors: 0, Skipped: 0, Time elapsed: 14.485 sec
Forking command line: /bin/sh -c cd <https://builds.apache.org/job/HBase-0.94-security/ws/>
&& /home/jenkins/tools/java/jdk1.6.0_45-32/jre/bin/java -enableassertions -Xmx1900m
-Djava.security.egd=file:/dev/./urandom -jar <https://builds.apache.org/job/HBase-0.94-security/ws/target/surefire/surefirebooter6544415609171118201.jar>
<https://builds.apache.org/job/HBase-0.94-security/ws/target/surefire/surefire2837504492717538363tmp>
<https://builds.apache.org/job/HBase-0.94-security/ws/target/surefire/surefire_1172423738831815387961tmp>
Running org.apache.hadoop.hbase.rest.TestScannersWithFilters
Tests run: 10, Failures: 0, Errors: 0, Skipped: 0, Time elapsed: 18.756 sec
Forking command line: /bin/sh -c cd <https://builds.apache.org/job/HBase-0.94-security/ws/>
&& /home/jenkins/tools/java/jdk1.6.0_45-32/jre/bin/java -enableassertions -Xmx1900m
-Djava.security.egd=file:/dev/./urandom -jar <https://builds.apache.org/job/HBase-0.94-security/ws/target/surefire/surefirebooter2014208855852665110.jar>
<https://builds.apache.org/job/HBase-0.94-security/ws/target/surefire/surefire3833456008160266311tmp>
<https://builds.apache.org/job/HBase-0.94-security/ws/target/surefire/surefire_1187980664701695536315tmp>
Running org.apache.hadoop.hbase.rest.TestScannerResource
Tests run: 5, Failures: 0, Errors: 0, Skipped: 0, Time elapsed: 35.833 sec
Forking command line: /bin/sh -c cd <https://builds.apache.org/job/HBase-0.94-security/ws/>
&& /home/jenkins/tools/java/jdk1.6.0_45-32/jre/bin/java -enableassertions -Xmx1900m
-Djava.security.egd=file:/dev/./urandom -jar <https://builds.apache.org/job/HBase-0.94-security/ws/target/surefire/surefirebooter1313699177634241048.jar>
<https://builds.apache.org/job/HBase-0.94-security/ws/target/surefire/surefire1159321965156989943tmp>
<https://builds.apache.org/job/HBase-0.94-security/ws/target/surefire/surefire_1191620900240048405974tmp>
Running org.apache.hadoop.hbase.rest.TestMultiRowResource
Tests run: 3, Failures: 0, Errors: 0, Skipped: 0, Time elapsed: 13.473 sec
Forking command line: /bin/sh -c cd <https://builds.apache.org/job/HBase-0.94-security/ws/>
&& /home/jenkins/tools/java/jdk1.6.0_45-32/jre/bin/java -enableassertions -Xmx1900m
-Djava.security.egd=file:/dev/./urandom -jar <https://builds.apache.org/job/HBase-0.94-security/ws/target/surefire/surefirebooter7052807989746197232.jar>
<https://builds.apache.org/job/HBase-0.94-security/ws/target/surefire/surefire6702313016639610374tmp>
<https://builds.apache.org/job/HBase-0.94-security/ws/target/surefire/surefire_1206762905894899623193tmp>
Running org.apache.hadoop.hbase.monitoring.TestMemoryBoundedLogMessageBuffer
Tests run: 2, Failures: 0, Errors: 0, Skipped: 0, Time elapsed: 0.238 sec
Forking command line: /bin/sh -c cd <https://builds.apache.org/job/HBase-0.94-security/ws/>
&& /home/jenkins/tools/java/jdk1.6.0_45-32/jre/bin/java -enableassertions -Xmx1900m
-Djava.security.egd=file:/dev/./urandom -jar <https://builds.apache.org/job/HBase-0.94-security/ws/target/surefire/surefirebooter6475300539182317161.jar>
<https://builds.apache.org/job/HBase-0.94-security/ws/target/surefire/surefire3794382282874715111tmp>
<https://builds.apache.org/job/HBase-0.94-security/ws/target/surefire/surefire_1218915647031923653709tmp>
Running org.apache.hadoop.hbase.monitoring.TestTaskMonitor
Tests run: 3, Failures: 0, Errors: 0, Skipped: 0, Time elapsed: 0.326 sec
Forking command line: /bin/sh -c cd <https://builds.apache.org/job/HBase-0.94-security/ws/>
&& /home/jenkins/tools/java/jdk1.6.0_45-32/jre/bin/java -enableassertions -Xmx1900m
-Djava.security.egd=file:/dev/./urandom -jar <https://builds.apache.org/job/HBase-0.94-security/ws/target/surefire/surefirebooter68752810322070871.jar>
<https://builds.apache.org/job/HBase-0.94-security/ws/target/surefire/surefire1046210460884502346tmp>
<https://builds.apache.org/job/HBase-0.94-security/ws/target/surefire/surefire_1226436139045319231128tmp>
Running org.apache.hadoop.hbase.rest.TestSchemaResource
Tests run: 2, Failures: 0, Errors: 0, Skipped: 0, Time elapsed: 17.699 sec
Forking command line: /bin/sh -c cd <https://builds.apache.org/job/HBase-0.94-security/ws/>
&& /home/jenkins/tools/java/jdk1.6.0_45-32/jre/bin/java -enableassertions -Xmx1900m
-Djava.security.egd=file:/dev/./urandom -jar <https://builds.apache.org/job/HBase-0.94-security/ws/target/surefire/surefirebooter4056403084438679184.jar>
<https://builds.apache.org/job/HBase-0.94-security/ws/target/surefire/surefire3466420302562060491tmp>
<https://builds.apache.org/job/HBase-0.94-security/ws/target/surefire/surefire_1233496513615696483854tmp>
Running org.apache.hadoop.hbase.snapshot.TestSnapshotDescriptionUtils
Tests run: 2, Failures: 0, Errors: 0, Skipped: 0, Time elapsed: 0.608 sec
Forking command line: /bin/sh -c cd <https://builds.apache.org/job/HBase-0.94-security/ws/>
&& /home/jenkins/tools/java/jdk1.6.0_45-32/jre/bin/java -enableassertions -Xmx1900m
-Djava.security.egd=file:/dev/./urandom -jar <https://builds.apache.org/job/HBase-0.94-security/ws/target/surefire/surefirebooter4394518903653943574.jar>
<https://builds.apache.org/job/HBase-0.94-security/ws/target/surefire/surefire1785363463283585537tmp>
<https://builds.apache.org/job/HBase-0.94-security/ws/target/surefire/surefire_1243624229892370343851tmp>
Running org.apache.hadoop.hbase.snapshot.TestExportSnapshot
Tests run: 8, Failures: 0, Errors: 0, Skipped: 0, Time elapsed: 96.878 sec
Forking command line: /bin/sh -c cd <https://builds.apache.org/job/HBase-0.94-security/ws/>
&& /home/jenkins/tools/java/jdk1.6.0_45-32/jre/bin/java -enableassertions -Xmx1900m
-Djava.security.egd=file:/dev/./urandom -jar <https://builds.apache.org/job/HBase-0.94-security/ws/target/surefire/surefirebooter1190368229562188611.jar>
<https://builds.apache.org/job/HBase-0.94-security/ws/target/surefire/surefire6469691991721313350tmp>
<https://builds.apache.org/job/HBase-0.94-security/ws/target/surefire/surefire_1252174015224434201168tmp>
Running org.apache.hadoop.hbase.TestAcidGuarantees
Tests run: 3, Failures: 0, Errors: 0, Skipped: 0, Time elapsed: 96.628 sec
Forking command line: /bin/sh -c cd <https://builds.apache.org/job/HBase-0.94-security/ws/>
&& /home/jenkins/tools/java/jdk1.6.0_45-32/jre/bin/java -enableassertions -Xmx1900m
-Djava.security.egd=file:/dev/./urandom -jar <https://builds.apache.org/job/HBase-0.94-security/ws/target/surefire/surefirebooter1858490618163815167.jar>
<https://builds.apache.org/job/HBase-0.94-security/ws/target/surefire/surefire1979694990529572554tmp>
<https://builds.apache.org/job/HBase-0.94-security/ws/target/surefire/surefire_1265084772540245820248tmp>
Running org.apache.hadoop.hbase.TestLocalHBaseCluster
Tests run: 1, Failures: 0, Errors: 0, Skipped: 0, Time elapsed: 9.954 sec
Running org.apache.hadoop.hbase.TestGlobalMemStoreSize
Tests run: 1, Failures: 0, Errors: 0, Skipped: 0, Time elapsed: 17.665 sec
Forking command line: /bin/sh -c cd <https://builds.apache.org/job/HBase-0.94-security/ws/>
&& /home/jenkins/tools/java/jdk1.6.0_45-32/jre/bin/java -enableassertions -Xmx1900m
-Djava.security.egd=file:/dev/./urandom -jar <https://builds.apache.org/job/HBase-0.94-security/ws/target/surefire/surefirebooter7144097078685894968.jar>
<https://builds.apache.org/job/HBase-0.94-security/ws/target/surefire/surefire7394007638186515431tmp>
<https://builds.apache.org/job/HBase-0.94-security/ws/target/surefire/surefire_1276764871028790175811tmp>
Forking command line: /bin/sh -c cd <https://builds.apache.org/job/HBase-0.94-security/ws/>
&& /home/jenkins/tools/java/jdk1.6.0_45-32/jre/bin/java -enableassertions -Xmx1900m
-Djava.security.egd=file:/dev/./urandom -jar <https://builds.apache.org/job/HBase-0.94-security/ws/target/surefire/surefirebooter7250091230650849588.jar>
<https://builds.apache.org/job/HBase-0.94-security/ws/target/surefire/surefire8196453171515735429tmp>
<https://builds.apache.org/job/HBase-0.94-security/ws/target/surefire/surefire_1286959327980664655565tmp>
Running org.apache.hadoop.hbase.master.TestDefaultLoadBalancer
Tests run: 4, Failures: 0, Errors: 0, Skipped: 0, Time elapsed: 1.413 sec
Forking command line: /bin/sh -c cd <https://builds.apache.org/job/HBase-0.94-security/ws/>
&& /home/jenkins/tools/java/jdk1.6.0_45-32/jre/bin/java -enableassertions -Xmx1900m
-Djava.security.egd=file:/dev/./urandom -jar <https://builds.apache.org/job/HBase-0.94-security/ws/target/surefire/surefirebooter6542715443424082975.jar>
<https://builds.apache.org/job/HBase-0.94-security/ws/target/surefire/surefire7607382571081637383tmp>
<https://builds.apache.org/job/HBase-0.94-security/ws/target/surefire/surefire_1292359051204621717083tmp>
Running org.apache.hadoop.hbase.master.TestMXBean
Tests run: 1, Failures: 0, Errors: 0, Skipped: 0, Time elapsed: 15.871 sec
Forking command line: /bin/sh -c cd <https://builds.apache.org/job/HBase-0.94-security/ws/>
&& /home/jenkins/tools/java/jdk1.6.0_45-32/jre/bin/java -enableassertions -Xmx1900m
-Djava.security.egd=file:/dev/./urandom -jar <https://builds.apache.org/job/HBase-0.94-security/ws/target/surefire/surefirebooter5781638282220358111.jar>
<https://builds.apache.org/job/HBase-0.94-security/ws/target/surefire/surefire7986198134837000450tmp>
<https://builds.apache.org/job/HBase-0.94-security/ws/target/surefire/surefire_1304673197655420235445tmp>
Running org.apache.hadoop.hbase.master.TestActiveMasterManager
Tests run: 2, Failures: 0, Errors: 0, Skipped: 0, Time elapsed: 0.959 sec
Forking command line: /bin/sh -c cd <https://builds.apache.org/job/HBase-0.94-security/ws/>
&& /home/jenkins/tools/java/jdk1.6.0_45-32/jre/bin/java -enableassertions -Xmx1900m
-Djava.security.egd=file:/dev/./urandom -jar <https://builds.apache.org/job/HBase-0.94-security/ws/target/surefire/surefirebooter1935676121419151604.jar>
<https://builds.apache.org/job/HBase-0.94-security/ws/target/surefire/surefire81739815578588075tmp>
<https://builds.apache.org/job/HBase-0.94-security/ws/target/surefire/surefire_1314035938472663600514tmp>
Running org.apache.hadoop.hbase.TestHBaseFileSystem
Tests run: 2, Failures: 0, Errors: 0, Skipped: 0, Time elapsed: 20.518 sec
Forking command line: /bin/sh -c cd <https://builds.apache.org/job/HBase-0.94-security/ws/>
&& /home/jenkins/tools/java/jdk1.6.0_45-32/jre/bin/java -enableassertions -Xmx1900m
-Djava.security.egd=file:/dev/./urandom -jar <https://builds.apache.org/job/HBase-0.94-security/ws/target/surefire/surefirebooter3245002285678286496.jar>
<https://builds.apache.org/job/HBase-0.94-security/ws/target/surefire/surefire336118954467025227tmp>
<https://builds.apache.org/job/HBase-0.94-security/ws/target/surefire/surefire_1327880318242176338079tmp>
Running org.apache.hadoop.hbase.master.metrics.TestMasterStatistics
Tests run: 2, Failures: 0, Errors: 0, Skipped: 0, Time elapsed: 1.175 sec
Forking command line: /bin/sh -c cd <https://builds.apache.org/job/HBase-0.94-security/ws/>
&& /home/jenkins/tools/java/jdk1.6.0_45-32/jre/bin/java -enableassertions -Xmx1900m
-Djava.security.egd=file:/dev/./urandom -jar <https://builds.apache.org/job/HBase-0.94-security/ws/target/surefire/surefirebooter1201746021153829681.jar>
<https://builds.apache.org/job/HBase-0.94-security/ws/target/surefire/surefire4557204877280583093tmp>
<https://builds.apache.org/job/HBase-0.94-security/ws/target/surefire/surefire_133155666813225475045tmp>
Running org.apache.hadoop.hbase.master.TestMasterFileSystem
Tests run: 1, Failures: 0, Errors: 0, Skipped: 0, Time elapsed: 10.592 sec
Forking command line: /bin/sh -c cd <https://builds.apache.org/job/HBase-0.94-security/ws/>
&& /home/jenkins/tools/java/jdk1.6.0_45-32/jre/bin/java -enableassertions -Xmx1900m
-Djava.security.egd=file:/dev/./urandom -jar <https://builds.apache.org/job/HBase-0.94-security/ws/target/surefire/surefirebooter4771534979005318629.jar>
<https://builds.apache.org/job/HBase-0.94-security/ws/target/surefire/surefire3789028446510246980tmp>
<https://builds.apache.org/job/HBase-0.94-security/ws/target/surefire/surefire_1346899208759373840651tmp>
Running org.apache.hadoop.hbase.master.TestDeadServer
Tests run: 1, Failures: 0, Errors: 0, Skipped: 0, Time elapsed: 0.207 sec
Forking command line: /bin/sh -c cd <https://builds.apache.org/job/HBase-0.94-security/ws/>
&& /home/jenkins/tools/java/jdk1.6.0_45-32/jre/bin/java -enableassertions -Xmx1900m
-Djava.security.egd=file:/dev/./urandom -jar <https://builds.apache.org/job/HBase-0.94-security/ws/target/surefire/surefirebooter5450393980505859445.jar>
<https://builds.apache.org/job/HBase-0.94-security/ws/target/surefire/surefire6792450930830823911tmp>
<https://builds.apache.org/job/HBase-0.94-security/ws/target/surefire/surefire_1351125209924649452957tmp>
Running org.apache.hadoop.hbase.master.TestZKBasedOpenCloseRegion
Tests run: 3, Failures: 0, Errors: 0, Skipped: 0, Time elapsed: 19.835 sec
Forking command line: /bin/sh -c cd <https://builds.apache.org/job/HBase-0.94-security/ws/>
&& /home/jenkins/tools/java/jdk1.6.0_45-32/jre/bin/java -enableassertions -Xmx1900m
-Djava.security.egd=file:/dev/./urandom -jar <https://builds.apache.org/job/HBase-0.94-security/ws/target/surefire/surefirebooter1516698034076057467.jar>
<https://builds.apache.org/job/HBase-0.94-security/ws/target/surefire/surefire4620746283016042315tmp>
<https://builds.apache.org/job/HBase-0.94-security/ws/target/surefire/surefire_1368450100290004922428tmp>
Running org.apache.hadoop.hbase.master.TestMasterZKSessionRecovery
Tests run: 2, Failures: 0, Errors: 0, Skipped: 0, Time elapsed: 30.6 sec
Forking command line: /bin/sh -c cd <https://builds.apache.org/job/HBase-0.94-security/ws/>
&& /home/jenkins/tools/java/jdk1.6.0_45-32/jre/bin/java -enableassertions -Xmx1900m
-Djava.security.egd=file:/dev/./urandom -jar <https://builds.apache.org/job/HBase-0.94-security/ws/target/surefire/surefirebooter1193991468463090785.jar>
<https://builds.apache.org/job/HBase-0.94-security/ws/target/surefire/surefire3880355078209494280tmp>
<https://builds.apache.org/job/HBase-0.94-security/ws/target/surefire/surefire_1378838631887647249709tmp>
Running org.apache.hadoop.hbase.master.TestMasterStatusServlet
Tests run: 5, Failures: 0, Errors: 0, Skipped: 0, Time elapsed: 0.99 sec
Forking command line: /bin/sh -c cd <https://builds.apache.org/job/HBase-0.94-security/ws/>
&& /home/jenkins/tools/java/jdk1.6.0_45-32/jre/bin/java -enableassertions -Xmx1900m
-Djava.security.egd=file:/dev/./urandom -jar <https://builds.apache.org/job/HBase-0.94-security/ws/target/surefire/surefirebooter1395830042177799245.jar>
<https://builds.apache.org/job/HBase-0.94-security/ws/target/surefire/surefire6850026658234953368tmp>
<https://builds.apache.org/job/HBase-0.94-security/ws/target/surefire/surefire_1385356013157039706571tmp>
Running org.apache.hadoop.hbase.master.TestSplitLogManager
Tests run: 12, Failures: 0, Errors: 0, Skipped: 0, Time elapsed: 80.741 sec
Forking command line: /bin/sh -c cd <https://builds.apache.org/job/HBase-0.94-security/ws/>
&& /home/jenkins/tools/java/jdk1.6.0_45-32/jre/bin/java -enableassertions -Xmx1900m
-Djava.security.egd=file:/dev/./urandom -jar <https://builds.apache.org/job/HBase-0.94-security/ws/target/surefire/surefirebooter6759160962517428981.jar>
<https://builds.apache.org/job/HBase-0.94-security/ws/target/surefire/surefire1217418279112472427tmp>
<https://builds.apache.org/job/HBase-0.94-security/ws/target/surefire/surefire_1399221018066163685758tmp>
Running org.apache.hadoop.hbase.master.TestMaster
Tests run: 2, Failures: 0, Errors: 0, Skipped: 0, Time elapsed: 15.872 sec
Forking command line: /bin/sh -c cd <https://builds.apache.org/job/HBase-0.94-security/ws/>
&& /home/jenkins/tools/java/jdk1.6.0_45-32/jre/bin/java -enableassertions -Xmx1900m
-Djava.security.egd=file:/dev/./urandom -jar <https://builds.apache.org/job/HBase-0.94-security/ws/target/surefire/surefirebooter4619122331765329649.jar>
<https://builds.apache.org/job/HBase-0.94-security/ws/target/surefire/surefire2400841338667146864tmp>
<https://builds.apache.org/job/HBase-0.94-security/ws/target/surefire/surefire_1402428761959858578266tmp>
Running org.apache.hadoop.hbase.master.TestClockSkewDetection
Tests run: 1, Failures: 0, Errors: 0, Skipped: 0, Time elapsed: 0.299 sec
Forking command line: /bin/sh -c cd <https://builds.apache.org/job/HBase-0.94-security/ws/>
&& /home/jenkins/tools/java/jdk1.6.0_45-32/jre/bin/java -enableassertions -Xmx1900m
-Djava.security.egd=file:/dev/./urandom -jar <https://builds.apache.org/job/HBase-0.94-security/ws/target/surefire/surefirebooter2560063059216653049.jar>
<https://builds.apache.org/job/HBase-0.94-security/ws/target/surefire/surefire7553688198015158726tmp>
<https://builds.apache.org/job/HBase-0.94-security/ws/target/surefire/surefire_1415671128739937960480tmp>
Running org.apache.hadoop.hbase.master.snapshot.TestSnapshotFileCache
Tests run: 6, Failures: 0, Errors: 0, Skipped: 0, Time elapsed: 3.645 sec
Running org.apache.hadoop.hbase.master.handler.TestCreateTableHandler
Tests run: 3, Failures: 0, Errors: 0, Skipped: 0, Time elapsed: 34.1 sec
Forking command line: /bin/sh -c cd <https://builds.apache.org/job/HBase-0.94-security/ws/>
&& /home/jenkins/tools/java/jdk1.6.0_45-32/jre/bin/java -enableassertions -Xmx1900m
-Djava.security.egd=file:/dev/./urandom -jar <https://builds.apache.org/job/HBase-0.94-security/ws/target/surefire/surefirebooter4895927533712947223.jar>
<https://builds.apache.org/job/HBase-0.94-security/ws/target/surefire/surefire3400338326130836144tmp>
<https://builds.apache.org/job/HBase-0.94-security/ws/target/surefire/surefire_1422445021246992857331tmp>
Forking command line: /bin/sh -c cd <https://builds.apache.org/job/HBase-0.94-security/ws/>
&& /home/jenkins/tools/java/jdk1.6.0_45-32/jre/bin/java -enableassertions -Xmx1900m
-Djava.security.egd=file:/dev/./urandom -jar <https://builds.apache.org/job/HBase-0.94-security/ws/target/surefire/surefirebooter5000167230017503341.jar>
<https://builds.apache.org/job/HBase-0.94-security/ws/target/surefire/surefire2632327013386068142tmp>
<https://builds.apache.org/job/HBase-0.94-security/ws/target/surefire/surefire_1434002885126890484776tmp>
Running org.apache.hadoop.hbase.master.cleaner.TestLogsCleaner
Tests run: 1, Failures: 0, Errors: 0, Skipped: 0, Time elapsed: 3.045 sec
Forking command line: /bin/sh -c cd <https://builds.apache.org/job/HBase-0.94-security/ws/>
&& /home/jenkins/tools/java/jdk1.6.0_45-32/jre/bin/java -enableassertions -Xmx1900m
-Djava.security.egd=file:/dev/./urandom -jar <https://builds.apache.org/job/HBase-0.94-security/ws/target/surefire/surefirebooter877667514846716576.jar>
<https://builds.apache.org/job/HBase-0.94-security/ws/target/surefire/surefire3533441192104122499tmp>
<https://builds.apache.org/job/HBase-0.94-security/ws/target/surefire/surefire_1448520264621856804666tmp>
Running org.apache.hadoop.hbase.master.cleaner.TestSnapshotFromMaster
Tests run: 4, Failures: 0, Errors: 0, Skipped: 0, Time elapsed: 31.309 sec
Forking command line: /bin/sh -c cd <https://builds.apache.org/job/HBase-0.94-security/ws/>
&& /home/jenkins/tools/java/jdk1.6.0_45-32/jre/bin/java -enableassertions -Xmx1900m
-Djava.security.egd=file:/dev/./urandom -jar <https://builds.apache.org/job/HBase-0.94-security/ws/target/surefire/surefirebooter7646001077899380155.jar>
<https://builds.apache.org/job/HBase-0.94-security/ws/target/surefire/surefire5641017893356447947tmp>
<https://builds.apache.org/job/HBase-0.94-security/ws/target/surefire/surefire_1452946001688505586019tmp>
Running org.apache.hadoop.hbase.master.cleaner.TestHFileCleaner
Tests run: 3, Failures: 0, Errors: 0, Skipped: 0, Time elapsed: 3.707 sec
Forking command line: /bin/sh -c cd <https://builds.apache.org/job/HBase-0.94-security/ws/>
&& /home/jenkins/tools/java/jdk1.6.0_45-32/jre/bin/java -enableassertions -Xmx1900m
-Djava.security.egd=file:/dev/./urandom -jar <https://builds.apache.org/job/HBase-0.94-security/ws/target/surefire/surefirebooter1854684305731905727.jar>
<https://builds.apache.org/job/HBase-0.94-security/ws/target/surefire/surefire5862105217558376458tmp>
<https://builds.apache.org/job/HBase-0.94-security/ws/target/surefire/surefire_1462222615782560144796tmp>
Running org.apache.hadoop.hbase.master.TestHMasterRPCException
Tests run: 1, Failures: 0, Errors: 0, Skipped: 0, Time elapsed: 1.459 sec
Forking command line: /bin/sh -c cd <https://builds.apache.org/job/HBase-0.94-security/ws/>
&& /home/jenkins/tools/java/jdk1.6.0_45-32/jre/bin/java -enableassertions -Xmx1900m
-Djava.security.egd=file:/dev/./urandom -jar <https://builds.apache.org/job/HBase-0.94-security/ws/target/surefire/surefirebooter5879957111195290489.jar>
<https://builds.apache.org/job/HBase-0.94-security/ws/target/surefire/surefire6412404281625609275tmp>
<https://builds.apache.org/job/HBase-0.94-security/ws/target/surefire/surefire_1471753984509582962363tmp>
Running org.apache.hadoop.hbase.master.TestOpenedRegionHandler
Tests run: 2, Failures: 0, Errors: 0, Skipped: 0, Time elapsed: 13.879 sec
Forking command line: /bin/sh -c cd <https://builds.apache.org/job/HBase-0.94-security/ws/>
&& /home/jenkins/tools/java/jdk1.6.0_45-32/jre/bin/java -enableassertions -Xmx1900m
-Djava.security.egd=file:/dev/./urandom -jar <https://builds.apache.org/job/HBase-0.94-security/ws/target/surefire/surefirebooter208870281890275353.jar>
<https://builds.apache.org/job/HBase-0.94-security/ws/target/surefire/surefire4851575224072005938tmp>
<https://builds.apache.org/job/HBase-0.94-security/ws/target/surefire/surefire_1481791970091481670389tmp>
Running org.apache.hadoop.hbase.util.TestRegionSplitter
Tests run: 5, Failures: 0, Errors: 0, Skipped: 0, Time elapsed: 15.669 sec
Forking command line: /bin/sh -c cd <https://builds.apache.org/job/HBase-0.94-security/ws/>
&& /home/jenkins/tools/java/jdk1.6.0_45-32/jre/bin/java -enableassertions -Xmx1900m
-Djava.security.egd=file:/dev/./urandom -jar <https://builds.apache.org/job/HBase-0.94-security/ws/target/surefire/surefirebooter5376489135890610751.jar>
<https://builds.apache.org/job/HBase-0.94-security/ws/target/surefire/surefire6070353164537855580tmp>
<https://builds.apache.org/job/HBase-0.94-security/ws/target/surefire/surefire_1493567946860316245772tmp>
Running org.apache.hadoop.hbase.util.TestEnvironmentEdgeManager
Tests run: 2, Failures: 0, Errors: 0, Skipped: 0, Time elapsed: 0.362 sec
Forking command line: /bin/sh -c cd <https://builds.apache.org/job/HBase-0.94-security/ws/>
&& /home/jenkins/tools/java/jdk1.6.0_45-32/jre/bin/java -enableassertions -Xmx1900m
-Djava.security.egd=file:/dev/./urandom -jar <https://builds.apache.org/job/HBase-0.94-security/ws/target/surefire/surefirebooter876240678418892575.jar>
<https://builds.apache.org/job/HBase-0.94-security/ws/target/surefire/surefire55317299218793225tmp>
<https://builds.apache.org/job/HBase-0.94-security/ws/target/surefire/surefire_1504308165209667971513tmp>
Running org.apache.hadoop.hbase.util.TestFSHDFSUtils
Tests run: 3, Failures: 0, Errors: 0, Skipped: 0, Time elapsed: 3.752 sec
Forking command line: /bin/sh -c cd <https://builds.apache.org/job/HBase-0.94-security/ws/>
&& /home/jenkins/tools/java/jdk1.6.0_45-32/jre/bin/java -enableassertions -Xmx1900m
-Djava.security.egd=file:/dev/./urandom -jar <https://builds.apache.org/job/HBase-0.94-security/ws/target/surefire/surefirebooter218353638201019620.jar>
<https://builds.apache.org/job/HBase-0.94-security/ws/target/surefire/surefire8028283676002725252tmp>
<https://builds.apache.org/job/HBase-0.94-security/ws/target/surefire/surefire_1515523010968346220720tmp>
Running org.apache.hadoop.hbase.util.TestFSVisitor
Tests run: 3, Failures: 0, Errors: 0, Skipped: 0, Time elapsed: 1.558 sec
Forking command line: /bin/sh -c cd <https://builds.apache.org/job/HBase-0.94-security/ws/>
&& /home/jenkins/tools/java/jdk1.6.0_45-32/jre/bin/java -enableassertions -Xmx1900m
-Djava.security.egd=file:/dev/./urandom -jar <https://builds.apache.org/job/HBase-0.94-security/ws/target/surefire/surefirebooter3806306468889994400.jar>
<https://builds.apache.org/job/HBase-0.94-security/ws/target/surefire/surefire2961915247564240831tmp>
<https://builds.apache.org/job/HBase-0.94-security/ws/target/surefire/surefire_1523456470106629457975tmp>
Running org.apache.hadoop.hbase.util.hbck.TestOfflineMetaRebuildOverlap
Tests run: 1, Failures: 0, Errors: 0, Skipped: 0, Time elapsed: 26.533 sec
Forking command line: /bin/sh -c cd <https://builds.apache.org/job/HBase-0.94-security/ws/>
&& /home/jenkins/tools/java/jdk1.6.0_45-32/jre/bin/java -enableassertions -Xmx1900m
-Djava.security.egd=file:/dev/./urandom -jar <https://builds.apache.org/job/HBase-0.94-security/ws/target/surefire/surefirebooter786055347835222168.jar>
<https://builds.apache.org/job/HBase-0.94-security/ws/target/surefire/surefire477560633614889582tmp>
<https://builds.apache.org/job/HBase-0.94-security/ws/target/surefire/surefire_1534677734954907984012tmp>
Running org.apache.hadoop.hbase.util.hbck.TestOfflineMetaRebuildHole
Tests run: 1, Failures: 0, Errors: 0, Skipped: 0, Time elapsed: 24.531 sec
Forking command line: /bin/sh -c cd <https://builds.apache.org/job/HBase-0.94-security/ws/>
&& /home/jenkins/tools/java/jdk1.6.0_45-32/jre/bin/java -enableassertions -Xmx1900m
-Djava.security.egd=file:/dev/./urandom -jar <https://builds.apache.org/job/HBase-0.94-security/ws/target/surefire/surefirebooter5752634098857580879.jar>
<https://builds.apache.org/job/HBase-0.94-security/ws/target/surefire/surefire3103574889669875827tmp>
<https://builds.apache.org/job/HBase-0.94-security/ws/target/surefire/surefire_1544514395752172217359tmp>
Running org.apache.hadoop.hbase.util.hbck.TestOfflineMetaRebuildBase
Tests run: 1, Failures: 0, Errors: 0, Skipped: 0, Time elapsed: 27.509 sec
Forking command line: /bin/sh -c cd <https://builds.apache.org/job/HBase-0.94-security/ws/>
&& /home/jenkins/tools/java/jdk1.6.0_45-32/jre/bin/java -enableassertions -Xmx1900m
-Djava.security.egd=file:/dev/./urandom -jar <https://builds.apache.org/job/HBase-0.94-security/ws/target/surefire/surefirebooter8601059843941254856.jar>
<https://builds.apache.org/job/HBase-0.94-security/ws/target/surefire/surefire4418547762017890982tmp>
<https://builds.apache.org/job/HBase-0.94-security/ws/target/surefire/surefire_1554156036459486540870tmp>
Running org.apache.hadoop.hbase.util.TestFSTableDescriptors
Tests run: 11, Failures: 0, Errors: 0, Skipped: 0, Time elapsed: 0.925 sec
Forking command line: /bin/sh -c cd <https://builds.apache.org/job/HBase-0.94-security/ws/>
&& /home/jenkins/tools/java/jdk1.6.0_45-32/jre/bin/java -enableassertions -Xmx1900m
-Djava.security.egd=file:/dev/./urandom -jar <https://builds.apache.org/job/HBase-0.94-security/ws/target/surefire/surefirebooter2662472806068009541.jar>
<https://builds.apache.org/job/HBase-0.94-security/ws/target/surefire/surefire7231066278562378780tmp>
<https://builds.apache.org/job/HBase-0.94-security/ws/target/surefire/surefire_1565539740354403282551tmp>
Running org.apache.hadoop.hbase.util.TestDefaultEnvironmentEdge
Tests run: 1, Failures: 0, Errors: 0, Skipped: 0, Time elapsed: 0.214 sec
Forking command line: /bin/sh -c cd <https://builds.apache.org/job/HBase-0.94-security/ws/>
&& /home/jenkins/tools/java/jdk1.6.0_45-32/jre/bin/java -enableassertions -Xmx1900m
-Djava.security.egd=file:/dev/./urandom -jar <https://builds.apache.org/job/HBase-0.94-security/ws/target/surefire/surefirebooter2110156823041971300.jar>
<https://builds.apache.org/job/HBase-0.94-security/ws/target/surefire/surefire4530160254774045725tmp>
<https://builds.apache.org/job/HBase-0.94-security/ws/target/surefire/surefire_157916577855737252751tmp>
Running org.apache.hadoop.hbase.util.TestIdLock
Tests run: 1, Failures: 0, Errors: 0, Skipped: 0, Time elapsed: 15.337 sec
Forking command line: /bin/sh -c cd <https://builds.apache.org/job/HBase-0.94-security/ws/>
&& /home/jenkins/tools/java/jdk1.6.0_45-32/jre/bin/java -enableassertions -Xmx1900m
-Djava.security.egd=file:/dev/./urandom -jar <https://builds.apache.org/job/HBase-0.94-security/ws/target/surefire/surefirebooter5148971107205142481.jar>
<https://builds.apache.org/job/HBase-0.94-security/ws/target/surefire/surefire7850892563964546761tmp>
<https://builds.apache.org/job/HBase-0.94-security/ws/target/surefire/surefire_1588855015338772851442tmp>
Running org.apache.hadoop.hbase.util.TestCoprocessorScanPolicy
Tests run: 2, Failures: 0, Errors: 0, Skipped: 0, Time elapsed: 15.403 sec
Forking command line: /bin/sh -c cd <https://builds.apache.org/job/HBase-0.94-security/ws/>
&& /home/jenkins/tools/java/jdk1.6.0_45-32/jre/bin/java -enableassertions -Xmx1900m
-Djava.security.egd=file:/dev/./urandom -jar <https://builds.apache.org/job/HBase-0.94-security/ws/target/surefire/surefirebooter764020677590305070.jar>
<https://builds.apache.org/job/HBase-0.94-security/ws/target/surefire/surefire9200904586422001456tmp>
<https://builds.apache.org/job/HBase-0.94-security/ws/target/surefire/surefire_159395170025492246533tmp>
Running org.apache.hadoop.hbase.util.TestFSUtils
Tests run: 4, Failures: 0, Errors: 0, Skipped: 0, Time elapsed: 19.628 sec
Forking command line: /bin/sh -c cd <https://builds.apache.org/job/HBase-0.94-security/ws/>
&& /home/jenkins/tools/java/jdk1.6.0_45-32/jre/bin/java -enableassertions -Xmx1900m
-Djava.security.egd=file:/dev/./urandom -jar <https://builds.apache.org/job/HBase-0.94-security/ws/target/surefire/surefirebooter1620789915930652823.jar>
<https://builds.apache.org/job/HBase-0.94-security/ws/target/surefire/surefire3220931084331007231tmp>
<https://builds.apache.org/job/HBase-0.94-security/ws/target/surefire/surefire_1601258135328139568017tmp>
Running org.apache.hadoop.hbase.util.TestPoolMap$TestRoundRobinPoolType
Tests run: 3, Failures: 0, Errors: 0, Skipped: 0, Time elapsed: 0.012 sec
Running org.apache.hadoop.hbase.util.TestPoolMap$TestThreadLocalPoolType
Tests run: 3, Failures: 0, Errors: 0, Skipped: 0, Time elapsed: 0.007 sec
Running org.apache.hadoop.hbase.util.TestPoolMap$TestReusablePoolType
Tests run: 3, Failures: 0, Errors: 0, Skipped: 0, Time elapsed: 0.034 sec
Forking command line: /bin/sh -c cd <https://builds.apache.org/job/HBase-0.94-security/ws/>
&& /home/jenkins/tools/java/jdk1.6.0_45-32/jre/bin/java -enableassertions -Xmx1900m
-Djava.security.egd=file:/dev/./urandom -jar <https://builds.apache.org/job/HBase-0.94-security/ws/target/surefire/surefirebooter1028485658756711994.jar>
<https://builds.apache.org/job/HBase-0.94-security/ws/target/surefire/surefire4263720174076772284tmp>
<https://builds.apache.org/job/HBase-0.94-security/ws/target/surefire/surefire_1618811210358903353871tmp>
Running org.apache.hadoop.hbase.util.TestMergeTable
Tests run: 1, Failures: 0, Errors: 0, Skipped: 0, Time elapsed: 25.347 sec
Forking command line: /bin/sh -c cd <https://builds.apache.org/job/HBase-0.94-security/ws/>
&& /home/jenkins/tools/java/jdk1.6.0_45-32/jre/bin/java -enableassertions -Xmx1900m
-Djava.security.egd=file:/dev/./urandom -jar <https://builds.apache.org/job/HBase-0.94-security/ws/target/surefire/surefirebooter3350120133171687614.jar>
<https://builds.apache.org/job/HBase-0.94-security/ws/target/surefire/surefire2237822786721399762tmp>
<https://builds.apache.org/job/HBase-0.94-security/ws/target/surefire/surefire_1621996718843942381176tmp>
Running org.apache.hadoop.hbase.util.TestSizeBasedThrottler
Tests run: 3, Failures: 0, Errors: 0, Skipped: 0, Time elapsed: 43.788 sec

Results :

Failed tests:   testRideOverServerNotRunning(org.apache.hadoop.hbase.catalog.TestMetaReaderEditorNoCluster)

Tests run: 915, Failures: 1, Errors: 0, Skipped: 2

[INFO] ------------------------------------------------------------------------
[INFO] BUILD FAILURE
[INFO] ------------------------------------------------------------------------
[INFO] Total time: 56:52.943s
[INFO] Finished at: Wed Sep 24 20:25:13 UTC 2014
[INFO] Final Memory: 70M/949M
[INFO] ------------------------------------------------------------------------
[ERROR] Failed to execute goal org.apache.maven.plugins:maven-surefire-plugin:2.12-TRUNK-HBASE-2:test
(secondPartTestsExecution) on project hbase: Failure or timeout -> [Help 1]
org.apache.maven.lifecycle.LifecycleExecutionException: Failed to execute goal org.apache.maven.plugins:maven-surefire-plugin:2.12-TRUNK-HBASE-2:test
(secondPartTestsExecution) on project hbase: Failure or timeout
	at org.apache.maven.lifecycle.internal.MojoExecutor.execute(MojoExecutor.java:217)
	at org.apache.maven.lifecycle.internal.MojoExecutor.execute(MojoExecutor.java:153)
	at org.apache.maven.lifecycle.internal.MojoExecutor.execute(MojoExecutor.java:145)
	at org.apache.maven.lifecycle.internal.MojoExecutor.executeForkedExecutions(MojoExecutor.java:365)
	at org.apache.maven.lifecycle.internal.MojoExecutor.execute(MojoExecutor.java:199)
	at org.apache.maven.lifecycle.internal.MojoExecutor.execute(MojoExecutor.java:153)
	at org.apache.maven.lifecycle.internal.MojoExecutor.execute(MojoExecutor.java:145)
	at org.apache.maven.lifecycle.internal.LifecycleModuleBuilder.buildProject(LifecycleModuleBuilder.java:84)
	at org.apache.maven.lifecycle.internal.LifecycleModuleBuilder.buildProject(LifecycleModuleBuilder.java:59)
	at org.apache.maven.lifecycle.internal.LifecycleStarter.singleThreadedBuild(LifecycleStarter.java:183)
	at org.apache.maven.lifecycle.internal.LifecycleStarter.execute(LifecycleStarter.java:161)
	at org.apache.maven.DefaultMaven.doExecute(DefaultMaven.java:320)
	at org.apache.maven.DefaultMaven.execute(DefaultMaven.java:156)
	at org.apache.maven.cli.MavenCli.execute(MavenCli.java:537)
	at org.apache.maven.cli.MavenCli.doMain(MavenCli.java:196)
	at org.apache.maven.cli.MavenCli.main(MavenCli.java:141)
	at sun.reflect.NativeMethodAccessorImpl.invoke0(Native Method)
	at sun.reflect.NativeMethodAccessorImpl.invoke(NativeMethodAccessorImpl.java:39)
	at sun.reflect.DelegatingMethodAccessorImpl.invoke(DelegatingMethodAccessorImpl.java:25)
	at java.lang.reflect.Method.invoke(Method.java:597)
	at org.codehaus.plexus.classworlds.launcher.Launcher.launchEnhanced(Launcher.java:290)
	at org.codehaus.plexus.classworlds.launcher.Launcher.launch(Launcher.java:230)
	at org.codehaus.plexus.classworlds.launcher.Launcher.mainWithExitCode(Launcher.java:409)
	at org.codehaus.plexus.classworlds.launcher.Launcher.main(Launcher.java:352)
Caused by: org.apache.maven.plugin.MojoExecutionException: Failure or timeout
	at org.apache.maven.plugin.surefire.SurefirePlugin.assertNoFailureOrTimeout(SurefirePlugin.java:643)
	at org.apache.maven.plugin.surefire.SurefirePlugin.handleSummary(SurefirePlugin.java:624)
	at org.apache.maven.plugin.surefire.AbstractSurefireMojo.executeAfterPreconditionsChecked(AbstractSurefireMojo.java:137)
	at org.apache.maven.plugin.surefire.AbstractSurefireMojo.execute(AbstractSurefireMojo.java:98)
	at org.apache.maven.plugin.DefaultBuildPluginManager.executeMojo(DefaultBuildPluginManager.java:101)
	at org.apache.maven.lifecycle.internal.MojoExecutor.execute(MojoExecutor.java:209)
	... 23 more
[ERROR] 
[ERROR] 
[ERROR] For more information about the errors and possible solutions, please read the following
articles:
[ERROR] [Help 1] http://cwiki.apache.org/confluence/display/MAVEN/MojoExecutionException
Build step 'Invoke top-level Maven targets' marked build as failure
Archiving artifacts
Sending artifact delta relative to HBase-0.94-security #523
Archived 958 artifacts
Archive block size is 32768
Received 41 blocks and 141624735 bytes
Compression is 0.9%
Took 1 min 0 sec
Updating HBASE-12077
Recording test results

Mime
View raw message