hbase-builds mailing list archives

Site index · List index
Message view « Date » · « Thread »
Top « Date » · « Thread »
From Apache Jenkins Server <jenk...@builds.apache.org>
Subject Build failed in Jenkins: HBase-0.98-on-Hadoop-1.1 #497
Date Tue, 16 Sep 2014 23:46:43 GMT
See <https://builds.apache.org/job/HBase-0.98-on-Hadoop-1.1/497/changes>

Changes:

[apurtell] HBASE-11994 PutCombiner floods the M/R log with repeated log messages (Aditya Kishore)

------------------------------------------
[...truncated 1545 lines...]
Tests run: 1, Failures: 0, Errors: 0, Skipped: 0, Time elapsed: 39.413 sec
Running org.apache.hadoop.hbase.replication.regionserver.TestReplicationSourceManager
Tests run: 4, Failures: 0, Errors: 0, Skipped: 0, Time elapsed: 4.769 sec
Running org.apache.hadoop.hbase.replication.TestReplicationSyncUpTool
Tests run: 1, Failures: 0, Errors: 0, Skipped: 0, Time elapsed: 72.479 sec
Running org.apache.hadoop.hbase.replication.regionserver.TestReplicationSink
Tests run: 5, Failures: 0, Errors: 0, Skipped: 0, Time elapsed: 12.045 sec
Running org.apache.hadoop.hbase.replication.TestReplicationSmallTests
Tests run: 9, Failures: 0, Errors: 0, Skipped: 0, Time elapsed: 72.302 sec
Running org.apache.hadoop.hbase.replication.TestReplicationChangingPeerRegionservers
Tests run: 1, Failures: 0, Errors: 0, Skipped: 0, Time elapsed: 27.118 sec
Running org.apache.hadoop.hbase.replication.TestMultiSlaveReplication
Tests run: 1, Failures: 0, Errors: 0, Skipped: 0, Time elapsed: 35.438 sec
Running org.apache.hadoop.hbase.replication.TestMasterReplication
Tests run: 3, Failures: 0, Errors: 0, Skipped: 0, Time elapsed: 89.178 sec
Running org.apache.hadoop.hbase.replication.TestReplicationTrackerZKImpl
Tests run: 4, Failures: 0, Errors: 0, Skipped: 2, Time elapsed: 1.265 sec
Running org.apache.hadoop.hbase.replication.TestReplicationKillMasterRSCompressed
Tests run: 1, Failures: 0, Errors: 0, Skipped: 0, Time elapsed: 43.175 sec
Running org.apache.hadoop.hbase.replication.regionserver.TestReplicationHLogReaderManager
Tests run: 8, Failures: 0, Errors: 0, Skipped: 0, Time elapsed: 286.122 sec
Running org.apache.hadoop.hbase.replication.TestReplicationSource
Tests run: 1, Failures: 0, Errors: 0, Skipped: 0, Time elapsed: 3.042 sec
Running org.apache.hadoop.hbase.fs.TestBlockReorder
Tests run: 3, Failures: 0, Errors: 0, Skipped: 0, Time elapsed: 27.835 sec
Running org.apache.hadoop.hbase.master.TestAssignmentManager
Tests run: 20, Failures: 0, Errors: 0, Skipped: 0, Time elapsed: 4.176 sec
Running org.apache.hadoop.hbase.master.TestOpenedRegionHandler
Tests run: 2, Failures: 0, Errors: 0, Skipped: 0, Time elapsed: 13.595 sec
Running org.apache.hadoop.hbase.replication.TestPerTableCFReplication
Tests run: 2, Failures: 0, Errors: 0, Skipped: 0, Time elapsed: 54.673 sec
Running org.apache.hadoop.hbase.master.cleaner.TestHFileCleaner
Tests run: 3, Failures: 0, Errors: 0, Skipped: 0, Time elapsed: 4.028 sec
Running org.apache.hadoop.hbase.master.cleaner.TestLogsCleaner
Tests run: 1, Failures: 0, Errors: 0, Skipped: 0, Time elapsed: 11.315 sec
Running org.apache.hadoop.hbase.master.cleaner.TestSnapshotFromMaster
Tests run: 4, Failures: 0, Errors: 0, Skipped: 0, Time elapsed: 22.069 sec
Running org.apache.hadoop.hbase.master.TestMasterRestartAfterDisablingTable
Tests run: 1, Failures: 0, Errors: 0, Skipped: 0, Time elapsed: 13.879 sec
Running org.apache.hadoop.hbase.master.TestClusterStatusPublisher
Tests run: 3, Failures: 0, Errors: 0, Skipped: 0, Time elapsed: 0.33 sec
Running org.apache.hadoop.hbase.master.TestRegionPlacement
Tests run: 4, Failures: 0, Errors: 0, Skipped: 0, Time elapsed: 36.139 sec
Running org.apache.hadoop.hbase.master.handler.TestTableDeleteFamilyHandler
Tests run: 1, Failures: 0, Errors: 0, Skipped: 0, Time elapsed: 15.086 sec
Running org.apache.hadoop.hbase.master.handler.TestTableDescriptorModification
Tests run: 3, Failures: 0, Errors: 0, Skipped: 0, Time elapsed: 15.902 sec
Running org.apache.hadoop.hbase.master.TestRestartCluster
Tests run: 2, Failures: 0, Errors: 0, Skipped: 0, Time elapsed: 28.755 sec
Running org.apache.hadoop.hbase.master.handler.TestCreateTableHandler
Tests run: 3, Failures: 0, Errors: 0, Skipped: 0, Time elapsed: 32.187 sec
Running org.apache.hadoop.hbase.master.TestMasterNoCluster
Tests run: 4, Failures: 0, Errors: 0, Skipped: 0, Time elapsed: 8.728 sec
Running org.apache.hadoop.hbase.master.TestAssignmentListener
Tests run: 2, Failures: 0, Errors: 0, Skipped: 0, Time elapsed: 18.711 sec
Running org.apache.hadoop.hbase.master.TestDeadServer
Tests run: 3, Failures: 0, Errors: 0, Skipped: 0, Time elapsed: 0.336 sec
Running org.apache.hadoop.hbase.master.balancer.TestBaseLoadBalancer
Tests run: 5, Failures: 0, Errors: 0, Skipped: 0, Time elapsed: 0.867 sec
Running org.apache.hadoop.hbase.master.TestZKBasedOpenCloseRegion
Tests run: 3, Failures: 0, Errors: 0, Skipped: 0, Time elapsed: 15.097 sec
Running org.apache.hadoop.hbase.master.balancer.TestDefaultLoadBalancer
Tests run: 1, Failures: 0, Errors: 0, Skipped: 0, Time elapsed: 1.336 sec
Running org.apache.hadoop.hbase.master.balancer.TestStochasticLoadBalancer
Tests run: 13, Failures: 0, Errors: 0, Skipped: 0, Time elapsed: 76.212 sec
Running org.apache.hadoop.hbase.master.TestRollingRestart
Tests run: 1, Failures: 0, Errors: 0, Skipped: 0, Time elapsed: 27.928 sec
Running org.apache.hadoop.hbase.master.TestMasterFileSystem
Tests run: 2, Failures: 0, Errors: 0, Skipped: 0, Time elapsed: 11.317 sec
Running org.apache.hadoop.hbase.master.TestMasterTransitions
Tests run: 3, Failures: 0, Errors: 0, Skipped: 3, Time elapsed: 13.365 sec
Running org.apache.hadoop.hbase.master.TestSplitLogManager
Tests run: 15, Failures: 0, Errors: 1, Skipped: 0, Time elapsed: 141.62 sec <<< FAILURE!
Running org.apache.hadoop.hbase.master.TestAssignmentManagerOnCluster
Tests run: 16, Failures: 0, Errors: 0, Skipped: 0, Time elapsed: 72.981 sec
Running org.apache.hadoop.hbase.master.TestZKLessAMOnCluster
Tests run: 16, Failures: 0, Errors: 0, Skipped: 0, Time elapsed: 73.92 sec
Running org.apache.hadoop.hbase.master.TestDistributedLogSplitting
Tests run: 17, Failures: 0, Errors: 0, Skipped: 0, Time elapsed: 256.222 sec
Running org.apache.hadoop.hbase.master.TestMasterFailover
Tests run: 6, Failures: 0, Errors: 0, Skipped: 0, Time elapsed: 84.652 sec
Running org.apache.hadoop.hbase.master.TestMasterMetrics
Tests run: 2, Failures: 0, Errors: 0, Skipped: 0, Time elapsed: 25.755 sec
Running org.apache.hadoop.hbase.master.TestMaster
Tests run: 4, Failures: 0, Errors: 0, Skipped: 0, Time elapsed: 15.409 sec
Running org.apache.hadoop.hbase.master.TestMasterFailoverBalancerPersistence
Tests run: 1, Failures: 0, Errors: 0, Skipped: 0, Time elapsed: 14.883 sec
Running org.apache.hadoop.hbase.master.TestMasterShutdown
Tests run: 2, Failures: 0, Errors: 0, Skipped: 0, Time elapsed: 19.632 sec
Running org.apache.hadoop.hbase.master.TestMasterStatusServlet
Tests run: 4, Failures: 0, Errors: 0, Skipped: 0, Time elapsed: 1.328 sec
Running org.apache.hadoop.hbase.master.snapshot.TestSnapshotFileCache
Tests run: 4, Failures: 0, Errors: 0, Skipped: 0, Time elapsed: 98.685 sec
Running org.apache.hadoop.hbase.master.TestMasterMetricsWrapper
Tests run: 1, Failures: 0, Errors: 0, Skipped: 0, Time elapsed: 13.189 sec
Running org.apache.hadoop.hbase.master.TestHMasterRPCException
Tests run: 1, Failures: 0, Errors: 0, Skipped: 0, Time elapsed: 1.658 sec
Running org.apache.hadoop.hbase.master.TestActiveMasterManager
Tests run: 2, Failures: 0, Errors: 0, Skipped: 0, Time elapsed: 1.341 sec
Running org.apache.hadoop.hbase.master.TestTableLockManager
Tests run: 5, Failures: 0, Errors: 0, Skipped: 0, Time elapsed: 92.954 sec

Results :

Failed tests:   testCreateWithCorrectOwner(org.apache.hadoop.hbase.security.access.TestAccessController2)
  testGlobalPermissionList(org.apache.hadoop.hbase.security.access.TestAccessController):
expected:<4> but was:<3>
  testPreCompactSelection(org.apache.hadoop.hbase.security.access.TestAccessController): expected:<4>
but was:<3>
  testCheckPermissions(org.apache.hadoop.hbase.security.access.TestAccessController): expected:<4>
but was:<3>
  testFlush(org.apache.hadoop.hbase.security.access.TestAccessController): expected:<4>
but was:<3>
  testSplit(org.apache.hadoop.hbase.security.access.TestAccessController): expected:<4>
but was:<3>
  testWrite(org.apache.hadoop.hbase.security.access.TestAccessController): expected:<4>
but was:<3>
  testMove(org.apache.hadoop.hbase.security.access.TestAccessController): expected:<4>
but was:<3>
  testRead(org.apache.hadoop.hbase.security.access.TestAccessController): expected:<4>
but was:<3>
  testStopRegionServer(org.apache.hadoop.hbase.security.access.TestAccessController): expected:<4>
but was:<3>
  testRegionOffline(org.apache.hadoop.hbase.security.access.TestAccessController): expected:<4>
but was:<3>
  testTableDescriptorsEnumeration(org.apache.hadoop.hbase.security.access.TestAccessController):
expected:<4> but was:<3>
  testTableCreate(org.apache.hadoop.hbase.security.access.TestAccessController): expected:<4>
but was:<3>
  testTableDelete(org.apache.hadoop.hbase.security.access.TestAccessController): expected:<4>
but was:<3>
  testTableEnable(org.apache.hadoop.hbase.security.access.TestAccessController): expected:<4>
but was:<3>
  testBalance(org.apache.hadoop.hbase.security.access.TestAccessController): expected:<4>
but was:<3>
  testBulkLoad(org.apache.hadoop.hbase.security.access.TestAccessController): expected:<4>
but was:<3>
  testTableModify(org.apache.hadoop.hbase.security.access.TestAccessController): expected:<4>
but was:<3>
  testCloseRegion(org.apache.hadoop.hbase.security.access.TestAccessController): expected:<4>
but was:<3>
  testPostGrantRevokeAtQualifierLevel(org.apache.hadoop.hbase.security.access.TestAccessController):
expected:<4> but was:<3>
  testGrantRevoke(org.apache.hadoop.hbase.security.access.TestAccessController): expected:<4>
but was:<3>
  testReadWrite(org.apache.hadoop.hbase.security.access.TestAccessController): expected:<4>
but was:<3>
  testOpenRegion(org.apache.hadoop.hbase.security.access.TestAccessController): expected:<4>
but was:<3>
  testDeleteColumn(org.apache.hadoop.hbase.security.access.TestAccessController): expected:<4>
but was:<3>
  testTableDisable(org.apache.hadoop.hbase.security.access.TestAccessController): expected:<4>
but was:<3>
  testUnassign(org.apache.hadoop.hbase.security.access.TestAccessController): expected:<4>
but was:<3>
  testAddColumn(org.apache.hadoop.hbase.security.access.TestAccessController): expected:<4>
but was:<3>
  testRollWALWriterRequest(org.apache.hadoop.hbase.security.access.TestAccessController):
expected:<4> but was:<3>
  testShutdown(org.apache.hadoop.hbase.security.access.TestAccessController): expected:<4>
but was:<3>
  testCompact(org.apache.hadoop.hbase.security.access.TestAccessController): expected:<4>
but was:<3>
  testCoprocessorExec(org.apache.hadoop.hbase.security.access.TestAccessController): expected:<4>
but was:<3>
  testModifyColumn(org.apache.hadoop.hbase.security.access.TestAccessController): expected:<4>
but was:<3>
  testTableDeletion(org.apache.hadoop.hbase.security.access.TestAccessController): expected:<4>
but was:<3>
  testSplitWithSplitRow(org.apache.hadoop.hbase.security.access.TestAccessController): expected:<4>
but was:<3>
  testSnapshot(org.apache.hadoop.hbase.security.access.TestAccessController): expected:<4>
but was:<3>
  testPostGrantRevoke(org.apache.hadoop.hbase.security.access.TestAccessController): expected:<4>
but was:<3>
  testAppend(org.apache.hadoop.hbase.security.access.TestAccessController): expected:<4>
but was:<3>
  testAssign(org.apache.hadoop.hbase.security.access.TestAccessController): expected:<4>
but was:<3>
  testMergeRegions(org.apache.hadoop.hbase.security.access.TestAccessController): expected:<4>
but was:<3>
  testNamespaceUserGrant(org.apache.hadoop.hbase.security.access.TestAccessController): expected:<4>
but was:<3>
  testBalanceSwitch(org.apache.hadoop.hbase.security.access.TestAccessController): expected:<4>
but was:<3>
  testPermissionList(org.apache.hadoop.hbase.security.access.TestAccessController): expected:<4>
but was:<3>
  testReservedCellTags(org.apache.hadoop.hbase.security.access.TestAccessController): expected:<4>
but was:<3>
  testStopMaster(org.apache.hadoop.hbase.security.access.TestAccessController): expected:<4>
but was:<3>
  testGlobalAuthorizationForNewRegisteredRS(org.apache.hadoop.hbase.security.access.TestAccessController):
expected:<4> but was:<3>

Tests in error: 
  testCoveringCheck(org.apache.hadoop.hbase.security.access.TestCellACLs): Failed 1 action:
org.apache.hadoop.hbase.security.AccessDeniedException: Insufficient permissions (user=owner,
scope=testCoveringCheck, family=f1:q1, action=WRITE)(..)
  testCellPermissions(org.apache.hadoop.hbase.security.access.TestCellACLs): Failed 1 action:
org.apache.hadoop.hbase.security.AccessDeniedException: Insufficient permissions (user=owner,
scope=testCellPermissions, family=f1:q1, action=WRITE)(..)
  testDeleteWithFutureTimestamp(org.apache.hadoop.hbase.security.access.TestCellACLWithMultipleVersions):
Failed 1 action: org.apache.hadoop.hbase.security.AccessDeniedException: Insufficient permissions
(user=owner, scope=testDeleteWithFutureTimestamp, family=f1:q1, action=WRITE)(..)
  testCellPermissionsWithDeleteExactVersion(org.apache.hadoop.hbase.security.access.TestCellACLWithMultipleVersions):
Failed 1 action: org.apache.hadoop.hbase.security.AccessDeniedException: Insufficient permissions
(user=owner, scope=testCellPermissionsWithDeleteExactVersion, family=f1:q1, action=WRITE)(..)
  testCellPermissionsForCheckAndDelete(org.apache.hadoop.hbase.security.access.TestCellACLWithMultipleVersions):
Failed 1 action: org.apache.hadoop.hbase.security.AccessDeniedException: Insufficient permissions
(user=owner, scope=testCellPermissionsForCheckAndDelete, family=f1:q1|f1:q2, action=WRITE)(..)
  testCellPermissionsForPutWithMultipleVersions(org.apache.hadoop.hbase.security.access.TestCellACLWithMultipleVersions):
Failed 1 action: org.apache.hadoop.hbase.security.AccessDeniedException: Insufficient permissions
(user=owner, scope=testCellPermissionsForPutWithMultipleVersions, family=f1:q1, action=WRITE)(..)
  testCellPermissionsWithDeleteWithUserTs(org.apache.hadoop.hbase.security.access.TestCellACLWithMultipleVersions):
Failed 1 action: org.apache.hadoop.hbase.security.AccessDeniedException: Insufficient permissions
(user=owner, scope=testCellPermissionsWithDeleteWithUserTs, family=f1:q1|f1:q2, action=WRITE)(..)
  testCellPermissionsWithDeleteMutipleVersions(org.apache.hadoop.hbase.security.access.TestCellACLWithMultipleVersions):
Failed 1 action: org.apache.hadoop.hbase.security.AccessDeniedException: Insufficient permissions
(user=owner, scope=testCellPermissionsWithDeleteMutipleVersions, family=f1:q1|f1:q2, action=WRITE)(..)
  testCellPermissionwithVersions(org.apache.hadoop.hbase.security.access.TestCellACLWithMultipleVersions):
Failed 1 action: org.apache.hadoop.hbase.security.AccessDeniedException: Insufficient permissions
(user=owner, scope=testCellPermissionwithVersions, family=f1:q1, action=WRITE)(..)
  testCellPermissionsForIncrementWithMultipleVersions(org.apache.hadoop.hbase.security.access.TestCellACLWithMultipleVersions):
Failed 1 action: org.apache.hadoop.hbase.security.AccessDeniedException: Insufficient permissions
(user=owner, scope=testCellPermissionsForIncrementWithMultipleVersions, family=f1:q1, action=WRITE)(..)
  testEarlyScanTermination(org.apache.hadoop.hbase.security.access.TestScanEarlyTermination):
Failed 1 action: org.apache.hadoop.hbase.security.AccessDeniedException: Insufficient permissions
(user=owner, scope=testEarlyScanTermination, family=f1:q1, action=WRITE)(..)
  testLogFilesAreArchived(org.apache.hadoop.hbase.master.TestSplitLogManager): test timed
out after 60000 milliseconds

Tests run: 1936, Failures: 45, Errors: 12, Skipped: 25

[INFO] ------------------------------------------------------------------------
[INFO] Reactor Summary:
[INFO] 
[INFO] HBase ............................................. SUCCESS [3.850s]
[INFO] HBase - Common .................................... SUCCESS [23.274s]
[INFO] HBase - Protocol .................................. SUCCESS [21.733s]
[INFO] HBase - Client .................................... SUCCESS [38.240s]
[INFO] HBase - Hadoop Compatibility ...................... SUCCESS [5.495s]
[INFO] HBase - Hadoop One Compatibility .................. SUCCESS [1.317s]
[INFO] HBase - Prefix Tree ............................... SUCCESS [3.784s]
[INFO] HBase - Server .................................... FAILURE [2:15:59.595s]
[INFO] HBase - Testing Util .............................. SKIPPED
[INFO] HBase - Thrift .................................... SKIPPED
[INFO] HBase - Shell ..................................... SKIPPED
[INFO] HBase - Integration Tests ......................... SKIPPED
[INFO] HBase - Examples .................................. SKIPPED
[INFO] HBase - Assembly .................................. SKIPPED
[INFO] ------------------------------------------------------------------------
[INFO] BUILD FAILURE
[INFO] ------------------------------------------------------------------------
[INFO] Total time: 2:17:38.818s
[INFO] Finished at: Tue Sep 16 23:43:01 UTC 2014
[INFO] Final Memory: 27M/755M
[INFO] ------------------------------------------------------------------------
[ERROR] Failed to execute goal org.apache.maven.plugins:maven-surefire-plugin:2.12-TRUNK-HBASE-2:test
(secondPartTestsExecution) on project hbase-server: There are test failures.
[ERROR] 
[ERROR] Please refer to <https://builds.apache.org/job/HBase-0.98-on-Hadoop-1.1/ws/hbase-server/target/surefire-reports>
for the individual test results.
[ERROR] -> [Help 1]
[ERROR] 
[ERROR] To see the full stack trace of the errors, re-run Maven with the -e switch.
[ERROR] Re-run Maven using the -X switch to enable full debug logging.
[ERROR] 
[ERROR] For more information about the errors and possible solutions, please read the following
articles:
[ERROR] [Help 1] http://cwiki.apache.org/confluence/display/MAVEN/MojoFailureException
[ERROR] 
[ERROR] After correcting the problems, you can resume the build with the command
[ERROR]   mvn <goals> -rf :hbase-server
Build step 'Invoke top-level Maven targets' marked build as failure
Performing Post build task...
Match found for :.* : True
Logical operation result is TRUE
Running script  :   ZOMBIE_TESTS_COUNT=`jps | grep surefirebooter | wc -l`
  if [[ $ZOMBIE_TESTS_COUNT != 0 ]] ; then
    #It seems sometimes the tests are not dying immediately. Let's give them 10s
    echo "Suspicious java process found - waiting 10s to see if there are just slow to stop"
    sleep 10
    ZOMBIE_TESTS_COUNT=`jps | grep surefirebooter | wc -l`
    if [[ $ZOMBIE_TESTS_COUNT != 0 ]] ; then
      echo "There are $ZOMBIE_TESTS_COUNT zombie tests, they should have been killed by surefire
but survived"
      echo "************ BEGIN zombies jstack extract"
      ZB_STACK=`jps | grep surefirebooter | cut -d ' ' -f 1 | xargs -n 1 jstack | grep ".test"
| grep "\.java"`
      jps | grep surefirebooter | cut -d ' ' -f 1 | xargs -n 1 jstack
      echo "************ END  zombies jstack extract"
      JIRA_COMMENT="$JIRA_COMMENT

     {color:red}-1 core zombie tests{color}.  There are ${ZOMBIE_TESTS_COUNT} zombie test(s):
${ZB_STACK}"
      BAD=1
      jps | grep surefirebooter | cut -d ' ' -f 1 | xargs kill -9
    else
      echo "We're ok: there is no zombie test, but some tests took some time to stop"
    fi
  else
    echo "We're ok: there is no zombie test"
  fi
[HBase-0.98-on-Hadoop-1.1] $ /bin/bash -xe /tmp/hudson3181212337033576810.sh
++ jps
++ grep surefirebooter
++ wc -l
+ ZOMBIE_TESTS_COUNT=0
+ [[ 0 != 0 ]]
+ echo 'We'\''re ok: there is no zombie test'
We're ok: there is no zombie test
POST BUILD TASK : SUCCESS
END OF POST BUILD TASK : 0
Archiving artifacts
Sending artifact delta relative to HBase-0.98-on-Hadoop-1.1 #492
Archived 1682 artifacts
Archive block size is 32768
Received 49 blocks and 398817132 bytes
Compression is 0.4%
Took 2 min 0 sec
Recording test results
Updating HBASE-11994

Mime
View raw message