hbase-builds mailing list archives

Site index · List index
Message view « Date » · « Thread »
Top « Date » · « Thread »
From Apache Jenkins Server <jenk...@builds.apache.org>
Subject Build failed in Jenkins: HBase-0.98 #521
Date Tue, 16 Sep 2014 23:08:45 GMT
See <https://builds.apache.org/job/HBase-0.98/521/changes>

Changes:

[apurtell] HBASE-11994 PutCombiner floods the M/R log with repeated log messages (Aditya Kishore)

------------------------------------------
[...truncated 1489 lines...]
Running org.apache.hadoop.hbase.client.TestHCM
Tests run: 15, Failures: 0, Errors: 0, Skipped: 3, Time elapsed: 45.593 sec
Running org.apache.hadoop.hbase.client.TestClientTimeouts
Tests run: 1, Failures: 0, Errors: 0, Skipped: 0, Time elapsed: 10.738 sec
Running org.apache.hadoop.hbase.client.replication.TestReplicationAdmin
Tests run: 2, Failures: 0, Errors: 0, Skipped: 0, Time elapsed: 1.485 sec
Running org.apache.hadoop.hbase.client.TestScannerTimeout
Tests run: 4, Failures: 0, Errors: 0, Skipped: 0, Time elapsed: 47.152 sec
Running org.apache.hadoop.hbase.client.TestFromClientSideNoCodec
Tests run: 2, Failures: 0, Errors: 0, Skipped: 0, Time elapsed: 9.219 sec
Running org.apache.hadoop.hbase.client.TestScannersFromClientSide
Tests run: 5, Failures: 0, Errors: 0, Skipped: 0, Time elapsed: 12.304 sec
Running org.apache.hadoop.hbase.client.TestHTableUtil
Tests run: 2, Failures: 0, Errors: 0, Skipped: 0, Time elapsed: 9.582 sec
Running org.apache.hadoop.hbase.client.TestAdmin
Tests run: 44, Failures: 0, Errors: 0, Skipped: 0, Time elapsed: 379.063 sec
Running org.apache.hadoop.hbase.client.TestTimestampsFilter
Tests run: 3, Failures: 0, Errors: 0, Skipped: 0, Time elapsed: 11.968 sec
Running org.apache.hadoop.hbase.client.TestTableSnapshotScanner
Tests run: 3, Failures: 0, Errors: 0, Skipped: 0, Time elapsed: 35.794 sec
Running org.apache.hadoop.hbase.client.TestRpcControllerFactory
Tests run: 1, Failures: 0, Errors: 0, Skipped: 0, Time elapsed: 8.821 sec
Running org.apache.hadoop.hbase.client.TestFromClientSide
Tests run: 77, Failures: 0, Errors: 0, Skipped: 4, Time elapsed: 86.803 sec
Running org.apache.hadoop.hbase.client.TestMultiParallel
Tests run: 12, Failures: 0, Errors: 0, Skipped: 0, Time elapsed: 22.793 sec
Running org.apache.hadoop.hbase.client.TestClientScannerRPCTimeout
Tests run: 1, Failures: 0, Errors: 0, Skipped: 0, Time elapsed: 28.041 sec
Running org.apache.hadoop.hbase.client.TestMetaScanner
Tests run: 2, Failures: 0, Errors: 0, Skipped: 0, Time elapsed: 43.553 sec
Running org.apache.hadoop.hbase.client.TestPutWithDelete
Tests run: 1, Failures: 0, Errors: 0, Skipped: 0, Time elapsed: 9.391 sec
Running org.apache.hadoop.hbase.client.TestFromClientSide3
Tests run: 6, Failures: 0, Errors: 0, Skipped: 0, Time elapsed: 30.75 sec
Running org.apache.hadoop.hbase.client.TestRestoreSnapshotFromClient
Tests run: 5, Failures: 0, Errors: 0, Skipped: 0, Time elapsed: 77.249 sec
Running org.apache.hadoop.hbase.regionserver.TestTags
Tests run: 4, Failures: 0, Errors: 0, Skipped: 0, Time elapsed: 11.199 sec
Running org.apache.hadoop.hbase.regionserver.TestRegionServerNoMaster
Tests run: 9, Failures: 0, Errors: 0, Skipped: 0, Time elapsed: 24.621 sec
Running org.apache.hadoop.hbase.regionserver.TestPriorityRpc
Tests run: 3, Failures: 0, Errors: 0, Skipped: 0, Time elapsed: 1.714 sec
Running org.apache.hadoop.hbase.regionserver.TestBlocksRead
Tests run: 4, Failures: 0, Errors: 0, Skipped: 0, Time elapsed: 2.169 sec
Running org.apache.hadoop.hbase.regionserver.TestEncryptionRandomKeying
Tests run: 1, Failures: 0, Errors: 0, Skipped: 0, Time elapsed: 9.113 sec
Running org.apache.hadoop.hbase.regionserver.TestMasterAddressTracker
Tests run: 1, Failures: 0, Errors: 0, Skipped: 0, Time elapsed: 1.304 sec
Running org.apache.hadoop.hbase.regionserver.TestScannerWithBulkload
Tests run: 3, Failures: 0, Errors: 0, Skipped: 0, Time elapsed: 10.78 sec
Running org.apache.hadoop.hbase.client.TestFromClientSideWithCoprocessor
Tests run: 77, Failures: 0, Errors: 0, Skipped: 4, Time elapsed: 83.819 sec
Running org.apache.hadoop.hbase.regionserver.TestCompaction
Tests run: 5, Failures: 0, Errors: 0, Skipped: 0, Time elapsed: 11.464 sec
Running org.apache.hadoop.hbase.regionserver.TestStoreScanner
Tests run: 16, Failures: 0, Errors: 0, Skipped: 0, Time elapsed: 0.673 sec
Running org.apache.hadoop.hbase.regionserver.TestParallelPut
Tests run: 2, Failures: 0, Errors: 0, Skipped: 0, Time elapsed: 6.24 sec
Running org.apache.hadoop.hbase.regionserver.TestMultiColumnScanner
Tests run: 12, Failures: 0, Errors: 0, Skipped: 0, Time elapsed: 51.1 sec
Running org.apache.hadoop.hbase.regionserver.TestHRegionServerBulkLoad
Tests run: 1, Failures: 0, Errors: 0, Skipped: 0, Time elapsed: 38.875 sec
Running org.apache.hadoop.hbase.regionserver.TestJoinedScanners
Tests run: 1, Failures: 0, Errors: 0, Skipped: 0, Time elapsed: 17.358 sec
Running org.apache.hadoop.hbase.regionserver.TestReversibleScanners
Tests run: 5, Failures: 0, Errors: 0, Skipped: 0, Time elapsed: 3.545 sec
Running org.apache.hadoop.hbase.regionserver.TestSplitTransactionOnCluster
Tests run: 12, Failures: 0, Errors: 0, Skipped: 0, Time elapsed: 36.992 sec
Running org.apache.hadoop.hbase.regionserver.TestHRegionOnCluster
Tests run: 1, Failures: 0, Errors: 0, Skipped: 0, Time elapsed: 12.265 sec
Running org.apache.hadoop.hbase.regionserver.TestEndToEndSplitTransaction
Tests run: 2, Failures: 0, Errors: 0, Skipped: 0, Time elapsed: 20.904 sec
Running org.apache.hadoop.hbase.regionserver.TestStore
Tests run: 16, Failures: 0, Errors: 0, Skipped: 0, Time elapsed: 13.094 sec
Running org.apache.hadoop.hbase.regionserver.TestGetClosestAtOrBefore
Tests run: 3, Failures: 0, Errors: 0, Skipped: 0, Time elapsed: 1.961 sec
Running org.apache.hadoop.hbase.regionserver.TestHRegion
Tests run: 73, Failures: 0, Errors: 0, Skipped: 0, Time elapsed: 70.825 sec
Running org.apache.hadoop.hbase.regionserver.TestCacheOnWriteInSchema
Tests run: 3, Failures: 0, Errors: 0, Skipped: 0, Time elapsed: 2.408 sec
Running org.apache.hadoop.hbase.regionserver.TestSCVFWithMiniCluster
Tests run: 5, Failures: 0, Errors: 0, Skipped: 0, Time elapsed: 8.349 sec
Running org.apache.hadoop.hbase.regionserver.TestSeekOptimizations
Tests run: 6, Failures: 0, Errors: 0, Skipped: 0, Time elapsed: 4.011 sec
Running org.apache.hadoop.hbase.regionserver.wal.TestWALReplay
Tests run: 9, Failures: 0, Errors: 0, Skipped: 0, Time elapsed: 53.544 sec
Running org.apache.hadoop.hbase.regionserver.wal.TestWALReplayCompressed
Tests run: 9, Failures: 0, Errors: 0, Skipped: 0, Time elapsed: 54.447 sec
Running org.apache.hadoop.hbase.regionserver.wal.TestLogRollPeriod
Tests run: 2, Failures: 0, Errors: 0, Skipped: 0, Time elapsed: 58.251 sec
Running org.apache.hadoop.hbase.regionserver.wal.TestSecureWALReplay
Tests run: 9, Failures: 0, Errors: 0, Skipped: 0, Time elapsed: 57.208 sec
Running org.apache.hadoop.hbase.regionserver.wal.TestHLogSplit
Tests run: 33, Failures: 0, Errors: 0, Skipped: 1, Time elapsed: 60.533 sec
Running org.apache.hadoop.hbase.regionserver.wal.TestHLogReaderOnSecureHLog
Tests run: 2, Failures: 0, Errors: 0, Skipped: 0, Time elapsed: 2.094 sec
Running org.apache.hadoop.hbase.regionserver.wal.TestLogRollAbort
Tests run: 1, Failures: 0, Errors: 0, Skipped: 0, Time elapsed: 14.274 sec
Running org.apache.hadoop.hbase.regionserver.wal.TestReadOldRootAndMetaEdits
Tests run: 1, Failures: 0, Errors: 0, Skipped: 0, Time elapsed: 1.252 sec
Running org.apache.hadoop.hbase.regionserver.wal.TestLogRolling
Tests run: 4, Failures: 0, Errors: 0, Skipped: 0, Time elapsed: 193.776 sec
Running org.apache.hadoop.hbase.regionserver.wal.TestDurability
Tests run: 2, Failures: 0, Errors: 0, Skipped: 0, Time elapsed: 5.462 sec
Running org.apache.hadoop.hbase.regionserver.wal.TestSecureHLog
Tests run: 1, Failures: 0, Errors: 0, Skipped: 0, Time elapsed: 1.812 sec
Running org.apache.hadoop.hbase.regionserver.wal.TestHLog
Tests run: 17, Failures: 0, Errors: 0, Skipped: 0, Time elapsed: 32.502 sec
Running org.apache.hadoop.hbase.regionserver.wal.TestHLogSplitCompressed
Tests run: 33, Failures: 0, Errors: 0, Skipped: 1, Time elapsed: 61.189 sec
Running org.apache.hadoop.hbase.regionserver.wal.TestHLogFiltering
Tests run: 1, Failures: 0, Errors: 0, Skipped: 0, Time elapsed: 23.209 sec
Running org.apache.hadoop.hbase.regionserver.TestMinorCompaction
Tests run: 6, Failures: 0, Errors: 0, Skipped: 0, Time elapsed: 3.186 sec
Running org.apache.hadoop.hbase.regionserver.TestZKLessMergeOnCluster
Tests run: 3, Failures: 0, Errors: 0, Skipped: 0, Time elapsed: 16.928 sec
Running org.apache.hadoop.hbase.regionserver.TestRegionMergeTransactionOnCluster
Tests run: 3, Failures: 0, Errors: 0, Skipped: 0, Time elapsed: 18.684 sec
Running org.apache.hadoop.hbase.regionserver.TestRegionFavoredNodes
Tests run: 1, Failures: 0, Errors: 0, Skipped: 0, Time elapsed: 17.45 sec
Running org.apache.hadoop.hbase.regionserver.TestServerCustomProtocol
Tests run: 7, Failures: 0, Errors: 0, Skipped: 0, Time elapsed: 18.639 sec
Running org.apache.hadoop.hbase.regionserver.TestCompactionWithCoprocessor
Tests run: 5, Failures: 0, Errors: 0, Skipped: 0, Time elapsed: 11.197 sec
Running org.apache.hadoop.hbase.regionserver.TestZKLessSplitOnCluster
Tests run: 12, Failures: 0, Errors: 0, Skipped: 0, Time elapsed: 31.261 sec
Running org.apache.hadoop.hbase.regionserver.TestAtomicOperation
Tests run: 6, Failures: 0, Errors: 0, Skipped: 0, Time elapsed: 40.684 sec
Running org.apache.hadoop.hbase.regionserver.TestSplitLogWorker
Tests run: 7, Failures: 0, Errors: 0, Skipped: 0, Time elapsed: 24.711 sec
Running org.apache.hadoop.hbase.regionserver.TestMajorCompaction
Tests run: 7, Failures: 0, Errors: 0, Skipped: 0, Time elapsed: 29.172 sec
Running org.apache.hadoop.hbase.regionserver.TestMemStore
Tests run: 23, Failures: 0, Errors: 0, Skipped: 0, Time elapsed: 44.625 sec
Running org.apache.hadoop.hbase.regionserver.TestClusterId
Tests run: 2, Failures: 0, Errors: 0, Skipped: 0, Time elapsed: 29.513 sec
Running org.apache.hadoop.hbase.regionserver.TestCompactionState
Tests run: 5, Failures: 0, Errors: 0, Skipped: 0, Time elapsed: 25.091 sec
Running org.apache.hadoop.hbase.regionserver.TestEncryptionKeyRotation
Tests run: 2, Failures: 0, Errors: 0, Skipped: 0, Time elapsed: 18.37 sec
Running org.apache.hadoop.hbase.regionserver.TestFSErrorsExposed
Tests run: 3, Failures: 0, Errors: 0, Skipped: 0, Time elapsed: 31.379 sec
Running org.apache.hadoop.hbase.regionserver.handler.TestOpenRegionHandler
Tests run: 6, Failures: 0, Errors: 0, Skipped: 0, Time elapsed: 2.164 sec
Running org.apache.hadoop.hbase.regionserver.handler.TestCloseRegionHandler
Tests run: 3, Failures: 0, Errors: 0, Skipped: 0, Time elapsed: 2.151 sec
Running org.apache.hadoop.hbase.regionserver.TestRegionServerMetrics
Tests run: 9, Failures: 0, Errors: 0, Skipped: 0, Time elapsed: 10.79 sec
Running org.apache.hadoop.hbase.regionserver.TestCompoundBloomFilter
Tests run: 3, Failures: 0, Errors: 0, Skipped: 0, Time elapsed: 23.142 sec
Running org.apache.hadoop.hbase.TestLocalHBaseCluster
Tests run: 1, Failures: 0, Errors: 0, Skipped: 0, Time elapsed: 8.162 sec
Running org.apache.hadoop.hbase.migration.TestUpgradeTo96
Tests run: 5, Failures: 0, Errors: 0, Skipped: 0, Time elapsed: 7.628 sec
Running org.apache.hadoop.hbase.migration.TestNamespaceUpgrade
Tests run: 5, Failures: 0, Errors: 0, Skipped: 0, Time elapsed: 21.228 sec
Running org.apache.hadoop.hbase.constraint.TestConstraint
Tests run: 5, Failures: 0, Errors: 0, Skipped: 0, Time elapsed: 12.894 sec

Results :

Tests in error: 
  testLogFilesAreArchived(org.apache.hadoop.hbase.master.TestSplitLogManager): test timed
out after 60000 milliseconds

Tests run: 2009, Failures: 0, Errors: 1, Skipped: 24

[INFO] ------------------------------------------------------------------------
[INFO] Reactor Summary:
[INFO] 
[INFO] HBase ............................................. SUCCESS [2.673s]
[INFO] HBase - Common .................................... SUCCESS [24.516s]
[INFO] HBase - Protocol .................................. SUCCESS [19.645s]
[INFO] HBase - Client .................................... SUCCESS [38.716s]
[INFO] HBase - Hadoop Compatibility ...................... SUCCESS [5.405s]
[INFO] HBase - Hadoop Two Compatibility .................. SUCCESS [1.642s]
[INFO] HBase - Prefix Tree ............................... SUCCESS [3.673s]
[INFO] HBase - Server .................................... FAILURE [1:35:27.746s]
[INFO] HBase - Testing Util .............................. SKIPPED
[INFO] HBase - Thrift .................................... SKIPPED
[INFO] HBase - Shell ..................................... SKIPPED
[INFO] HBase - Integration Tests ......................... SKIPPED
[INFO] HBase - Examples .................................. SKIPPED
[INFO] HBase - Assembly .................................. SKIPPED
[INFO] ------------------------------------------------------------------------
[INFO] BUILD FAILURE
[INFO] ------------------------------------------------------------------------
[INFO] Total time: 1:37:04.807s
[INFO] Finished at: Tue Sep 16 23:05:18 UTC 2014
[INFO] Final Memory: 39M/857M
[INFO] ------------------------------------------------------------------------
[ERROR] Failed to execute goal org.apache.maven.plugins:maven-surefire-plugin:2.12-TRUNK-HBASE-2:test
(secondPartTestsExecution) on project hbase-server: There are test failures.
[ERROR] 
[ERROR] Please refer to <https://builds.apache.org/job/HBase-0.98/ws/hbase-server/target/surefire-reports>
for the individual test results.
[ERROR] -> [Help 1]
[ERROR] 
[ERROR] To see the full stack trace of the errors, re-run Maven with the -e switch.
[ERROR] Re-run Maven using the -X switch to enable full debug logging.
[ERROR] 
[ERROR] For more information about the errors and possible solutions, please read the following
articles:
[ERROR] [Help 1] http://cwiki.apache.org/confluence/display/MAVEN/MojoFailureException
[ERROR] 
[ERROR] After correcting the problems, you can resume the build with the command
[ERROR]   mvn <goals> -rf :hbase-server
Build step 'Invoke top-level Maven targets' marked build as failure
Performing Post build task...
Match found for :.* : True
Logical operation result is TRUE
Running script  :   ZOMBIE_TESTS_COUNT=`jps | grep surefirebooter | wc -l`
  if [[ $ZOMBIE_TESTS_COUNT != 0 ]] ; then
    #It seems sometimes the tests are not dying immediately. Let's give them 10s
    echo "Suspicious java process found - waiting 10s to see if there are just slow to stop"
    sleep 10   
    ZOMBIE_TESTS_COUNT=`jps | grep surefirebooter | wc -l`
    if [[ $ZOMBIE_TESTS_COUNT != 0 ]] ; then
      echo "There are $ZOMBIE_TESTS_COUNT zombie tests, they should have been killed by surefire
but survived"
      echo "************ BEGIN zombies jstack extract"
      ZB_STACK=`jps | grep surefirebooter | cut -d ' ' -f 1 | xargs -n 1 jstack | grep ".test"
| grep "\.java"`
      jps | grep surefirebooter | cut -d ' ' -f 1 | xargs -n 1 jstack
      echo "************ END  zombies jstack extract"
      JIRA_COMMENT="$JIRA_COMMENT

     {color:red}-1 core zombie tests{color}.  There are ${ZOMBIE_TESTS_COUNT} zombie test(s):
${ZB_STACK}"
      BAD=1
      jps | grep surefirebooter | cut -d ' ' -f 1 | xargs kill -9
    else
      echo "We're ok: there is no zombie test, but some tests took some time to stop"
    fi
  else
    echo "We're ok: there is no zombie test"
  fi
[HBase-0.98] $ /bin/bash -xe /tmp/hudson2538468419120017662.sh
++ jps
++ grep surefirebooter
++ wc -l
+ ZOMBIE_TESTS_COUNT=0
+ [[ 0 != 0 ]]
+ echo 'We'\''re ok: there is no zombie test'
We're ok: there is no zombie test
POST BUILD TASK : SUCCESS
END OF POST BUILD TASK : 0
Archiving artifacts
Sending artifact delta relative to HBase-0.98 #511
Archived 1689 artifacts
Archive block size is 32768
Received 62 blocks and 427077651 bytes
Compression is 0.5%
Took 1 min 59 sec
Recording test results
Updating HBASE-11994

Mime
View raw message