hbase-builds mailing list archives

Site index · List index
Message view « Date » · « Thread »
Top « Date » · « Thread »
From Apache Jenkins Server <jenk...@builds.apache.org>
Subject Build failed in Jenkins: HBase-1.0 #224
Date Wed, 24 Sep 2014 10:48:37 GMT
See <https://builds.apache.org/job/HBase-1.0/224/changes>

Changes:

[anoopsamjohn] HBASE-12068 [Branch-1] Avoid need to always do KeyValueUtil#ensureKeyValue
for Filter transformCell.

------------------------------------------
[...truncated 1868 lines...]
[ERROR] To see the full stack trace of the errors, re-run Maven with the -e switch.
[ERROR] Re-run Maven using the -X switch to enable full debug logging.
[ERROR] 
[ERROR] For more information about the errors and possible solutions, please read the following
articles:
[ERROR] [Help 1] http://cwiki.apache.org/confluence/display/MAVEN/MojoFailureException
[ERROR] 
[ERROR] After correcting the problems, you can resume the build with the command
[ERROR]   mvn <goals> -rf :hbase-server
Build step 'Invoke top-level Maven targets' marked build as failure
Performing Post build task...
Match found for :.* : True
Logical operation result is TRUE
Running script  :   ZOMBIE_TESTS_COUNT=`jps | grep surefirebooter | wc -l`
  if [[ $ZOMBIE_TESTS_COUNT != 0 ]] ; then
    #It seems sometimes the tests are not dying immediately. Let's give them 10s
    echo "Suspicious java process found - waiting 10s to see if there are just slow to stop"
    sleep 10   
    ZOMBIE_TESTS_COUNT=`jps | grep surefirebooter | wc -l`
    if [[ $ZOMBIE_TESTS_COUNT != 0 ]] ; then
      echo "There are $ZOMBIE_TESTS_COUNT zombie tests, they should have been killed by surefire
but survived"
      echo "************ BEGIN zombies jstack extract"
      ZB_STACK=`jps | grep surefirebooter | cut -d ' ' -f 1 | xargs -n 1 jstack | grep ".test"
| grep "\.java"`
      jps | grep surefirebooter | cut -d ' ' -f 1 | xargs -n 1 jstack
      echo "************ END  zombies jstack extract"
      JIRA_COMMENT="$JIRA_COMMENT

     {color:red}-1 core zombie tests{color}.  There are ${ZOMBIE_TESTS_COUNT} zombie test(s):
${ZB_STACK}"
      BAD=1
      jps | grep surefirebooter | cut -d ' ' -f 1 | xargs kill -9
    else
      echo "We're ok: there is no zombie test, but some tests took some time to stop"
    fi
  else
    echo "We're ok: there is no zombie test"
  fi
[HBase-1.0] $ /bin/bash -xe /tmp/hudson5959532213033311132.sh
++ jps
++ grep surefirebooter
++ wc -l
+ ZOMBIE_TESTS_COUNT=1
+ [[ 1 != 0 ]]
+ echo 'Suspicious java process found - waiting 10s to see if there are just slow to stop'
Suspicious java process found - waiting 10s to see if there are just slow to stop
+ sleep 10
++ jps
++ grep surefirebooter
++ wc -l
+ ZOMBIE_TESTS_COUNT=1
+ [[ 1 != 0 ]]
+ echo 'There are 1 zombie tests, they should have been killed by surefire but survived'
There are 1 zombie tests, they should have been killed by surefire but survived
+ echo '************ BEGIN zombies jstack extract'
************ BEGIN zombies jstack extract
++ jps
++ grep surefirebooter
++ cut -d ' ' -f 1
++ xargs -n 1 jstack
++ grep .test
++ grep '\.java'
+ ZB_STACK='	at org.apache.james.smtpserver.SMTPServerTest.testAddressBracketsEnforcementDisabled(SMTPServerTest.java:1361)'
+ jps
+ grep surefirebooter
+ cut -d ' ' -f 1
+ xargs -n 1 jstack
2014-09-24 10:41:53
Full thread dump OpenJDK 64-Bit Server VM (24.65-b04 mixed mode):

"Attach Listener" daemon prio=10 tid=0x00007fbe78001000 nid=0x79f2 waiting on condition [0x0000000000000000]
   java.lang.Thread.State: RUNNABLE

"New I/O server worker #36-1" prio=10 tid=0x00007fbe28021800 nid=0x567b runnable [0x00007fbe9d02e000]
   java.lang.Thread.State: RUNNABLE
	at sun.nio.ch.EPollArrayWrapper.epollWait(Native Method)
	at sun.nio.ch.EPollArrayWrapper.poll(EPollArrayWrapper.java:269)
	at sun.nio.ch.EPollSelectorImpl.doSelect(EPollSelectorImpl.java:79)
	at sun.nio.ch.SelectorImpl.lockAndDoSelect(SelectorImpl.java:87)
	- locked <0x00000000f92b0540> (a sun.nio.ch.Util$2)
	- locked <0x00000000f92b0530> (a java.util.Collections$UnmodifiableSet)
	- locked <0x00000000f92b0418> (a sun.nio.ch.EPollSelectorImpl)
	at sun.nio.ch.SelectorImpl.select(SelectorImpl.java:98)
	at org.jboss.netty.channel.socket.nio.SelectorUtil.select(SelectorUtil.java:33)
	at org.jboss.netty.channel.socket.nio.NioWorker.run(NioWorker.java:157)
	at org.jboss.netty.util.ThreadRenamingRunnable.run(ThreadRenamingRunnable.java:102)
	at org.jboss.netty.util.internal.DeadLockProofWorker$1.run(DeadLockProofWorker.java:42)
	at java.util.concurrent.ThreadPoolExecutor.runWorker(ThreadPoolExecutor.java:1145)
	at java.util.concurrent.ThreadPoolExecutor$Worker.run(ThreadPoolExecutor.java:615)
	at java.lang.Thread.run(Thread.java:745)

"Hashed wheel timer #36" prio=10 tid=0x00007fbe2801c800 nid=0x5679 waiting on condition [0x00007fbe9cb29000]
   java.lang.Thread.State: TIMED_WAITING (sleeping)
	at java.lang.Thread.sleep(Native Method)
	at org.jboss.netty.util.HashedWheelTimer$Worker.waitForNextTick(HashedWheelTimer.java:455)
	at org.jboss.netty.util.HashedWheelTimer$Worker.run(HashedWheelTimer.java:372)
	at org.jboss.netty.util.ThreadRenamingRunnable.run(ThreadRenamingRunnable.java:102)
	at java.lang.Thread.run(Thread.java:745)

"New I/O server boss #36 ([id: 0x1a59d9b3, /127.0.0.1:8036])" prio=10 tid=0x00007fbed15aa000
nid=0x5678 runnable [0x00007fbe9d432000]
   java.lang.Thread.State: RUNNABLE
	at sun.nio.ch.EPollArrayWrapper.epollWait(Native Method)
	at sun.nio.ch.EPollArrayWrapper.poll(EPollArrayWrapper.java:269)
	at sun.nio.ch.EPollSelectorImpl.doSelect(EPollSelectorImpl.java:79)
	at sun.nio.ch.SelectorImpl.lockAndDoSelect(SelectorImpl.java:87)
	- locked <0x00000000f928c2c0> (a sun.nio.ch.Util$2)
	- locked <0x00000000f928c2b0> (a java.util.Collections$UnmodifiableSet)
	- locked <0x00000000f928c198> (a sun.nio.ch.EPollSelectorImpl)
	at sun.nio.ch.SelectorImpl.select(SelectorImpl.java:98)
	at org.jboss.netty.channel.socket.nio.NioServerSocketPipelineSink$Boss.run(NioServerSocketPipelineSink.java:232)
	at org.jboss.netty.util.ThreadRenamingRunnable.run(ThreadRenamingRunnable.java:102)
	at org.jboss.netty.util.internal.DeadLockProofWorker$1.run(DeadLockProofWorker.java:42)
	at java.util.concurrent.ThreadPoolExecutor.runWorker(ThreadPoolExecutor.java:1145)
	at java.util.concurrent.ThreadPoolExecutor$Worker.run(ThreadPoolExecutor.java:615)
	at java.lang.Thread.run(Thread.java:745)

"Service Thread" daemon prio=10 tid=0x00007fbed029f800 nid=0x53e6 runnable [0x0000000000000000]
   java.lang.Thread.State: RUNNABLE

"C2 CompilerThread1" daemon prio=10 tid=0x00007fbed029d000 nid=0x53e5 waiting on condition
[0x0000000000000000]
   java.lang.Thread.State: RUNNABLE

"C2 CompilerThread0" daemon prio=10 tid=0x00007fbed029a000 nid=0x53e4 waiting on condition
[0x0000000000000000]
   java.lang.Thread.State: RUNNABLE

"Signal Dispatcher" daemon prio=10 tid=0x00007fbed0298000 nid=0x53e3 runnable [0x0000000000000000]
   java.lang.Thread.State: RUNNABLE

"Finalizer" daemon prio=10 tid=0x00007fbed0276800 nid=0x53e2 in Object.wait() [0x00007fbe9f7f6000]
   java.lang.Thread.State: WAITING (on object monitor)
	at java.lang.Object.wait(Native Method)
	- waiting on <0x00000000fd6204d8> (a java.lang.ref.ReferenceQueue$Lock)
	at java.lang.ref.ReferenceQueue.remove(ReferenceQueue.java:135)
	- locked <0x00000000fd6204d8> (a java.lang.ref.ReferenceQueue$Lock)
	at java.lang.ref.ReferenceQueue.remove(ReferenceQueue.java:151)
	at java.lang.ref.Finalizer$FinalizerThread.run(Finalizer.java:209)

"Reference Handler" daemon prio=10 tid=0x00007fbed0274800 nid=0x53e1 in Object.wait() [0x00007fbe9f8f7000]
   java.lang.Thread.State: WAITING (on object monitor)
	at java.lang.Object.wait(Native Method)
	- waiting on <0x00000000fd6480d0> (a java.lang.ref.Reference$Lock)
	at java.lang.Object.wait(Object.java:503)
	at java.lang.ref.Reference$ReferenceHandler.run(Reference.java:133)
	- locked <0x00000000fd6480d0> (a java.lang.ref.Reference$Lock)

"main" prio=10 tid=0x00007fbed000a000 nid=0x53d2 runnable [0x00007fbed7239000]
   java.lang.Thread.State: RUNNABLE
	at java.net.SocketInputStream.socketRead0(Native Method)
	at java.net.SocketInputStream.read(SocketInputStream.java:152)
	at java.net.SocketInputStream.read(SocketInputStream.java:122)
	at sun.nio.cs.StreamDecoder.readBytes(StreamDecoder.java:283)
	at sun.nio.cs.StreamDecoder.implRead(StreamDecoder.java:325)
	at sun.nio.cs.StreamDecoder.read(StreamDecoder.java:177)
	- locked <0x00000000f929c990> (a java.io.InputStreamReader)
	at java.io.InputStreamReader.read(InputStreamReader.java:184)
	at java.io.BufferedReader.fill(BufferedReader.java:154)
	at java.io.BufferedReader.read(BufferedReader.java:175)
	- locked <0x00000000f929c990> (a java.io.InputStreamReader)
	at org.apache.commons.net.io.CRLFLineReader.readLine(CRLFLineReader.java:58)
	- locked <0x00000000f929c990> (a java.io.InputStreamReader)
	at org.apache.commons.net.smtp.SMTP.__getReply(SMTP.java:196)
	at org.apache.commons.net.smtp.SMTP.__sendCommand(SMTP.java:171)
	at org.apache.commons.net.smtp.SMTP.sendCommand(SMTP.java:315)
	at org.apache.commons.net.smtp.SMTP.sendCommand(SMTP.java:342)
	at org.apache.commons.net.smtp.SMTP.sendCommand(SMTP.java:391)
	at org.apache.commons.net.smtp.SMTP.quit(SMTP.java:760)
	at org.apache.james.smtpserver.SMTPServerTest.testAddressBracketsEnforcementDisabled(SMTPServerTest.java:1361)
	at sun.reflect.NativeMethodAccessorImpl.invoke0(Native Method)
	at sun.reflect.NativeMethodAccessorImpl.invoke(NativeMethodAccessorImpl.java:57)
	at sun.reflect.DelegatingMethodAccessorImpl.invoke(DelegatingMethodAccessorImpl.java:43)
	at java.lang.reflect.Method.invoke(Method.java:606)
	at org.junit.runners.model.FrameworkMethod$1.runReflectiveCall(FrameworkMethod.java:47)
	at org.junit.internal.runners.model.ReflectiveCallable.run(ReflectiveCallable.java:12)
	at org.junit.runners.model.FrameworkMethod.invokeExplosively(FrameworkMethod.java:44)
	at org.junit.internal.runners.statements.InvokeMethod.evaluate(InvokeMethod.java:17)
	at org.junit.internal.runners.statements.RunBefores.evaluate(RunBefores.java:26)
	at org.junit.internal.runners.statements.RunAfters.evaluate(RunAfters.java:27)
	at org.junit.runners.ParentRunner.runLeaf(ParentRunner.java:271)
	at org.junit.runners.BlockJUnit4ClassRunner.runChild(BlockJUnit4ClassRunner.java:70)
	at org.junit.runners.BlockJUnit4ClassRunner.runChild(BlockJUnit4ClassRunner.java:50)
	at org.junit.runners.ParentRunner$3.run(ParentRunner.java:238)
	at org.junit.runners.ParentRunner$1.schedule(ParentRunner.java:63)
	at org.junit.runners.ParentRunner.runChildren(ParentRunner.java:236)
	at org.junit.runners.ParentRunner.access$000(ParentRunner.java:53)
	at org.junit.runners.ParentRunner$2.evaluate(ParentRunner.java:229)
	at org.junit.runners.ParentRunner.run(ParentRunner.java:309)
	at org.apache.maven.surefire.junit4.JUnit4Provider.execute(JUnit4Provider.java:264)
	at org.apache.maven.surefire.junit4.JUnit4Provider.executeTestSet(JUnit4Provider.java:153)
	at org.apache.maven.surefire.junit4.JUnit4Provider.invoke(JUnit4Provider.java:124)
	at sun.reflect.NativeMethodAccessorImpl.invoke0(Native Method)
	at sun.reflect.NativeMethodAccessorImpl.invoke(NativeMethodAccessorImpl.java:57)
	at sun.reflect.DelegatingMethodAccessorImpl.invoke(DelegatingMethodAccessorImpl.java:43)
	at java.lang.reflect.Method.invoke(Method.java:606)
	at org.apache.maven.surefire.util.ReflectionUtils.invokeMethodWithArray2(ReflectionUtils.java:208)
	at org.apache.maven.surefire.booter.ProviderFactory$ProviderProxy.invoke(ProviderFactory.java:158)
	at org.apache.maven.surefire.booter.ProviderFactory.invokeProvider(ProviderFactory.java:86)
	at org.apache.maven.surefire.booter.ForkedBooter.runSuitesInProcess(ForkedBooter.java:153)
	at org.apache.maven.surefire.booter.ForkedBooter.main(ForkedBooter.java:95)

"VM Thread" prio=10 tid=0x00007fbed0270000 nid=0x53e0 runnable 

"GC task thread#0 (ParallelGC)" prio=10 tid=0x00007fbed0020000 nid=0x53d3 runnable 

"GC task thread#1 (ParallelGC)" prio=10 tid=0x00007fbed0022000 nid=0x53d4 runnable 

"GC task thread#2 (ParallelGC)" prio=10 tid=0x00007fbed0023800 nid=0x53d5 runnable 

"GC task thread#3 (ParallelGC)" prio=10 tid=0x00007fbed0025800 nid=0x53d6 runnable 

"GC task thread#4 (ParallelGC)" prio=10 tid=0x00007fbed0027800 nid=0x53d7 runnable 

"GC task thread#5 (ParallelGC)" prio=10 tid=0x00007fbed0029000 nid=0x53d8 runnable 

"GC task thread#6 (ParallelGC)" prio=10 tid=0x00007fbed002b000 nid=0x53d9 runnable 

"GC task thread#7 (ParallelGC)" prio=10 tid=0x00007fbed002d000 nid=0x53da runnable 

"GC task thread#8 (ParallelGC)" prio=10 tid=0x00007fbed002f000 nid=0x53db runnable 

"GC task thread#9 (ParallelGC)" prio=10 tid=0x00007fbed0030800 nid=0x53dc runnable 

"GC task thread#10 (ParallelGC)" prio=10 tid=0x00007fbed0032800 nid=0x53dd runnable 

"GC task thread#11 (ParallelGC)" prio=10 tid=0x00007fbed0034800 nid=0x53de runnable 

"GC task thread#12 (ParallelGC)" prio=10 tid=0x00007fbed0036000 nid=0x53df runnable 

"VM Periodic Task Thread" prio=10 tid=0x00007fbed02aa800 nid=0x53e7 waiting on condition 

JNI global references: 181

+ echo '************ END  zombies jstack extract'
************ END  zombies jstack extract
+ JIRA_COMMENT='

     {color:red}-1 core zombie tests{color}.  There are 1 zombie test(s): 	at org.apache.james.smtpserver.SMTPServerTest.testAddressBracketsEnforcementDisabled(SMTPServerTest.java:1361)'
+ BAD=1
+ jps
+ grep surefirebooter
+ cut -d ' ' -f 1
+ xargs kill -9
POST BUILD TASK : SUCCESS
END OF POST BUILD TASK : 0
Archiving artifacts
Sending artifact delta relative to HBase-1.0 #222
Archived 1810 artifacts
Archive block size is 32768
Received 69 blocks and 639363190 bytes
Compression is 0.4%
Took 4 min 3 sec
Recording test results
Updating HBASE-12068

Mime
View raw message