hbase-builds mailing list archives

Site index · List index
Message view « Date » · « Thread »
Top « Date » · « Thread »
From Apache Jenkins Server <jenk...@builds.apache.org>
Subject Build failed in Jenkins: HBase-0.98 #498
Date Fri, 05 Sep 2014 19:11:04 GMT
See <https://builds.apache.org/job/HBase-0.98/498/changes>

Changes:

[larsh] HBASE-11898 CoprocessorHost.Environment should cache class loader instance. (Vladimir
Rodionov)

------------------------------------------
[...truncated 1509 lines...]
Tests run: 21, Failures: 0, Errors: 0, Skipped: 0, Time elapsed: 23.258 sec
Running org.apache.hadoop.hbase.security.visibility.TestVisibilityLabelsWithCustomVisLabService
Tests run: 19, Failures: 0, Errors: 0, Skipped: 0, Time elapsed: 19.967 sec
Running org.apache.hadoop.hbase.catalog.TestCatalogTracker
Tests run: 7, Failures: 0, Errors: 0, Skipped: 0, Time elapsed: 2.145 sec
Running org.apache.hadoop.hbase.catalog.TestMetaReaderEditor
Tests run: 5, Failures: 0, Errors: 0, Skipped: 0, Time elapsed: 14.649 sec
Running org.apache.hadoop.hbase.catalog.TestMetaReaderEditorNoCluster
Tests run: 2, Failures: 0, Errors: 0, Skipped: 0, Time elapsed: 3.659 sec
Running org.apache.hadoop.hbase.catalog.TestMetaMigrationConvertingToPB
Tests run: 3, Failures: 0, Errors: 0, Skipped: 0, Time elapsed: 12.017 sec
Running org.apache.hadoop.hbase.rest.TestDeleteRow
Tests run: 2, Failures: 0, Errors: 0, Skipped: 0, Time elapsed: 12.531 sec
Running org.apache.hadoop.hbase.rest.TestResourceFilter
Tests run: 1, Failures: 0, Errors: 0, Skipped: 0, Time elapsed: 8.925 sec
Running org.apache.hadoop.hbase.rest.TestVersionResource
Tests run: 7, Failures: 0, Errors: 0, Skipped: 0, Time elapsed: 11.176 sec
Running org.apache.hadoop.hbase.rest.TestTableResource
Tests run: 8, Failures: 0, Errors: 0, Skipped: 0, Time elapsed: 22.534 sec
Running org.apache.hadoop.hbase.rest.TestStatusResource
Tests run: 2, Failures: 0, Errors: 0, Skipped: 0, Time elapsed: 9.745 sec
Running org.apache.hadoop.hbase.rest.TestScannersWithFilters
Tests run: 10, Failures: 0, Errors: 0, Skipped: 0, Time elapsed: 13.403 sec
Running org.apache.hadoop.hbase.rest.TestMultiRowResource
Tests run: 3, Failures: 0, Errors: 0, Skipped: 0, Time elapsed: 11.566 sec
Running org.apache.hadoop.hbase.rest.TestScannerResource
Tests run: 5, Failures: 0, Errors: 0, Skipped: 0, Time elapsed: 27.972 sec
Running org.apache.hadoop.hbase.rest.client.TestRemoteTable
Tests run: 9, Failures: 0, Errors: 0, Skipped: 0, Time elapsed: 16.875 sec
Running org.apache.hadoop.hbase.rest.TestScannersWithLabels
Tests run: 2, Failures: 0, Errors: 0, Skipped: 0, Time elapsed: 10.964 sec
Running org.apache.hadoop.hbase.rest.TestGzipFilter
Tests run: 2, Failures: 0, Errors: 0, Skipped: 0, Time elapsed: 11.143 sec
Running org.apache.hadoop.hbase.rest.TestTableScan
Tests run: 6, Failures: 0, Errors: 0, Skipped: 0, Time elapsed: 31.376 sec
Running org.apache.hadoop.hbase.rest.TestGetAndPutResource
Tests run: 18, Failures: 0, Errors: 0, Skipped: 0, Time elapsed: 22.7 sec
Running org.apache.hadoop.hbase.rest.TestSchemaResource
Tests run: 2, Failures: 0, Errors: 0, Skipped: 0, Time elapsed: 11.295 sec
Running org.apache.hadoop.hbase.backup.example.TestZooKeeperTableArchiveClient
Tests run: 3, Failures: 0, Errors: 0, Skipped: 0, Time elapsed: 4.873 sec
Running org.apache.hadoop.hbase.TestHColumnDescriptorDefaultVersions
Tests run: 3, Failures: 0, Errors: 0, Skipped: 0, Time elapsed: 19.721 sec
Running org.apache.hadoop.hbase.filter.TestFuzzyRowAndColumnRangeFilter
Tests run: 1, Failures: 0, Errors: 0, Skipped: 0, Time elapsed: 10.122 sec
Running org.apache.hadoop.hbase.filter.TestFilterWrapper
Tests run: 1, Failures: 0, Errors: 0, Skipped: 0, Time elapsed: 9.612 sec
Running org.apache.hadoop.hbase.backup.TestHFileArchiving
Tests run: 5, Failures: 0, Errors: 0, Skipped: 0, Time elapsed: 41.006 sec
Running org.apache.hadoop.hbase.filter.TestColumnRangeFilter
Tests run: 1, Failures: 0, Errors: 0, Skipped: 0, Time elapsed: 15.165 sec
Running org.apache.hadoop.hbase.filter.TestFilterWithScanLimits
Tests run: 1, Failures: 0, Errors: 0, Skipped: 0, Time elapsed: 10.01 sec
Running org.apache.hadoop.hbase.constraint.TestConstraint
Tests run: 5, Failures: 0, Errors: 0, Skipped: 0, Time elapsed: 13.203 sec
Running org.apache.hadoop.hbase.TestDrainingServer
Tests run: 2, Failures: 0, Errors: 0, Skipped: 0, Time elapsed: 2.264 sec
Running org.apache.hadoop.hbase.trace.TestHTraceHooks
Tests run: 1, Failures: 0, Errors: 0, Skipped: 0, Time elapsed: 9.415 sec
Running org.apache.hadoop.hbase.TestLocalHBaseCluster
Tests run: 1, Failures: 0, Errors: 0, Skipped: 0, Time elapsed: 8.111 sec
Running org.apache.hadoop.hbase.replication.TestReplicationKillSlaveRS
Tests run: 1, Failures: 0, Errors: 0, Skipped: 0, Time elapsed: 27.375 sec
Running org.apache.hadoop.hbase.replication.regionserver.TestReplicationSink
Tests run: 5, Failures: 0, Errors: 0, Skipped: 0, Time elapsed: 9.866 sec
Running org.apache.hadoop.hbase.replication.TestReplicationSyncUpTool
Tests run: 1, Failures: 0, Errors: 0, Skipped: 0, Time elapsed: 57.827 sec
Running org.apache.hadoop.hbase.replication.regionserver.TestReplicationSourceManager
Tests run: 4, Failures: 0, Errors: 0, Skipped: 0, Time elapsed: 5.836 sec
Running org.apache.hadoop.hbase.replication.TestPerTableCFReplication
Tests run: 2, Failures: 0, Errors: 0, Skipped: 0, Time elapsed: 37.27 sec
Running org.apache.hadoop.hbase.replication.TestReplicationChangingPeerRegionservers
Tests run: 1, Failures: 0, Errors: 0, Skipped: 0, Time elapsed: 17.996 sec
Running org.apache.hadoop.hbase.replication.TestReplicationKillMasterRS
Tests run: 1, Failures: 0, Errors: 0, Skipped: 0, Time elapsed: 27.841 sec
Running org.apache.hadoop.hbase.replication.TestReplicationKillMasterRSCompressed
Tests run: 1, Failures: 0, Errors: 0, Skipped: 0, Time elapsed: 30.291 sec
Running org.apache.hadoop.hbase.replication.TestReplicationStateZKImpl
Tests run: 6, Failures: 0, Errors: 0, Skipped: 0, Time elapsed: 2.166 sec
Running org.apache.hadoop.hbase.replication.TestMultiSlaveReplication
Tests run: 1, Failures: 0, Errors: 0, Skipped: 0, Time elapsed: 23.952 sec
Running org.apache.hadoop.hbase.replication.TestReplicationWithTags
Tests run: 1, Failures: 0, Errors: 0, Skipped: 0, Time elapsed: 17.333 sec
Running org.apache.hadoop.hbase.replication.TestReplicationSmallTests
Tests run: 9, Failures: 0, Errors: 0, Skipped: 0, Time elapsed: 50.071 sec
Running org.apache.hadoop.hbase.replication.TestReplicationSource
Tests run: 1, Failures: 0, Errors: 0, Skipped: 0, Time elapsed: 4.55 sec
Running org.apache.hadoop.hbase.replication.regionserver.TestReplicationHLogReaderManager
Tests run: 8, Failures: 0, Errors: 0, Skipped: 0, Time elapsed: 254.444 sec
Running org.apache.hadoop.hbase.replication.TestMasterReplication
Tests run: 3, Failures: 0, Errors: 0, Skipped: 0, Time elapsed: 51.726 sec
Running org.apache.hadoop.hbase.replication.TestReplicationDisableInactivePeer
Tests run: 1, Failures: 0, Errors: 0, Skipped: 0, Time elapsed: 32.374 sec
Running org.apache.hadoop.hbase.replication.TestReplicationTrackerZKImpl
Tests run: 4, Failures: 0, Errors: 0, Skipped: 2, Time elapsed: 1.559 sec
Running org.apache.hadoop.hbase.coprocessor.TestMasterCoprocessorExceptionWithRemove
Tests run: 1, Failures: 0, Errors: 0, Skipped: 0, Time elapsed: 11.833 sec
Running org.apache.hadoop.hbase.coprocessor.TestWALObserver
Tests run: 3, Failures: 0, Errors: 0, Skipped: 0, Time elapsed: 17.876 sec
Running org.apache.hadoop.hbase.coprocessor.TestBatchCoprocessorEndpoint
Tests run: 4, Failures: 0, Errors: 0, Skipped: 0, Time elapsed: 10.158 sec
Running org.apache.hadoop.hbase.coprocessor.TestRegionServerObserver
Tests run: 1, Failures: 0, Errors: 0, Skipped: 0, Time elapsed: 11.668 sec
Running org.apache.hadoop.hbase.coprocessor.TestRegionObserverInterface
Tests run: 12, Failures: 0, Errors: 0, Skipped: 0, Time elapsed: 37.72 sec
Running org.apache.hadoop.hbase.coprocessor.TestDoubleColumnInterpreter
Tests run: 38, Failures: 0, Errors: 0, Skipped: 0, Time elapsed: 11.104 sec
Running org.apache.hadoop.hbase.coprocessor.TestHTableWrapper
Tests run: 1, Failures: 0, Errors: 0, Skipped: 0, Time elapsed: 9.53 sec
Running org.apache.hadoop.hbase.coprocessor.TestAggregateProtocol
Tests run: 44, Failures: 0, Errors: 0, Skipped: 0, Time elapsed: 11.073 sec
Running org.apache.hadoop.hbase.coprocessor.TestRegionObserverScannerOpenHook
Tests run: 3, Failures: 0, Errors: 0, Skipped: 0, Time elapsed: 9.091 sec
Running org.apache.hadoop.hbase.coprocessor.TestCoprocessorStop
Tests run: 1, Failures: 0, Errors: 0, Skipped: 0, Time elapsed: 23.743 sec
Running org.apache.hadoop.hbase.coprocessor.TestMasterCoprocessorExceptionWithAbort
Tests run: 1, Failures: 0, Errors: 0, Skipped: 0, Time elapsed: 24.646 sec
Running org.apache.hadoop.hbase.coprocessor.TestMasterObserver
Tests run: 6, Failures: 0, Errors: 0, Skipped: 0, Time elapsed: 15.091 sec
Running org.apache.hadoop.hbase.coprocessor.TestOpenTableInCoprocessor
Tests run: 2, Failures: 0, Errors: 0, Skipped: 0, Time elapsed: 12.231 sec
Running org.apache.hadoop.hbase.coprocessor.TestCoprocessorEndpoint
Tests run: 6, Failures: 0, Errors: 0, Skipped: 0, Time elapsed: 10.42 sec
Running org.apache.hadoop.hbase.coprocessor.TestRegionServerCoprocessorExceptionWithAbort
Tests run: 2, Failures: 0, Errors: 0, Skipped: 0, Time elapsed: 15.176 sec
Running org.apache.hadoop.hbase.coprocessor.TestBigDecimalColumnInterpreter
Tests run: 38, Failures: 0, Errors: 0, Skipped: 0, Time elapsed: 11.247 sec
Running org.apache.hadoop.hbase.coprocessor.TestRegionObserverBypass
Tests run: 2, Failures: 0, Errors: 0, Skipped: 0, Time elapsed: 9.85 sec
Running org.apache.hadoop.hbase.coprocessor.TestClassLoading
Tests run: 8, Failures: 0, Errors: 0, Skipped: 0, Time elapsed: 21.086 sec
Running org.apache.hadoop.hbase.coprocessor.TestRowProcessorEndpoint
Tests run: 4, Failures: 0, Errors: 0, Skipped: 0, Time elapsed: 13.353 sec
Running org.apache.hadoop.hbase.coprocessor.TestRegionServerCoprocessorExceptionWithRemove
Tests run: 1, Failures: 0, Errors: 0, Skipped: 0, Time elapsed: 20.509 sec
Running org.apache.hadoop.hbase.TestJMXListener
Tests run: 2, Failures: 0, Errors: 0, Skipped: 0, Time elapsed: 23.817 sec
Running org.apache.hadoop.hbase.TestHBaseTestingUtility
Tests run: 7, Failures: 0, Errors: 0, Skipped: 0, Time elapsed: 32.673 sec

Results :

Tests in error: 
  testLogFilesAreArchived(org.apache.hadoop.hbase.master.TestSplitLogManager): test timed
out after 60000 milliseconds

Tests run: 2039, Failures: 0, Errors: 1, Skipped: 24

[INFO] ------------------------------------------------------------------------
[INFO] Reactor Summary:
[INFO] 
[INFO] HBase ............................................. SUCCESS [2.988s]
[INFO] HBase - Common .................................... SUCCESS [24.619s]
[INFO] HBase - Protocol .................................. SUCCESS [19.936s]
[INFO] HBase - Client .................................... SUCCESS [38.821s]
[INFO] HBase - Hadoop Compatibility ...................... SUCCESS [5.590s]
[INFO] HBase - Hadoop Two Compatibility .................. SUCCESS [1.736s]
[INFO] HBase - Prefix Tree ............................... SUCCESS [3.756s]
[INFO] HBase - Server .................................... FAILURE [1:34:55.570s]
[INFO] HBase - Testing Util .............................. SKIPPED
[INFO] HBase - Thrift .................................... SKIPPED
[INFO] HBase - Shell ..................................... SKIPPED
[INFO] HBase - Integration Tests ......................... SKIPPED
[INFO] HBase - Examples .................................. SKIPPED
[INFO] HBase - Assembly .................................. SKIPPED
[INFO] ------------------------------------------------------------------------
[INFO] BUILD FAILURE
[INFO] ------------------------------------------------------------------------
[INFO] Total time: 1:36:33.772s
[INFO] Finished at: Fri Sep 05 19:05:29 UTC 2014
[INFO] Final Memory: 34M/662M
[INFO] ------------------------------------------------------------------------
[ERROR] Failed to execute goal org.apache.maven.plugins:maven-surefire-plugin:2.12-TRUNK-HBASE-2:test
(secondPartTestsExecution) on project hbase-server: There are test failures.
[ERROR] 
[ERROR] Please refer to <https://builds.apache.org/job/HBase-0.98/ws/hbase-server/target/surefire-reports>
for the individual test results.
[ERROR] -> [Help 1]
[ERROR] 
[ERROR] To see the full stack trace of the errors, re-run Maven with the -e switch.
[ERROR] Re-run Maven using the -X switch to enable full debug logging.
[ERROR] 
[ERROR] For more information about the errors and possible solutions, please read the following
articles:
[ERROR] [Help 1] http://cwiki.apache.org/confluence/display/MAVEN/MojoFailureException
[ERROR] 
[ERROR] After correcting the problems, you can resume the build with the command
[ERROR]   mvn <goals> -rf :hbase-server
Build step 'Invoke top-level Maven targets' marked build as failure
Performing Post build task...
Match found for :.* : True
Logical operation result is TRUE
Running script  :   ZOMBIE_TESTS_COUNT=`jps | grep surefirebooter | wc -l`
  if [[ $ZOMBIE_TESTS_COUNT != 0 ]] ; then
    #It seems sometimes the tests are not dying immediately. Let's give them 10s
    echo "Suspicious java process found - waiting 10s to see if there are just slow to stop"
    sleep 10   
    ZOMBIE_TESTS_COUNT=`jps | grep surefirebooter | wc -l`
    if [[ $ZOMBIE_TESTS_COUNT != 0 ]] ; then
      echo "There are $ZOMBIE_TESTS_COUNT zombie tests, they should have been killed by surefire
but survived"
      echo "************ BEGIN zombies jstack extract"
      ZB_STACK=`jps | grep surefirebooter | cut -d ' ' -f 1 | xargs -n 1 jstack | grep ".test"
| grep "\.java"`
      jps | grep surefirebooter | cut -d ' ' -f 1 | xargs -n 1 jstack
      echo "************ END  zombies jstack extract"
      JIRA_COMMENT="$JIRA_COMMENT

     {color:red}-1 core zombie tests{color}.  There are ${ZOMBIE_TESTS_COUNT} zombie test(s):
${ZB_STACK}"
      BAD=1
      jps | grep surefirebooter | cut -d ' ' -f 1 | xargs kill -9
    else
      echo "We're ok: there is no zombie test, but some tests took some time to stop"
    fi
  else
    echo "We're ok: there is no zombie test"
  fi
[HBase-0.98] $ /bin/bash -xe /tmp/hudson4961417939270983710.sh
++ jps
++ grep surefirebooter
++ wc -l
+ ZOMBIE_TESTS_COUNT=1
+ [[ 1 != 0 ]]
+ echo 'Suspicious java process found - waiting 10s to see if there are just slow to stop'
Suspicious java process found - waiting 10s to see if there are just slow to stop
+ sleep 10
++ jps
++ grep surefirebooter
++ wc -l
+ ZOMBIE_TESTS_COUNT=1
+ [[ 1 != 0 ]]
+ echo 'There are 1 zombie tests, they should have been killed by surefire but survived'
There are 1 zombie tests, they should have been killed by surefire but survived
+ echo '************ BEGIN zombies jstack extract'
************ BEGIN zombies jstack extract
++ jps
++ grep surefirebooter
++ cut -d ' ' -f 1
++ xargs -n 1 jstack
++ grep '\.java'
++ grep .test
17729: Unable to open socket file: target process not responding or HotSpot VM not loaded
The -F option can be used when the target process is not responding
+ ZB_STACK=
POST BUILD TASK : FAILURE
END OF POST BUILD TASK : 0
Archiving artifacts
Sending artifact delta relative to HBase-0.98 #497
Archived 1685 artifacts
Archive block size is 32768
Received 64 blocks and 433258870 bytes
Compression is 0.5%
Took 2 min 51 sec
Recording test results
Updating HBASE-11898

Mime
View raw message