hbase-builds mailing list archives

Site index · List index
Message view « Date » · « Thread »
Top « Date » · « Thread »
From Apache Jenkins Server <jenk...@builds.apache.org>
Subject Build failed in Jenkins: HBase-1.0 #176
Date Thu, 11 Sep 2014 22:50:40 GMT
See <https://builds.apache.org/job/HBase-1.0/176/changes>

Changes:

[enis] HBASE-11936 IsolationLevel must be attribute of a Query not a Scan (Vladimir Rodionov)

------------------------------------------
[...truncated 1737 lines...]
Running org.apache.hadoop.hbase.master.TestDistributedLogSplitting
Tests run: 17, Failures: 0, Errors: 0, Skipped: 0, Time elapsed: 145.003 sec
Running org.apache.hadoop.hbase.master.TestAssignmentManagerOnCluster
Tests run: 19, Failures: 0, Errors: 0, Skipped: 0, Time elapsed: 69.721 sec
Running org.apache.hadoop.hbase.master.TestZKLessAMOnCluster
Tests run: 19, Failures: 0, Errors: 0, Skipped: 0, Time elapsed: 70.552 sec
Running org.apache.hadoop.hbase.master.balancer.TestStochasticLoadBalancer
Tests run: 23, Failures: 0, Errors: 0, Skipped: 0, Time elapsed: 560.968 sec
Running org.apache.hadoop.hbase.master.snapshot.TestSnapshotFileCache
Tests run: 4, Failures: 0, Errors: 0, Skipped: 0, Time elapsed: 21.545 sec
Running org.apache.hadoop.hbase.master.TestMasterFailover
Tests run: 6, Failures: 0, Errors: 0, Skipped: 0, Time elapsed: 53.194 sec
Running org.apache.hadoop.hbase.master.TestMasterMetrics
Tests run: 2, Failures: 0, Errors: 0, Skipped: 0, Time elapsed: 14.69 sec
Running org.apache.hadoop.hbase.master.TestMaster
Tests run: 4, Failures: 0, Errors: 0, Skipped: 0, Time elapsed: 14.922 sec
Running org.apache.hadoop.hbase.master.TestMasterFailoverBalancerPersistence
Tests run: 1, Failures: 0, Errors: 0, Skipped: 0, Time elapsed: 18.213 sec
Running org.apache.hadoop.hbase.master.TestMasterStatusServlet
Tests run: 4, Failures: 0, Errors: 0, Skipped: 0, Time elapsed: 2.365 sec
Running org.apache.hadoop.hbase.master.TestMasterShutdown
Tests run: 2, Failures: 0, Errors: 0, Skipped: 0, Time elapsed: 14.025 sec
Running org.apache.hadoop.hbase.master.TestMasterMetricsWrapper
Tests run: 1, Failures: 0, Errors: 0, Skipped: 0, Time elapsed: 12.753 sec
Running org.apache.hadoop.hbase.master.TestMasterOperationsForRegionReplicas
Tests run: 2, Failures: 0, Errors: 0, Skipped: 0, Time elapsed: 22.838 sec
Running org.apache.hadoop.hbase.master.TestHMasterRPCException
Tests run: 1, Failures: 0, Errors: 0, Skipped: 0, Time elapsed: 3.367 sec
Running org.apache.hadoop.hbase.master.TestActiveMasterManager
Tests run: 2, Failures: 0, Errors: 0, Skipped: 0, Time elapsed: 2.479 sec
Running org.apache.hadoop.hbase.master.TestTableLockManager
Tests run: 5, Failures: 0, Errors: 0, Skipped: 0, Time elapsed: 75.352 sec

Results :

Tests run: 2100, Failures: 0, Errors: 0, Skipped: 21

[INFO] 
[INFO] --- maven-jar-plugin:2.4:test-jar (default) @ hbase-server ---
[INFO] Building jar: <https://builds.apache.org/job/HBase-1.0/ws/hbase-server/target/hbase-server-0.99.0-tests.jar>
[INFO] 
[INFO] --- maven-source-plugin:2.2.1:jar-no-fork (attach-sources) @ hbase-server ---
[INFO] Building jar: <https://builds.apache.org/job/HBase-1.0/ws/hbase-server/target/hbase-server-0.99.0-sources.jar>
[INFO] 
[INFO] --- maven-jar-plugin:2.4:jar (default-jar) @ hbase-server ---
[INFO] Building jar: <https://builds.apache.org/job/HBase-1.0/ws/hbase-server/target/hbase-server-0.99.0.jar>
[INFO] 
[INFO] --- maven-install-plugin:2.3.1:install (default-install) @ hbase-server ---
[INFO] Installing <https://builds.apache.org/job/HBase-1.0/ws/hbase-server/target/hbase-server-0.99.0.jar>
to /home/jenkins/.m2/repository/org/apache/hbase/hbase-server/0.99.0/hbase-server-0.99.0.jar
[INFO] Installing <https://builds.apache.org/job/HBase-1.0/ws/hbase-server/pom.xml>
to /home/jenkins/.m2/repository/org/apache/hbase/hbase-server/0.99.0/hbase-server-0.99.0.pom
[INFO] Installing <https://builds.apache.org/job/HBase-1.0/ws/hbase-server/target/hbase-server-0.99.0-tests.jar>
to /home/jenkins/.m2/repository/org/apache/hbase/hbase-server/0.99.0/hbase-server-0.99.0-tests.jar
[INFO] Installing <https://builds.apache.org/job/HBase-1.0/ws/hbase-server/target/hbase-server-0.99.0-sources.jar>
to /home/jenkins/.m2/repository/org/apache/hbase/hbase-server/0.99.0/hbase-server-0.99.0-sources.jar
[INFO]                                                                         
[INFO] ------------------------------------------------------------------------
[INFO] Building HBase - Testing Util 0.99.0
[INFO] ------------------------------------------------------------------------
[INFO] 
[INFO] --- maven-remote-resources-plugin:1.4:process (default) @ hbase-testing-util ---
[INFO] 
[INFO] --- maven-resources-plugin:2.6:resources (default-resources) @ hbase-testing-util ---
[INFO] Using 'UTF-8' encoding to copy filtered resources.
[INFO] skip non existing resourceDirectory <https://builds.apache.org/job/HBase-1.0/ws/hbase-testing-util/src/main/resources>
[INFO] Copying 3 resources
[INFO] 
[INFO] --- maven-compiler-plugin:2.5.1:compile (default-compile) @ hbase-testing-util ---
[INFO] No sources to compile
[INFO] 
[INFO] --- maven-resources-plugin:2.6:testResources (default-testResources) @ hbase-testing-util
---
[INFO] Using 'UTF-8' encoding to copy filtered resources.
[INFO] skip non existing resourceDirectory <https://builds.apache.org/job/HBase-1.0/ws/hbase-testing-util/src/test/resources>
[INFO] Copying 3 resources
[INFO] 
[INFO] --- maven-compiler-plugin:2.5.1:testCompile (default-testCompile) @ hbase-testing-util
---
[INFO] No sources to compile
[INFO] 
[INFO] --- maven-surefire-plugin:2.12-TRUNK-HBASE-2:test (default-test) @ hbase-testing-util
---
[INFO] Surefire report directory: <https://builds.apache.org/job/HBase-1.0/ws/hbase-testing-util/target/surefire-reports>
[INFO] Using configured provider org.apache.maven.surefire.junitcore.JUnitCoreProvider

-------------------------------------------------------
 T E S T S
-------------------------------------------------------

Results :

Tests run: 0, Failures: 0, Errors: 0, Skipped: 0

[INFO] 
[INFO] --- maven-surefire-plugin:2.12-TRUNK-HBASE-2:test (secondPartTestsExecution) @ hbase-testing-util
---
[INFO] Surefire report directory: <https://builds.apache.org/job/HBase-1.0/ws/hbase-testing-util/target/surefire-reports>
[INFO] Using configured provider org.apache.maven.surefire.junitcore.JUnitCoreProvider

-------------------------------------------------------
 T E S T S
-------------------------------------------------------

-------------------------------------------------------
 T E S T S
-------------------------------------------------------

Results :

Tests run: 0, Failures: 0, Errors: 0, Skipped: 0

[INFO] 
[INFO] --- maven-jar-plugin:2.4:test-jar (default) @ hbase-testing-util ---
[INFO] Building jar: <https://builds.apache.org/job/HBase-1.0/ws/hbase-testing-util/target/hbase-testing-util-0.99.0-tests.jar>
[INFO] 
[INFO] --- maven-jar-plugin:2.4:jar (default-jar) @ hbase-testing-util ---
[INFO] Building jar: <https://builds.apache.org/job/HBase-1.0/ws/hbase-testing-util/target/hbase-testing-util-0.99.0.jar>
[INFO] 
[INFO] --- maven-install-plugin:2.3.1:install (default-install) @ hbase-testing-util ---
[INFO] Installing <https://builds.apache.org/job/HBase-1.0/ws/hbase-testing-util/target/hbase-testing-util-0.99.0.jar>
to /home/jenkins/.m2/repository/org/apache/hbase/hbase-testing-util/0.99.0/hbase-testing-util-0.99.0.jar
[INFO] Installing <https://builds.apache.org/job/HBase-1.0/ws/hbase-testing-util/pom.xml>
to /home/jenkins/.m2/repository/org/apache/hbase/hbase-testing-util/0.99.0/hbase-testing-util-0.99.0.pom
[INFO] Installing <https://builds.apache.org/job/HBase-1.0/ws/hbase-testing-util/target/hbase-testing-util-0.99.0-tests.jar>
to /home/jenkins/.m2/repository/org/apache/hbase/hbase-testing-util/0.99.0/hbase-testing-util-0.99.0-tests.jar
[INFO]                                                                         
[INFO] ------------------------------------------------------------------------
[INFO] Building HBase - Thrift 0.99.0
[INFO] ------------------------------------------------------------------------
[INFO] 
[INFO] --- maven-antrun-plugin:1.6:run (generate) @ hbase-thrift ---
[INFO] Executing tasks

main:
    [mkdir] Created dir: <https://builds.apache.org/job/HBase-1.0/ws/hbase-thrift/target/hbase-webapps>
     [copy] Copying 17 files to <https://builds.apache.org/job/HBase-1.0/ws/hbase-thrift/target/hbase-webapps>
log4j:WARN No appenders could be found for logger (org.mortbay.log).
log4j:WARN Please initialize the log4j system properly.
log4j:WARN See http://logging.apache.org/log4j/1.2/faq.html#noconfig for more info.
    [mkdir] Created dir: <https://builds.apache.org/job/HBase-1.0/ws/hbase-thrift/target/hbase-webapps/thrift/WEB-INF>
[INFO] Executed tasks
[INFO] 
[INFO] --- build-helper-maven-plugin:1.5:add-source (jspcSource-packageInfo-source) @ hbase-thrift
---
[INFO] Source directory: <https://builds.apache.org/job/HBase-1.0/ws/hbase-thrift/target/generated-sources/java>
added.
[INFO] 
[INFO] --- maven-remote-resources-plugin:1.4:process (default) @ hbase-thrift ---
[INFO] 
[INFO] --- maven-resources-plugin:2.6:resources (default-resources) @ hbase-thrift ---
[INFO] Using 'UTF-8' encoding to copy filtered resources.
[INFO] Copying 18 resources
[INFO] Copying 3 resources
[INFO] 
[INFO] --- maven-compiler-plugin:2.5.1:compile (default-compile) @ hbase-thrift ---
[INFO] Compiling 48 source files to <https://builds.apache.org/job/HBase-1.0/ws/hbase-thrift/target/classes>
[INFO] 
[INFO] --- maven-dependency-plugin:2.1:build-classpath (create-mrapp-generated-classpath)
@ hbase-thrift ---
[INFO] Wrote classpath file '<https://builds.apache.org/job/HBase-1.0/ws/hbase-thrift/target/test-classes/mrapp-generated-classpath'.>
[INFO] 
[INFO] --- maven-resources-plugin:2.6:testResources (default-testResources) @ hbase-thrift
---
[INFO] Using 'UTF-8' encoding to copy filtered resources.
[INFO] skip non existing resourceDirectory <https://builds.apache.org/job/HBase-1.0/ws/hbase-thrift/src/test/resources>
[INFO] Copying 3 resources
[INFO] 
[INFO] --- maven-compiler-plugin:2.5.1:testCompile (default-testCompile) @ hbase-thrift ---
[INFO] Compiling 5 source files to <https://builds.apache.org/job/HBase-1.0/ws/hbase-thrift/target/test-classes>
[INFO] 
[INFO] --- maven-surefire-plugin:2.12-TRUNK-HBASE-2:test (default-test) @ hbase-thrift ---
[INFO] Surefire report directory: <https://builds.apache.org/job/HBase-1.0/ws/hbase-thrift/target/surefire-reports>
[INFO] Using configured provider org.apache.maven.surefire.junitcore.JUnitCoreProvider

-------------------------------------------------------
 T E S T S
-------------------------------------------------------
Killed

Results :

Tests run: 0, Failures: 0, Errors: 0, Skipped: 0

[INFO] ------------------------------------------------------------------------
[INFO] Reactor Summary:
[INFO] 
[INFO] HBase ............................................. SUCCESS [2.521s]
[INFO] HBase - Common .................................... SUCCESS [35.576s]
[INFO] HBase - Protocol .................................. SUCCESS [9.265s]
[INFO] HBase - Client .................................... SUCCESS [54.985s]
[INFO] HBase - Hadoop Compatibility ...................... SUCCESS [5.326s]
[INFO] HBase - Hadoop Two Compatibility .................. SUCCESS [1.544s]
[INFO] HBase - Prefix Tree ............................... SUCCESS [3.410s]
[INFO] HBase - Server .................................... SUCCESS [2:00:35.287s]
[INFO] HBase - Testing Util .............................. SUCCESS [1.448s]
[INFO] HBase - Thrift .................................... FAILURE [19.762s]
[INFO] HBase - Shell ..................................... SKIPPED
[INFO] HBase - Integration Tests ......................... SKIPPED
[INFO] HBase - Examples .................................. SKIPPED
[INFO] HBase - Assembly .................................. SKIPPED
[INFO] ------------------------------------------------------------------------
[INFO] BUILD FAILURE
[INFO] ------------------------------------------------------------------------
[INFO] Total time: 2:02:49.903s
[INFO] Finished at: Thu Sep 11 22:43:23 UTC 2014
[INFO] Final Memory: 60M/1129M
[INFO] ------------------------------------------------------------------------
[ERROR] Failed to execute goal org.apache.maven.plugins:maven-surefire-plugin:2.12-TRUNK-HBASE-2:test
(default-test) on project hbase-thrift: Error occurred in starting fork, check output in log
-> [Help 1]
[ERROR] 
[ERROR] To see the full stack trace of the errors, re-run Maven with the -e switch.
[ERROR] Re-run Maven using the -X switch to enable full debug logging.
[ERROR] 
[ERROR] For more information about the errors and possible solutions, please read the following
articles:
[ERROR] [Help 1] http://cwiki.apache.org/confluence/display/MAVEN/MojoExecutionException
[ERROR] 
[ERROR] After correcting the problems, you can resume the build with the command
[ERROR]   mvn <goals> -rf :hbase-thrift
Build step 'Invoke top-level Maven targets' marked build as failure
Performing Post build task...
Match found for :.* : True
Logical operation result is TRUE
Running script  :   ZOMBIE_TESTS_COUNT=`jps | grep surefirebooter | wc -l`
  if [[ $ZOMBIE_TESTS_COUNT != 0 ]] ; then
    #It seems sometimes the tests are not dying immediately. Let's give them 10s
    echo "Suspicious java process found - waiting 10s to see if there are just slow to stop"
    sleep 10   
    ZOMBIE_TESTS_COUNT=`jps | grep surefirebooter | wc -l`
    if [[ $ZOMBIE_TESTS_COUNT != 0 ]] ; then
      echo "There are $ZOMBIE_TESTS_COUNT zombie tests, they should have been killed by surefire
but survived"
      echo "************ BEGIN zombies jstack extract"
      ZB_STACK=`jps | grep surefirebooter | cut -d ' ' -f 1 | xargs -n 1 jstack | grep ".test"
| grep "\.java"`
      jps | grep surefirebooter | cut -d ' ' -f 1 | xargs -n 1 jstack
      echo "************ END  zombies jstack extract"
      JIRA_COMMENT="$JIRA_COMMENT

     {color:red}-1 core zombie tests{color}.  There are ${ZOMBIE_TESTS_COUNT} zombie test(s):
${ZB_STACK}"
      BAD=1
      jps | grep surefirebooter | cut -d ' ' -f 1 | xargs kill -9
    else
      echo "We're ok: there is no zombie test, but some tests took some time to stop"
    fi
  else
    echo "We're ok: there is no zombie test"
  fi
[HBase-1.0] $ /bin/bash -xe /tmp/hudson1909264828649997381.sh
++ jps
++ grep surefirebooter
++ wc -l
+ ZOMBIE_TESTS_COUNT=0
+ [[ 0 != 0 ]]
+ echo 'We'\''re ok: there is no zombie test'
We're ok: there is no zombie test
POST BUILD TASK : SUCCESS
END OF POST BUILD TASK : 0
Archiving artifacts
Sending artifact delta relative to HBase-1.0 #174
Archived 1813 artifacts
Archive block size is 32768
Received 71 blocks and 651232074 bytes
Compression is 0.4%
Took 4 min 44 sec
Recording test results
Updating HBASE-11936

Mime
View raw message