hbase-builds mailing list archives

Site index · List index
Message view « Date » · « Thread »
Top « Date » · « Thread »
From Apache Jenkins Server <jenk...@builds.apache.org>
Subject Build failed in Jenkins: HBase-0.94-security #530
Date Sat, 27 Sep 2014 05:09:01 GMT
See <https://builds.apache.org/job/HBase-0.94-security/530/changes>

Changes:

[larsh] HBASE-12103 Backport HFileV1Detector to 0.94. (Jeffrey Zhong)

------------------------------------------
[...truncated 47207 lines...]
Forking command line: /bin/sh -c cd <https://builds.apache.org/job/HBase-0.94-security/ws/>
&& /home/jenkins/tools/java/jdk1.6.0_45-32/jre/bin/java -enableassertions -Xmx1900m
-Djava.security.egd=file:/dev/./urandom -jar <https://builds.apache.org/job/HBase-0.94-security/ws/target/surefire/surefirebooter6945074311001335832.jar>
<https://builds.apache.org/job/HBase-0.94-security/ws/target/surefire/surefire1629483774950005592tmp>
<https://builds.apache.org/job/HBase-0.94-security/ws/target/surefire/surefire_1024018409408665939773tmp>
Running org.apache.hadoop.hbase.io.encoding.TestLoadAndSwitchEncodeOnDisk
Tests run: 1, Failures: 0, Errors: 0, Skipped: 0, Time elapsed: 24.229 sec
Forking command line: /bin/sh -c cd <https://builds.apache.org/job/HBase-0.94-security/ws/>
&& /home/jenkins/tools/java/jdk1.6.0_45-32/jre/bin/java -enableassertions -Xmx1900m
-Djava.security.egd=file:/dev/./urandom -jar <https://builds.apache.org/job/HBase-0.94-security/ws/target/surefire/surefirebooter6835069498221941430.jar>
<https://builds.apache.org/job/HBase-0.94-security/ws/target/surefire/surefire6911502628421071494tmp>
<https://builds.apache.org/job/HBase-0.94-security/ws/target/surefire/surefire_1033292018681792877214tmp>
Running org.apache.hadoop.hbase.mapreduce.TestImportExport
Tests run: 4, Failures: 0, Errors: 0, Skipped: 0, Time elapsed: 102.643 sec
Forking command line: /bin/sh -c cd <https://builds.apache.org/job/HBase-0.94-security/ws/>
&& /home/jenkins/tools/java/jdk1.6.0_45-32/jre/bin/java -enableassertions -Xmx1900m
-Djava.security.egd=file:/dev/./urandom -jar <https://builds.apache.org/job/HBase-0.94-security/ws/target/surefire/surefirebooter8173445080465858157.jar>
<https://builds.apache.org/job/HBase-0.94-security/ws/target/surefire/surefire5126064609508053305tmp>
<https://builds.apache.org/job/HBase-0.94-security/ws/target/surefire/surefire_104642608798702407262tmp>
Running org.apache.hadoop.hbase.mapreduce.TestHLogRecordReader
Tests run: 2, Failures: 0, Errors: 0, Skipped: 0, Time elapsed: 5.189 sec
Forking command line: /bin/sh -c cd <https://builds.apache.org/job/HBase-0.94-security/ws/>
&& /home/jenkins/tools/java/jdk1.6.0_45-32/jre/bin/java -enableassertions -Xmx1900m
-Djava.security.egd=file:/dev/./urandom -jar <https://builds.apache.org/job/HBase-0.94-security/ws/target/surefire/surefirebooter6679037708951570717.jar>
<https://builds.apache.org/job/HBase-0.94-security/ws/target/surefire/surefire9004990039635049938tmp>
<https://builds.apache.org/job/HBase-0.94-security/ws/target/surefire/surefire_1056238790387135031262tmp>
Running org.apache.hadoop.hbase.catalog.TestCatalogTracker
Tests run: 10, Failures: 0, Errors: 0, Skipped: 1, Time elapsed: 8.559 sec
Forking command line: /bin/sh -c cd <https://builds.apache.org/job/HBase-0.94-security/ws/>
&& /home/jenkins/tools/java/jdk1.6.0_45-32/jre/bin/java -enableassertions -Xmx1900m
-Djava.security.egd=file:/dev/./urandom -jar <https://builds.apache.org/job/HBase-0.94-security/ws/target/surefire/surefirebooter6875553114794711225.jar>
<https://builds.apache.org/job/HBase-0.94-security/ws/target/surefire/surefire6910758606893364654tmp>
<https://builds.apache.org/job/HBase-0.94-security/ws/target/surefire/surefire_1068502375216040773947tmp>
Running org.apache.hadoop.hbase.catalog.TestMetaReaderEditor
Tests run: 5, Failures: 0, Errors: 0, Skipped: 0, Time elapsed: 22.201 sec
Forking command line: /bin/sh -c cd <https://builds.apache.org/job/HBase-0.94-security/ws/>
&& /home/jenkins/tools/java/jdk1.6.0_45-32/jre/bin/java -enableassertions -Xmx1900m
-Djava.security.egd=file:/dev/./urandom -jar <https://builds.apache.org/job/HBase-0.94-security/ws/target/surefire/surefirebooter9163559181885623760.jar>
<https://builds.apache.org/job/HBase-0.94-security/ws/target/surefire/surefire8697416922453649392tmp>
<https://builds.apache.org/job/HBase-0.94-security/ws/target/surefire/surefire_1072487226696099218796tmp>
Running org.apache.hadoop.hbase.catalog.TestMetaReaderEditorNoCluster
Tests run: 1, Failures: 1, Errors: 0, Skipped: 0, Time elapsed: 5.15 sec <<< FAILURE!
Forking command line: /bin/sh -c cd <https://builds.apache.org/job/HBase-0.94-security/ws/>
&& /home/jenkins/tools/java/jdk1.6.0_45-32/jre/bin/java -enableassertions -Xmx1900m
-Djava.security.egd=file:/dev/./urandom -jar <https://builds.apache.org/job/HBase-0.94-security/ws/target/surefire/surefirebooter4544302224006014444.jar>
<https://builds.apache.org/job/HBase-0.94-security/ws/target/surefire/surefire501715007055480810tmp>
<https://builds.apache.org/job/HBase-0.94-security/ws/target/surefire/surefire_1088301554663750832579tmp>
Running org.apache.hadoop.hbase.rest.client.TestRemoteTable
Tests run: 9, Failures: 0, Errors: 0, Skipped: 0, Time elapsed: 41.914 sec
Forking command line: /bin/sh -c cd <https://builds.apache.org/job/HBase-0.94-security/ws/>
&& /home/jenkins/tools/java/jdk1.6.0_45-32/jre/bin/java -enableassertions -Xmx1900m
-Djava.security.egd=file:/dev/./urandom -jar <https://builds.apache.org/job/HBase-0.94-security/ws/target/surefire/surefirebooter4603470986791243872.jar>
<https://builds.apache.org/job/HBase-0.94-security/ws/target/surefire/surefire3708940454409767962tmp>
<https://builds.apache.org/job/HBase-0.94-security/ws/target/surefire/surefire_1095884313043475505301tmp>
Running org.apache.hadoop.hbase.rest.client.TestRemoteAdmin
Tests run: 5, Failures: 0, Errors: 0, Skipped: 0, Time elapsed: 17.038 sec
Forking command line: /bin/sh -c cd <https://builds.apache.org/job/HBase-0.94-security/ws/>
&& /home/jenkins/tools/java/jdk1.6.0_45-32/jre/bin/java -enableassertions -Xmx1900m
-Djava.security.egd=file:/dev/./urandom -jar <https://builds.apache.org/job/HBase-0.94-security/ws/target/surefire/surefirebooter3791869749093921464.jar>
<https://builds.apache.org/job/HBase-0.94-security/ws/target/surefire/surefire750309460226585656tmp>
<https://builds.apache.org/job/HBase-0.94-security/ws/target/surefire/surefire_1106619651626330637608tmp>
Running org.apache.hadoop.hbase.mapreduce.TestImportTsv
Tests run: 13, Failures: 0, Errors: 0, Skipped: 0, Time elapsed: 219.782 sec
Forking command line: /bin/sh -c cd <https://builds.apache.org/job/HBase-0.94-security/ws/>
&& /home/jenkins/tools/java/jdk1.6.0_45-32/jre/bin/java -enableassertions -Xmx1900m
-Djava.security.egd=file:/dev/./urandom -jar <https://builds.apache.org/job/HBase-0.94-security/ws/target/surefire/surefirebooter6175420131888460260.jar>
<https://builds.apache.org/job/HBase-0.94-security/ws/target/surefire/surefire1944297728594360652tmp>
<https://builds.apache.org/job/HBase-0.94-security/ws/target/surefire/surefire_1111833827610124112909tmp>
Running org.apache.hadoop.hbase.rest.TestStatusResource
Tests run: 2, Failures: 0, Errors: 0, Skipped: 0, Time elapsed: 12.523 sec
Forking command line: /bin/sh -c cd <https://builds.apache.org/job/HBase-0.94-security/ws/>
&& /home/jenkins/tools/java/jdk1.6.0_45-32/jre/bin/java -enableassertions -Xmx1900m
-Djava.security.egd=file:/dev/./urandom -jar <https://builds.apache.org/job/HBase-0.94-security/ws/target/surefire/surefirebooter7625646998902107701.jar>
<https://builds.apache.org/job/HBase-0.94-security/ws/target/surefire/surefire3564113873554395402tmp>
<https://builds.apache.org/job/HBase-0.94-security/ws/target/surefire/surefire_1124007177117983084469tmp>
Running org.apache.hadoop.hbase.rest.TestRowResource
Tests run: 12, Failures: 0, Errors: 0, Skipped: 0, Time elapsed: 16.463 sec
Forking command line: /bin/sh -c cd <https://builds.apache.org/job/HBase-0.94-security/ws/>
&& /home/jenkins/tools/java/jdk1.6.0_45-32/jre/bin/java -enableassertions -Xmx1900m
-Djava.security.egd=file:/dev/./urandom -jar <https://builds.apache.org/job/HBase-0.94-security/ws/target/surefire/surefirebooter5339470085946870993.jar>
<https://builds.apache.org/job/HBase-0.94-security/ws/target/surefire/surefire8308495334532110898tmp>
<https://builds.apache.org/job/HBase-0.94-security/ws/target/surefire/surefire_1136031076518271578830tmp>
Running org.apache.hadoop.hbase.rest.TestVersionResource
Tests run: 7, Failures: 0, Errors: 0, Skipped: 0, Time elapsed: 12.615 sec
Forking command line: /bin/sh -c cd <https://builds.apache.org/job/HBase-0.94-security/ws/>
&& /home/jenkins/tools/java/jdk1.6.0_45-32/jre/bin/java -enableassertions -Xmx1900m
-Djava.security.egd=file:/dev/./urandom -jar <https://builds.apache.org/job/HBase-0.94-security/ws/target/surefire/surefirebooter3603384555985514455.jar>
<https://builds.apache.org/job/HBase-0.94-security/ws/target/surefire/surefire2615316403806087223tmp>
<https://builds.apache.org/job/HBase-0.94-security/ws/target/surefire/surefire_1145947194427262753236tmp>
Running org.apache.hadoop.hbase.rest.TestGZIPResponseWrapper
Tests run: 5, Failures: 0, Errors: 0, Skipped: 0, Time elapsed: 0.235 sec
Forking command line: /bin/sh -c cd <https://builds.apache.org/job/HBase-0.94-security/ws/>
&& /home/jenkins/tools/java/jdk1.6.0_45-32/jre/bin/java -enableassertions -Xmx1900m
-Djava.security.egd=file:/dev/./urandom -jar <https://builds.apache.org/job/HBase-0.94-security/ws/target/surefire/surefirebooter2182544530865880935.jar>
<https://builds.apache.org/job/HBase-0.94-security/ws/target/surefire/surefire2318502800011073461tmp>
<https://builds.apache.org/job/HBase-0.94-security/ws/target/surefire/surefire_1151684699852914478110tmp>
Running org.apache.hadoop.hbase.rest.TestTableResource
Tests run: 8, Failures: 0, Errors: 0, Skipped: 0, Time elapsed: 26.102 sec
Forking command line: /bin/sh -c cd <https://builds.apache.org/job/HBase-0.94-security/ws/>
&& /home/jenkins/tools/java/jdk1.6.0_45-32/jre/bin/java -enableassertions -Xmx1900m
-Djava.security.egd=file:/dev/./urandom -jar <https://builds.apache.org/job/HBase-0.94-security/ws/target/surefire/surefirebooter2710931763147507298.jar>
<https://builds.apache.org/job/HBase-0.94-security/ws/target/surefire/surefire4140521573199906042tmp>
<https://builds.apache.org/job/HBase-0.94-security/ws/target/surefire/surefire_1166977868007764915107tmp>
Running org.apache.hadoop.hbase.rest.TestGzipFilter
Tests run: 2, Failures: 0, Errors: 0, Skipped: 0, Time elapsed: 14.628 sec
Forking command line: /bin/sh -c cd <https://builds.apache.org/job/HBase-0.94-security/ws/>
&& /home/jenkins/tools/java/jdk1.6.0_45-32/jre/bin/java -enableassertions -Xmx1900m
-Djava.security.egd=file:/dev/./urandom -jar <https://builds.apache.org/job/HBase-0.94-security/ws/target/surefire/surefirebooter3812377353502113400.jar>
<https://builds.apache.org/job/HBase-0.94-security/ws/target/surefire/surefire1163994143714538016tmp>
<https://builds.apache.org/job/HBase-0.94-security/ws/target/surefire/surefire_1173424843748232422190tmp>
Running org.apache.hadoop.hbase.rest.TestScannersWithFilters
Tests run: 10, Failures: 0, Errors: 0, Skipped: 0, Time elapsed: 19.198 sec
Forking command line: /bin/sh -c cd <https://builds.apache.org/job/HBase-0.94-security/ws/>
&& /home/jenkins/tools/java/jdk1.6.0_45-32/jre/bin/java -enableassertions -Xmx1900m
-Djava.security.egd=file:/dev/./urandom -jar <https://builds.apache.org/job/HBase-0.94-security/ws/target/surefire/surefirebooter386269577642092400.jar>
<https://builds.apache.org/job/HBase-0.94-security/ws/target/surefire/surefire164574169218209491tmp>
<https://builds.apache.org/job/HBase-0.94-security/ws/target/surefire/surefire_1186489845492665752733tmp>
Running org.apache.hadoop.hbase.rest.TestScannerResource
Tests run: 5, Failures: 0, Errors: 0, Skipped: 0, Time elapsed: 38.441 sec
Forking command line: /bin/sh -c cd <https://builds.apache.org/job/HBase-0.94-security/ws/>
&& /home/jenkins/tools/java/jdk1.6.0_45-32/jre/bin/java -enableassertions -Xmx1900m
-Djava.security.egd=file:/dev/./urandom -jar <https://builds.apache.org/job/HBase-0.94-security/ws/target/surefire/surefirebooter8738838088293561774.jar>
<https://builds.apache.org/job/HBase-0.94-security/ws/target/surefire/surefire7015350705429756839tmp>
<https://builds.apache.org/job/HBase-0.94-security/ws/target/surefire/surefire_1194442735434815285035tmp>
Running org.apache.hadoop.hbase.rest.TestMultiRowResource
Tests run: 3, Failures: 0, Errors: 0, Skipped: 0, Time elapsed: 14.346 sec
Forking command line: /bin/sh -c cd <https://builds.apache.org/job/HBase-0.94-security/ws/>
&& /home/jenkins/tools/java/jdk1.6.0_45-32/jre/bin/java -enableassertions -Xmx1900m
-Djava.security.egd=file:/dev/./urandom -jar <https://builds.apache.org/job/HBase-0.94-security/ws/target/surefire/surefirebooter4143427585201068032.jar>
<https://builds.apache.org/job/HBase-0.94-security/ws/target/surefire/surefire9079214104690343085tmp>
<https://builds.apache.org/job/HBase-0.94-security/ws/target/surefire/surefire_120879449472593543074tmp>
Running org.apache.hadoop.hbase.monitoring.TestMemoryBoundedLogMessageBuffer
Tests run: 2, Failures: 0, Errors: 0, Skipped: 0, Time elapsed: 0.242 sec
Forking command line: /bin/sh -c cd <https://builds.apache.org/job/HBase-0.94-security/ws/>
&& /home/jenkins/tools/java/jdk1.6.0_45-32/jre/bin/java -enableassertions -Xmx1900m
-Djava.security.egd=file:/dev/./urandom -jar <https://builds.apache.org/job/HBase-0.94-security/ws/target/surefire/surefirebooter3583981538183765786.jar>
<https://builds.apache.org/job/HBase-0.94-security/ws/target/surefire/surefire7657482187682668770tmp>
<https://builds.apache.org/job/HBase-0.94-security/ws/target/surefire/surefire_1217900146366620665964tmp>
Running org.apache.hadoop.hbase.monitoring.TestTaskMonitor
Tests run: 3, Failures: 0, Errors: 0, Skipped: 0, Time elapsed: 0.375 sec
Forking command line: /bin/sh -c cd <https://builds.apache.org/job/HBase-0.94-security/ws/>
&& /home/jenkins/tools/java/jdk1.6.0_45-32/jre/bin/java -enableassertions -Xmx1900m
-Djava.security.egd=file:/dev/./urandom -jar <https://builds.apache.org/job/HBase-0.94-security/ws/target/surefire/surefirebooter66698629213766793.jar>
<https://builds.apache.org/job/HBase-0.94-security/ws/target/surefire/surefire683917851271036701tmp>
<https://builds.apache.org/job/HBase-0.94-security/ws/target/surefire/surefire_1225015320687206197751tmp>
Running org.apache.hadoop.hbase.rest.TestSchemaResource
Tests run: 2, Failures: 0, Errors: 0, Skipped: 0, Time elapsed: 19.051 sec
Forking command line: /bin/sh -c cd <https://builds.apache.org/job/HBase-0.94-security/ws/>
&& /home/jenkins/tools/java/jdk1.6.0_45-32/jre/bin/java -enableassertions -Xmx1900m
-Djava.security.egd=file:/dev/./urandom -jar <https://builds.apache.org/job/HBase-0.94-security/ws/target/surefire/surefirebooter4135078707981137303.jar>
<https://builds.apache.org/job/HBase-0.94-security/ws/target/surefire/surefire3945859263937509605tmp>
<https://builds.apache.org/job/HBase-0.94-security/ws/target/surefire/surefire_1236082828478115644347tmp>
Running org.apache.hadoop.hbase.snapshot.TestSnapshotDescriptionUtils
Tests run: 2, Failures: 0, Errors: 0, Skipped: 0, Time elapsed: 0.596 sec
Forking command line: /bin/sh -c cd <https://builds.apache.org/job/HBase-0.94-security/ws/>
&& /home/jenkins/tools/java/jdk1.6.0_45-32/jre/bin/java -enableassertions -Xmx1900m
-Djava.security.egd=file:/dev/./urandom -jar <https://builds.apache.org/job/HBase-0.94-security/ws/target/surefire/surefirebooter8617062555174828096.jar>
<https://builds.apache.org/job/HBase-0.94-security/ws/target/surefire/surefire4807628308449010878tmp>
<https://builds.apache.org/job/HBase-0.94-security/ws/target/surefire/surefire_124135827159787459388tmp>
Running org.apache.hadoop.hbase.snapshot.TestExportSnapshot
Tests run: 8, Failures: 0, Errors: 0, Skipped: 0, Time elapsed: 103.417 sec
Forking command line: /bin/sh -c cd <https://builds.apache.org/job/HBase-0.94-security/ws/>
&& /home/jenkins/tools/java/jdk1.6.0_45-32/jre/bin/java -enableassertions -Xmx1900m
-Djava.security.egd=file:/dev/./urandom -jar <https://builds.apache.org/job/HBase-0.94-security/ws/target/surefire/surefirebooter8336219518025982129.jar>
<https://builds.apache.org/job/HBase-0.94-security/ws/target/surefire/surefire5750760259199488545tmp>
<https://builds.apache.org/job/HBase-0.94-security/ws/target/surefire/surefire_1253112891600728563411tmp>
Running org.apache.hadoop.hbase.TestAcidGuarantees
Tests run: 3, Failures: 0, Errors: 0, Skipped: 0, Time elapsed: 95.335 sec
Forking command line: /bin/sh -c cd <https://builds.apache.org/job/HBase-0.94-security/ws/>
&& /home/jenkins/tools/java/jdk1.6.0_45-32/jre/bin/java -enableassertions -Xmx1900m
-Djava.security.egd=file:/dev/./urandom -jar <https://builds.apache.org/job/HBase-0.94-security/ws/target/surefire/surefirebooter1503899677477704473.jar>
<https://builds.apache.org/job/HBase-0.94-security/ws/target/surefire/surefire2478557275554294929tmp>
<https://builds.apache.org/job/HBase-0.94-security/ws/target/surefire/surefire_1261869830682528712426tmp>
Running org.apache.hadoop.hbase.TestLocalHBaseCluster
Tests run: 1, Failures: 0, Errors: 0, Skipped: 0, Time elapsed: 9.97 sec
Forking command line: /bin/sh -c cd <https://builds.apache.org/job/HBase-0.94-security/ws/>
&& /home/jenkins/tools/java/jdk1.6.0_45-32/jre/bin/java -enableassertions -Xmx1900m
-Djava.security.egd=file:/dev/./urandom -jar <https://builds.apache.org/job/HBase-0.94-security/ws/target/surefire/surefirebooter5716267483992855742.jar>
<https://builds.apache.org/job/HBase-0.94-security/ws/target/surefire/surefire6631828287387824206tmp>
<https://builds.apache.org/job/HBase-0.94-security/ws/target/surefire/surefire_1277083195941634208691tmp>
Running org.apache.hadoop.hbase.TestGlobalMemStoreSize
Tests run: 1, Failures: 0, Errors: 0, Skipped: 0, Time elapsed: 17.411 sec
Forking command line: /bin/sh -c cd <https://builds.apache.org/job/HBase-0.94-security/ws/>
&& /home/jenkins/tools/java/jdk1.6.0_45-32/jre/bin/java -enableassertions -Xmx1900m
-Djava.security.egd=file:/dev/./urandom -jar <https://builds.apache.org/job/HBase-0.94-security/ws/target/surefire/surefirebooter5881188894589236646.jar>
<https://builds.apache.org/job/HBase-0.94-security/ws/target/surefire/surefire2107841131731293081tmp>
<https://builds.apache.org/job/HBase-0.94-security/ws/target/surefire/surefire_1287503967358816237542tmp>
Running org.apache.hadoop.hbase.master.TestDefaultLoadBalancer
Tests run: 4, Failures: 0, Errors: 0, Skipped: 0, Time elapsed: 1.38 sec
Forking command line: /bin/sh -c cd <https://builds.apache.org/job/HBase-0.94-security/ws/>
&& /home/jenkins/tools/java/jdk1.6.0_45-32/jre/bin/java -enableassertions -Xmx1900m
-Djava.security.egd=file:/dev/./urandom -jar <https://builds.apache.org/job/HBase-0.94-security/ws/target/surefire/surefirebooter7770991144595641568.jar>
<https://builds.apache.org/job/HBase-0.94-security/ws/target/surefire/surefire1458273526272461509tmp>
<https://builds.apache.org/job/HBase-0.94-security/ws/target/surefire/surefire_1296486905063522509445tmp>
Running org.apache.hadoop.hbase.TestHBaseFileSystem
Tests run: 2, Failures: 0, Errors: 0, Skipped: 0, Time elapsed: 20.56 sec
Forking command line: /bin/sh -c cd <https://builds.apache.org/job/HBase-0.94-security/ws/>
&& /home/jenkins/tools/java/jdk1.6.0_45-32/jre/bin/java -enableassertions -Xmx1900m
-Djava.security.egd=file:/dev/./urandom -jar <https://builds.apache.org/job/HBase-0.94-security/ws/target/surefire/surefirebooter4177102818525775711.jar>
<https://builds.apache.org/job/HBase-0.94-security/ws/target/surefire/surefire3721341572964769477tmp>
<https://builds.apache.org/job/HBase-0.94-security/ws/target/surefire/surefire_1304554936953022070990tmp>
Running org.apache.hadoop.hbase.master.TestActiveMasterManager
Tests run: 2, Failures: 0, Errors: 0, Skipped: 0, Time elapsed: 1.008 sec
Forking command line: /bin/sh -c cd <https://builds.apache.org/job/HBase-0.94-security/ws/>
&& /home/jenkins/tools/java/jdk1.6.0_45-32/jre/bin/java -enableassertions -Xmx1900m
-Djava.security.egd=file:/dev/./urandom -jar <https://builds.apache.org/job/HBase-0.94-security/ws/target/surefire/surefirebooter3652106361553715348.jar>
<https://builds.apache.org/job/HBase-0.94-security/ws/target/surefire/surefire1004902927192088951tmp>
<https://builds.apache.org/job/HBase-0.94-security/ws/target/surefire/surefire_131381958732756189461tmp>
Running org.apache.hadoop.hbase.master.TestMXBean
Tests run: 1, Failures: 0, Errors: 0, Skipped: 0, Time elapsed: 15.724 sec
Forking command line: /bin/sh -c cd <https://builds.apache.org/job/HBase-0.94-security/ws/>
&& /home/jenkins/tools/java/jdk1.6.0_45-32/jre/bin/java -enableassertions -Xmx1900m
-Djava.security.egd=file:/dev/./urandom -jar <https://builds.apache.org/job/HBase-0.94-security/ws/target/surefire/surefirebooter3237808117738467997.jar>
<https://builds.apache.org/job/HBase-0.94-security/ws/target/surefire/surefire976311600502695850tmp>
<https://builds.apache.org/job/HBase-0.94-security/ws/target/surefire/surefire_1327093555444267400300tmp>
Running org.apache.hadoop.hbase.master.metrics.TestMasterStatistics
Tests run: 2, Failures: 0, Errors: 0, Skipped: 0, Time elapsed: 1.176 sec
Forking command line: /bin/sh -c cd <https://builds.apache.org/job/HBase-0.94-security/ws/>
&& /home/jenkins/tools/java/jdk1.6.0_45-32/jre/bin/java -enableassertions -Xmx1900m
-Djava.security.egd=file:/dev/./urandom -jar <https://builds.apache.org/job/HBase-0.94-security/ws/target/surefire/surefirebooter1566322408420974024.jar>
<https://builds.apache.org/job/HBase-0.94-security/ws/target/surefire/surefire4237148654022403747tmp>
<https://builds.apache.org/job/HBase-0.94-security/ws/target/surefire/surefire_1338295166352170963803tmp>
Running org.apache.hadoop.hbase.master.TestMasterFileSystem
Tests run: 1, Failures: 0, Errors: 0, Skipped: 0, Time elapsed: 10.921 sec
Forking command line: /bin/sh -c cd <https://builds.apache.org/job/HBase-0.94-security/ws/>
&& /home/jenkins/tools/java/jdk1.6.0_45-32/jre/bin/java -enableassertions -Xmx1900m
-Djava.security.egd=file:/dev/./urandom -jar <https://builds.apache.org/job/HBase-0.94-security/ws/target/surefire/surefirebooter8184952354547823702.jar>
<https://builds.apache.org/job/HBase-0.94-security/ws/target/surefire/surefire4132076316103648771tmp>
<https://builds.apache.org/job/HBase-0.94-security/ws/target/surefire/surefire_134531796159181965482tmp>
Running org.apache.hadoop.hbase.master.TestDeadServer
Tests run: 1, Failures: 0, Errors: 0, Skipped: 0, Time elapsed: 0.216 sec
Forking command line: /bin/sh -c cd <https://builds.apache.org/job/HBase-0.94-security/ws/>
&& /home/jenkins/tools/java/jdk1.6.0_45-32/jre/bin/java -enableassertions -Xmx1900m
-Djava.security.egd=file:/dev/./urandom -jar <https://builds.apache.org/job/HBase-0.94-security/ws/target/surefire/surefirebooter1027035470493104166.jar>
<https://builds.apache.org/job/HBase-0.94-security/ws/target/surefire/surefire7116945572237189676tmp>
<https://builds.apache.org/job/HBase-0.94-security/ws/target/surefire/surefire_135255755667038718172tmp>
Running org.apache.hadoop.hbase.master.TestZKBasedOpenCloseRegion
Tests run: 3, Failures: 0, Errors: 0, Skipped: 0, Time elapsed: 20.874 sec
Forking command line: /bin/sh -c cd <https://builds.apache.org/job/HBase-0.94-security/ws/>
&& /home/jenkins/tools/java/jdk1.6.0_45-32/jre/bin/java -enableassertions -Xmx1900m
-Djava.security.egd=file:/dev/./urandom -jar <https://builds.apache.org/job/HBase-0.94-security/ws/target/surefire/surefirebooter8386980924916844686.jar>
<https://builds.apache.org/job/HBase-0.94-security/ws/target/surefire/surefire6096536606078395189tmp>
<https://builds.apache.org/job/HBase-0.94-security/ws/target/surefire/surefire_1362991246274217750503tmp>
Running org.apache.hadoop.hbase.master.TestMasterZKSessionRecovery
Tests run: 2, Failures: 0, Errors: 0, Skipped: 0, Time elapsed: 30.949 sec
Forking command line: /bin/sh -c cd <https://builds.apache.org/job/HBase-0.94-security/ws/>
&& /home/jenkins/tools/java/jdk1.6.0_45-32/jre/bin/java -enableassertions -Xmx1900m
-Djava.security.egd=file:/dev/./urandom -jar <https://builds.apache.org/job/HBase-0.94-security/ws/target/surefire/surefirebooter6014264653884001094.jar>
<https://builds.apache.org/job/HBase-0.94-security/ws/target/surefire/surefire7062643363872771488tmp>
<https://builds.apache.org/job/HBase-0.94-security/ws/target/surefire/surefire_1371867796670010764934tmp>
Running org.apache.hadoop.hbase.master.TestMasterStatusServlet
Tests run: 5, Failures: 0, Errors: 0, Skipped: 0, Time elapsed: 1 sec
Forking command line: /bin/sh -c cd <https://builds.apache.org/job/HBase-0.94-security/ws/>
&& /home/jenkins/tools/java/jdk1.6.0_45-32/jre/bin/java -enableassertions -Xmx1900m
-Djava.security.egd=file:/dev/./urandom -jar <https://builds.apache.org/job/HBase-0.94-security/ws/target/surefire/surefirebooter4776472685807166432.jar>
<https://builds.apache.org/job/HBase-0.94-security/ws/target/surefire/surefire5251986263997627487tmp>
<https://builds.apache.org/job/HBase-0.94-security/ws/target/surefire/surefire_1381482866231581170976tmp>
Running org.apache.hadoop.hbase.master.TestSplitLogManager
Tests run: 12, Failures: 0, Errors: 0, Skipped: 0, Time elapsed: 80.856 sec
Forking command line: /bin/sh -c cd <https://builds.apache.org/job/HBase-0.94-security/ws/>
&& /home/jenkins/tools/java/jdk1.6.0_45-32/jre/bin/java -enableassertions -Xmx1900m
-Djava.security.egd=file:/dev/./urandom -jar <https://builds.apache.org/job/HBase-0.94-security/ws/target/surefire/surefirebooter8610724460043438068.jar>
<https://builds.apache.org/job/HBase-0.94-security/ws/target/surefire/surefire7624986247155098566tmp>
<https://builds.apache.org/job/HBase-0.94-security/ws/target/surefire/surefire_1393230308096085487599tmp>
Running org.apache.hadoop.hbase.master.TestMaster
Tests run: 2, Failures: 0, Errors: 0, Skipped: 0, Time elapsed: 15.734 sec
Forking command line: /bin/sh -c cd <https://builds.apache.org/job/HBase-0.94-security/ws/>
&& /home/jenkins/tools/java/jdk1.6.0_45-32/jre/bin/java -enableassertions -Xmx1900m
-Djava.security.egd=file:/dev/./urandom -jar <https://builds.apache.org/job/HBase-0.94-security/ws/target/surefire/surefirebooter8395512324093633936.jar>
<https://builds.apache.org/job/HBase-0.94-security/ws/target/surefire/surefire6941928054259901295tmp>
<https://builds.apache.org/job/HBase-0.94-security/ws/target/surefire/surefire_1408049707812178078426tmp>
Running org.apache.hadoop.hbase.master.TestClockSkewDetection
Tests run: 1, Failures: 0, Errors: 0, Skipped: 0, Time elapsed: 0.304 sec
Forking command line: /bin/sh -c cd <https://builds.apache.org/job/HBase-0.94-security/ws/>
&& /home/jenkins/tools/java/jdk1.6.0_45-32/jre/bin/java -enableassertions -Xmx1900m
-Djava.security.egd=file:/dev/./urandom -jar <https://builds.apache.org/job/HBase-0.94-security/ws/target/surefire/surefirebooter7238153597995134340.jar>
<https://builds.apache.org/job/HBase-0.94-security/ws/target/surefire/surefire1595030874502931825tmp>
<https://builds.apache.org/job/HBase-0.94-security/ws/target/surefire/surefire_1418339732196114255287tmp>
Running org.apache.hadoop.hbase.master.snapshot.TestSnapshotFileCache
Tests run: 6, Failures: 0, Errors: 0, Skipped: 0, Time elapsed: 3.612 sec
Forking command line: /bin/sh -c cd <https://builds.apache.org/job/HBase-0.94-security/ws/>
&& /home/jenkins/tools/java/jdk1.6.0_45-32/jre/bin/java -enableassertions -Xmx1900m
-Djava.security.egd=file:/dev/./urandom -jar <https://builds.apache.org/job/HBase-0.94-security/ws/target/surefire/surefirebooter5441249710064993510.jar>
<https://builds.apache.org/job/HBase-0.94-security/ws/target/surefire/surefire2114994538730597339tmp>
<https://builds.apache.org/job/HBase-0.94-security/ws/target/surefire/surefire_1422274710210875162383tmp>
Running org.apache.hadoop.hbase.master.handler.TestCreateTableHandler
Tests run: 3, Failures: 0, Errors: 0, Skipped: 0, Time elapsed: 33.965 sec
Forking command line: /bin/sh -c cd <https://builds.apache.org/job/HBase-0.94-security/ws/>
&& /home/jenkins/tools/java/jdk1.6.0_45-32/jre/bin/java -enableassertions -Xmx1900m
-Djava.security.egd=file:/dev/./urandom -jar <https://builds.apache.org/job/HBase-0.94-security/ws/target/surefire/surefirebooter3391801474048668200.jar>
<https://builds.apache.org/job/HBase-0.94-security/ws/target/surefire/surefire964379106837051717tmp>
<https://builds.apache.org/job/HBase-0.94-security/ws/target/surefire/surefire_1433496547140301527794tmp>
Running org.apache.hadoop.hbase.master.cleaner.TestLogsCleaner
Tests run: 1, Failures: 0, Errors: 0, Skipped: 0, Time elapsed: 3.048 sec
Forking command line: /bin/sh -c cd <https://builds.apache.org/job/HBase-0.94-security/ws/>
&& /home/jenkins/tools/java/jdk1.6.0_45-32/jre/bin/java -enableassertions -Xmx1900m
-Djava.security.egd=file:/dev/./urandom -jar <https://builds.apache.org/job/HBase-0.94-security/ws/target/surefire/surefirebooter9014062509247060960.jar>
<https://builds.apache.org/job/HBase-0.94-security/ws/target/surefire/surefire7413987484213751671tmp>
<https://builds.apache.org/job/HBase-0.94-security/ws/target/surefire/surefire_1446273918203667964560tmp>
Running org.apache.hadoop.hbase.master.cleaner.TestSnapshotFromMaster
Tests run: 4, Failures: 0, Errors: 0, Skipped: 0, Time elapsed: 30.839 sec
Forking command line: /bin/sh -c cd <https://builds.apache.org/job/HBase-0.94-security/ws/>
&& /home/jenkins/tools/java/jdk1.6.0_45-32/jre/bin/java -enableassertions -Xmx1900m
-Djava.security.egd=file:/dev/./urandom -jar <https://builds.apache.org/job/HBase-0.94-security/ws/target/surefire/surefirebooter7192684200089989330.jar>
<https://builds.apache.org/job/HBase-0.94-security/ws/target/surefire/surefire2059560866844720945tmp>
<https://builds.apache.org/job/HBase-0.94-security/ws/target/surefire/surefire_1456779953143461665000tmp>
Running org.apache.hadoop.hbase.master.cleaner.TestHFileCleaner
Tests run: 3, Failures: 0, Errors: 0, Skipped: 0, Time elapsed: 3.774 sec
Forking command line: /bin/sh -c cd <https://builds.apache.org/job/HBase-0.94-security/ws/>
&& /home/jenkins/tools/java/jdk1.6.0_45-32/jre/bin/java -enableassertions -Xmx1900m
-Djava.security.egd=file:/dev/./urandom -jar <https://builds.apache.org/job/HBase-0.94-security/ws/target/surefire/surefirebooter6007595672819536396.jar>
<https://builds.apache.org/job/HBase-0.94-security/ws/target/surefire/surefire6033898360991527876tmp>
<https://builds.apache.org/job/HBase-0.94-security/ws/target/surefire/surefire_1467276296700584431905tmp>
Running org.apache.hadoop.hbase.master.TestHMasterRPCException
Tests run: 1, Failures: 0, Errors: 0, Skipped: 0, Time elapsed: 1.457 sec
Forking command line: /bin/sh -c cd <https://builds.apache.org/job/HBase-0.94-security/ws/>
&& /home/jenkins/tools/java/jdk1.6.0_45-32/jre/bin/java -enableassertions -Xmx1900m
-Djava.security.egd=file:/dev/./urandom -jar <https://builds.apache.org/job/HBase-0.94-security/ws/target/surefire/surefirebooter865356651479031366.jar>
<https://builds.apache.org/job/HBase-0.94-security/ws/target/surefire/surefire2544857895315056779tmp>
<https://builds.apache.org/job/HBase-0.94-security/ws/target/surefire/surefire_1477129486993496000516tmp>
Running org.apache.hadoop.hbase.master.TestOpenedRegionHandler
Tests run: 2, Failures: 0, Errors: 0, Skipped: 0, Time elapsed: 13.705 sec
Forking command line: /bin/sh -c cd <https://builds.apache.org/job/HBase-0.94-security/ws/>
&& /home/jenkins/tools/java/jdk1.6.0_45-32/jre/bin/java -enableassertions -Xmx1900m
-Djava.security.egd=file:/dev/./urandom -jar <https://builds.apache.org/job/HBase-0.94-security/ws/target/surefire/surefirebooter2329117004983523533.jar>
<https://builds.apache.org/job/HBase-0.94-security/ws/target/surefire/surefire4140376564746573079tmp>
<https://builds.apache.org/job/HBase-0.94-security/ws/target/surefire/surefire_1481781316362582366567tmp>
Running org.apache.hadoop.hbase.util.TestRegionSplitter
Tests run: 5, Failures: 0, Errors: 0, Skipped: 0, Time elapsed: 15.084 sec
Forking command line: /bin/sh -c cd <https://builds.apache.org/job/HBase-0.94-security/ws/>
&& /home/jenkins/tools/java/jdk1.6.0_45-32/jre/bin/java -enableassertions -Xmx1900m
-Djava.security.egd=file:/dev/./urandom -jar <https://builds.apache.org/job/HBase-0.94-security/ws/target/surefire/surefirebooter5582904330880295507.jar>
<https://builds.apache.org/job/HBase-0.94-security/ws/target/surefire/surefire6721842852945869297tmp>
<https://builds.apache.org/job/HBase-0.94-security/ws/target/surefire/surefire_1493338127060577177465tmp>
Running org.apache.hadoop.hbase.util.TestEnvironmentEdgeManager
Tests run: 2, Failures: 0, Errors: 0, Skipped: 0, Time elapsed: 0.369 sec
Forking command line: /bin/sh -c cd <https://builds.apache.org/job/HBase-0.94-security/ws/>
&& /home/jenkins/tools/java/jdk1.6.0_45-32/jre/bin/java -enableassertions -Xmx1900m
-Djava.security.egd=file:/dev/./urandom -jar <https://builds.apache.org/job/HBase-0.94-security/ws/target/surefire/surefirebooter1165904753877689220.jar>
<https://builds.apache.org/job/HBase-0.94-security/ws/target/surefire/surefire8035862157289826029tmp>
<https://builds.apache.org/job/HBase-0.94-security/ws/target/surefire/surefire_1506729327818076599tmp>
Running org.apache.hadoop.hbase.util.TestFSHDFSUtils
Tests run: 3, Failures: 0, Errors: 0, Skipped: 0, Time elapsed: 3.753 sec
Forking command line: /bin/sh -c cd <https://builds.apache.org/job/HBase-0.94-security/ws/>
&& /home/jenkins/tools/java/jdk1.6.0_45-32/jre/bin/java -enableassertions -Xmx1900m
-Djava.security.egd=file:/dev/./urandom -jar <https://builds.apache.org/job/HBase-0.94-security/ws/target/surefire/surefirebooter2955194591400528182.jar>
<https://builds.apache.org/job/HBase-0.94-security/ws/target/surefire/surefire2509706476420185968tmp>
<https://builds.apache.org/job/HBase-0.94-security/ws/target/surefire/surefire_1517288604245985181967tmp>
Running org.apache.hadoop.hbase.util.TestFSVisitor
Tests run: 3, Failures: 0, Errors: 0, Skipped: 0, Time elapsed: 1.559 sec
Forking command line: /bin/sh -c cd <https://builds.apache.org/job/HBase-0.94-security/ws/>
&& /home/jenkins/tools/java/jdk1.6.0_45-32/jre/bin/java -enableassertions -Xmx1900m
-Djava.security.egd=file:/dev/./urandom -jar <https://builds.apache.org/job/HBase-0.94-security/ws/target/surefire/surefirebooter2307030558704510366.jar>
<https://builds.apache.org/job/HBase-0.94-security/ws/target/surefire/surefire4400084910536378408tmp>
<https://builds.apache.org/job/HBase-0.94-security/ws/target/surefire/surefire_152725931969798726367tmp>
Running org.apache.hadoop.hbase.util.hbck.TestOfflineMetaRebuildOverlap
Tests run: 1, Failures: 0, Errors: 0, Skipped: 0, Time elapsed: 26.353 sec
Forking command line: /bin/sh -c cd <https://builds.apache.org/job/HBase-0.94-security/ws/>
&& /home/jenkins/tools/java/jdk1.6.0_45-32/jre/bin/java -enableassertions -Xmx1900m
-Djava.security.egd=file:/dev/./urandom -jar <https://builds.apache.org/job/HBase-0.94-security/ws/target/surefire/surefirebooter3360077454432196004.jar>
<https://builds.apache.org/job/HBase-0.94-security/ws/target/surefire/surefire8364138409530662955tmp>
<https://builds.apache.org/job/HBase-0.94-security/ws/target/surefire/surefire_153872792128152073674tmp>
Running org.apache.hadoop.hbase.util.hbck.TestOfflineMetaRebuildHole
Tests run: 1, Failures: 0, Errors: 0, Skipped: 0, Time elapsed: 26.517 sec
Forking command line: /bin/sh -c cd <https://builds.apache.org/job/HBase-0.94-security/ws/>
&& /home/jenkins/tools/java/jdk1.6.0_45-32/jre/bin/java -enableassertions -Xmx1900m
-Djava.security.egd=file:/dev/./urandom -jar <https://builds.apache.org/job/HBase-0.94-security/ws/target/surefire/surefirebooter8925841170832554483.jar>
<https://builds.apache.org/job/HBase-0.94-security/ws/target/surefire/surefire737386527546781991tmp>
<https://builds.apache.org/job/HBase-0.94-security/ws/target/surefire/surefire_1543254722633079637532tmp>
Running org.apache.hadoop.hbase.util.hbck.TestOfflineMetaRebuildBase
Tests run: 1, Failures: 0, Errors: 0, Skipped: 0, Time elapsed: 26.436 sec
Forking command line: /bin/sh -c cd <https://builds.apache.org/job/HBase-0.94-security/ws/>
&& /home/jenkins/tools/java/jdk1.6.0_45-32/jre/bin/java -enableassertions -Xmx1900m
-Djava.security.egd=file:/dev/./urandom -jar <https://builds.apache.org/job/HBase-0.94-security/ws/target/surefire/surefirebooter94446807836601225.jar>
<https://builds.apache.org/job/HBase-0.94-security/ws/target/surefire/surefire2419786101952065903tmp>
<https://builds.apache.org/job/HBase-0.94-security/ws/target/surefire/surefire_155969061393420679947tmp>
Running org.apache.hadoop.hbase.util.TestFSTableDescriptors
Tests run: 11, Failures: 0, Errors: 0, Skipped: 0, Time elapsed: 0.907 sec
Forking command line: /bin/sh -c cd <https://builds.apache.org/job/HBase-0.94-security/ws/>
&& /home/jenkins/tools/java/jdk1.6.0_45-32/jre/bin/java -enableassertions -Xmx1900m
-Djava.security.egd=file:/dev/./urandom -jar <https://builds.apache.org/job/HBase-0.94-security/ws/target/surefire/surefirebooter3681136614764499701.jar>
<https://builds.apache.org/job/HBase-0.94-security/ws/target/surefire/surefire8968259385945474727tmp>
<https://builds.apache.org/job/HBase-0.94-security/ws/target/surefire/surefire_1563727191575913117270tmp>
Running org.apache.hadoop.hbase.util.TestDefaultEnvironmentEdge
Tests run: 1, Failures: 0, Errors: 0, Skipped: 0, Time elapsed: 0.209 sec
Forking command line: /bin/sh -c cd <https://builds.apache.org/job/HBase-0.94-security/ws/>
&& /home/jenkins/tools/java/jdk1.6.0_45-32/jre/bin/java -enableassertions -Xmx1900m
-Djava.security.egd=file:/dev/./urandom -jar <https://builds.apache.org/job/HBase-0.94-security/ws/target/surefire/surefirebooter470744505196936081.jar>
<https://builds.apache.org/job/HBase-0.94-security/ws/target/surefire/surefire1867382519364579094tmp>
<https://builds.apache.org/job/HBase-0.94-security/ws/target/surefire/surefire_1571883151602627389534tmp>
Running org.apache.hadoop.hbase.util.TestIdLock
Tests run: 1, Failures: 0, Errors: 0, Skipped: 0, Time elapsed: 15.384 sec
Forking command line: /bin/sh -c cd <https://builds.apache.org/job/HBase-0.94-security/ws/>
&& /home/jenkins/tools/java/jdk1.6.0_45-32/jre/bin/java -enableassertions -Xmx1900m
-Djava.security.egd=file:/dev/./urandom -jar <https://builds.apache.org/job/HBase-0.94-security/ws/target/surefire/surefirebooter5239465385824518178.jar>
<https://builds.apache.org/job/HBase-0.94-security/ws/target/surefire/surefire4488625426612100643tmp>
<https://builds.apache.org/job/HBase-0.94-security/ws/target/surefire/surefire_1582091592832756583389tmp>
Running org.apache.hadoop.hbase.util.TestCoprocessorScanPolicy
Tests run: 2, Failures: 0, Errors: 0, Skipped: 0, Time elapsed: 14.03 sec
Forking command line: /bin/sh -c cd <https://builds.apache.org/job/HBase-0.94-security/ws/>
&& /home/jenkins/tools/java/jdk1.6.0_45-32/jre/bin/java -enableassertions -Xmx1900m
-Djava.security.egd=file:/dev/./urandom -jar <https://builds.apache.org/job/HBase-0.94-security/ws/target/surefire/surefirebooter7726980095846251384.jar>
<https://builds.apache.org/job/HBase-0.94-security/ws/target/surefire/surefire62680675925355244tmp>
<https://builds.apache.org/job/HBase-0.94-security/ws/target/surefire/surefire_1597479145631640700085tmp>
Running org.apache.hadoop.hbase.util.TestFSUtils
Tests run: 4, Failures: 0, Errors: 0, Skipped: 0, Time elapsed: 19.476 sec
Forking command line: /bin/sh -c cd <https://builds.apache.org/job/HBase-0.94-security/ws/>
&& /home/jenkins/tools/java/jdk1.6.0_45-32/jre/bin/java -enableassertions -Xmx1900m
-Djava.security.egd=file:/dev/./urandom -jar <https://builds.apache.org/job/HBase-0.94-security/ws/target/surefire/surefirebooter3259772413313114273.jar>
<https://builds.apache.org/job/HBase-0.94-security/ws/target/surefire/surefire8497252711467870259tmp>
<https://builds.apache.org/job/HBase-0.94-security/ws/target/surefire/surefire_1606458040482865044410tmp>
Running org.apache.hadoop.hbase.util.TestPoolMap$TestRoundRobinPoolType
Tests run: 3, Failures: 0, Errors: 0, Skipped: 0, Time elapsed: 0.011 sec
Running org.apache.hadoop.hbase.util.TestPoolMap$TestThreadLocalPoolType
Tests run: 3, Failures: 0, Errors: 0, Skipped: 0, Time elapsed: 0.007 sec
Running org.apache.hadoop.hbase.util.TestPoolMap$TestReusablePoolType
Tests run: 3, Failures: 0, Errors: 0, Skipped: 0, Time elapsed: 0.038 sec
Forking command line: /bin/sh -c cd <https://builds.apache.org/job/HBase-0.94-security/ws/>
&& /home/jenkins/tools/java/jdk1.6.0_45-32/jre/bin/java -enableassertions -Xmx1900m
-Djava.security.egd=file:/dev/./urandom -jar <https://builds.apache.org/job/HBase-0.94-security/ws/target/surefire/surefirebooter6071824843848645530.jar>
<https://builds.apache.org/job/HBase-0.94-security/ws/target/surefire/surefire7582433441274960222tmp>
<https://builds.apache.org/job/HBase-0.94-security/ws/target/surefire/surefire_1616056113545102297553tmp>
Running org.apache.hadoop.hbase.util.TestMergeTable
Tests run: 1, Failures: 0, Errors: 0, Skipped: 0, Time elapsed: 23.507 sec
Forking command line: /bin/sh -c cd <https://builds.apache.org/job/HBase-0.94-security/ws/>
&& /home/jenkins/tools/java/jdk1.6.0_45-32/jre/bin/java -enableassertions -Xmx1900m
-Djava.security.egd=file:/dev/./urandom -jar <https://builds.apache.org/job/HBase-0.94-security/ws/target/surefire/surefirebooter8888922347479674129.jar>
<https://builds.apache.org/job/HBase-0.94-security/ws/target/surefire/surefire5270987902301330576tmp>
<https://builds.apache.org/job/HBase-0.94-security/ws/target/surefire/surefire_1627903742051493110871tmp>
Running org.apache.hadoop.hbase.util.TestSizeBasedThrottler
Tests run: 3, Failures: 0, Errors: 0, Skipped: 0, Time elapsed: 50.296 sec

Results :

Failed tests:   testRideOverServerNotRunning(org.apache.hadoop.hbase.catalog.TestMetaReaderEditorNoCluster)

Tests run: 915, Failures: 1, Errors: 0, Skipped: 2

[INFO] ------------------------------------------------------------------------
[INFO] BUILD FAILURE
[INFO] ------------------------------------------------------------------------
[INFO] Total time: 51:14.732s
[INFO] Finished at: Sat Sep 27 05:07:17 UTC 2014
[INFO] Final Memory: 70M/961M
[INFO] ------------------------------------------------------------------------
[ERROR] Failed to execute goal org.apache.maven.plugins:maven-surefire-plugin:2.12-TRUNK-HBASE-2:test
(secondPartTestsExecution) on project hbase: Failure or timeout -> [Help 1]
org.apache.maven.lifecycle.LifecycleExecutionException: Failed to execute goal org.apache.maven.plugins:maven-surefire-plugin:2.12-TRUNK-HBASE-2:test
(secondPartTestsExecution) on project hbase: Failure or timeout
	at org.apache.maven.lifecycle.internal.MojoExecutor.execute(MojoExecutor.java:217)
	at org.apache.maven.lifecycle.internal.MojoExecutor.execute(MojoExecutor.java:153)
	at org.apache.maven.lifecycle.internal.MojoExecutor.execute(MojoExecutor.java:145)
	at org.apache.maven.lifecycle.internal.MojoExecutor.executeForkedExecutions(MojoExecutor.java:365)
	at org.apache.maven.lifecycle.internal.MojoExecutor.execute(MojoExecutor.java:199)
	at org.apache.maven.lifecycle.internal.MojoExecutor.execute(MojoExecutor.java:153)
	at org.apache.maven.lifecycle.internal.MojoExecutor.execute(MojoExecutor.java:145)
	at org.apache.maven.lifecycle.internal.LifecycleModuleBuilder.buildProject(LifecycleModuleBuilder.java:84)
	at org.apache.maven.lifecycle.internal.LifecycleModuleBuilder.buildProject(LifecycleModuleBuilder.java:59)
	at org.apache.maven.lifecycle.internal.LifecycleStarter.singleThreadedBuild(LifecycleStarter.java:183)
	at org.apache.maven.lifecycle.internal.LifecycleStarter.execute(LifecycleStarter.java:161)
	at org.apache.maven.DefaultMaven.doExecute(DefaultMaven.java:320)
	at org.apache.maven.DefaultMaven.execute(DefaultMaven.java:156)
	at org.apache.maven.cli.MavenCli.execute(MavenCli.java:537)
	at org.apache.maven.cli.MavenCli.doMain(MavenCli.java:196)
	at org.apache.maven.cli.MavenCli.main(MavenCli.java:141)
	at sun.reflect.NativeMethodAccessorImpl.invoke0(Native Method)
	at sun.reflect.NativeMethodAccessorImpl.invoke(NativeMethodAccessorImpl.java:39)
	at sun.reflect.DelegatingMethodAccessorImpl.invoke(DelegatingMethodAccessorImpl.java:25)
	at java.lang.reflect.Method.invoke(Method.java:597)
	at org.codehaus.plexus.classworlds.launcher.Launcher.launchEnhanced(Launcher.java:290)
	at org.codehaus.plexus.classworlds.launcher.Launcher.launch(Launcher.java:230)
	at org.codehaus.plexus.classworlds.launcher.Launcher.mainWithExitCode(Launcher.java:409)
	at org.codehaus.plexus.classworlds.launcher.Launcher.main(Launcher.java:352)
Caused by: org.apache.maven.plugin.MojoExecutionException: Failure or timeout
	at org.apache.maven.plugin.surefire.SurefirePlugin.assertNoFailureOrTimeout(SurefirePlugin.java:643)
	at org.apache.maven.plugin.surefire.SurefirePlugin.handleSummary(SurefirePlugin.java:624)
	at org.apache.maven.plugin.surefire.AbstractSurefireMojo.executeAfterPreconditionsChecked(AbstractSurefireMojo.java:137)
	at org.apache.maven.plugin.surefire.AbstractSurefireMojo.execute(AbstractSurefireMojo.java:98)
	at org.apache.maven.plugin.DefaultBuildPluginManager.executeMojo(DefaultBuildPluginManager.java:101)
	at org.apache.maven.lifecycle.internal.MojoExecutor.execute(MojoExecutor.java:209)
	... 23 more
[ERROR] 
[ERROR] 
[ERROR] For more information about the errors and possible solutions, please read the following
articles:
[ERROR] [Help 1] http://cwiki.apache.org/confluence/display/MAVEN/MojoExecutionException
Build step 'Invoke top-level Maven targets' marked build as failure
Archiving artifacts
Sending artifact delta relative to HBase-0.94-security #523
Archived 958 artifacts
Archive block size is 32768
Received 41 blocks and 140378766 bytes
Compression is 0.9%
Took 52 sec
Updating HBASE-12103
Recording test results

Mime
View raw message