hbase-builds mailing list archives

Site index · List index
Message view « Date » · « Thread »
Top « Date » · « Thread »
From Apache Jenkins Server <jenk...@builds.apache.org>
Subject Build failed in Jenkins: HBase-TRUNK #5462
Date Wed, 03 Sep 2014 05:22:40 GMT
See <https://builds.apache.org/job/HBase-TRUNK/5462/changes>

Changes:

[apurtell] HBASE-11876 RegionScanner.nextRaw should not update metrics

------------------------------------------
[...truncated 1605 lines...]
Running org.apache.hadoop.hbase.mapreduce.TestHFileOutputFormat
Tests run: 23, Failures: 0, Errors: 0, Skipped: 0, Time elapsed: 597.027 sec - in org.apache.hadoop.hbase.master.balancer.TestStochasticLoadBalancer
Tests run: 5, Failures: 0, Errors: 0, Skipped: 0, Time elapsed: 109.412 sec - in org.apache.hadoop.hbase.mapreduce.TestRowCounter
Running org.apache.hadoop.hbase.mapreduce.TestCellCounter
Running org.apache.hadoop.hbase.mapreduce.TestCopyTable
Tests run: 2, Failures: 0, Errors: 0, Skipped: 0, Time elapsed: 66.495 sec - in org.apache.hadoop.hbase.mapreduce.TestCellCounter
Running org.apache.hadoop.hbase.mapreduce.TestTableMapReduce
Tests run: 7, Failures: 0, Errors: 0, Skipped: 0, Time elapsed: 256.84 sec - in org.apache.hadoop.hbase.mapreduce.TestTableSnapshotInputFormat
Tests run: 4, Failures: 0, Errors: 0, Skipped: 0, Time elapsed: 102.775 sec - in org.apache.hadoop.hbase.mapreduce.TestCopyTable
Running org.apache.hadoop.hbase.mapreduce.TestSecureLoadIncrementalHFilesSplitRecovery
Tests run: 13, Failures: 0, Errors: 0, Skipped: 1, Time elapsed: 264.334 sec - in org.apache.hadoop.hbase.mapreduce.TestHFileOutputFormat2
Tests run: 5, Failures: 0, Errors: 0, Skipped: 0, Time elapsed: 14.484 sec - in org.apache.hadoop.hbase.mapreduce.TestSecureLoadIncrementalHFilesSplitRecovery
Running org.apache.hadoop.hbase.mapreduce.TestImportExport
Running org.apache.hadoop.hbase.coprocessor.TestRowProcessorEndpoint
Tests run: 4, Failures: 0, Errors: 0, Skipped: 0, Time elapsed: 5.77 sec - in org.apache.hadoop.hbase.coprocessor.TestRowProcessorEndpoint
Running org.apache.hadoop.hbase.mapreduce.TestImportTSVWithVisibilityLabels
Running org.apache.hadoop.hbase.coprocessor.TestHTableWrapper
Tests run: 1, Failures: 0, Errors: 0, Skipped: 0, Time elapsed: 2.882 sec - in org.apache.hadoop.hbase.coprocessor.TestHTableWrapper
Running org.apache.hadoop.hbase.coprocessor.TestBigDecimalColumnInterpreter
Tests run: 13, Failures: 0, Errors: 0, Skipped: 1, Time elapsed: 263.231 sec - in org.apache.hadoop.hbase.mapreduce.TestHFileOutputFormat
Tests run: 38, Failures: 0, Errors: 0, Skipped: 0, Time elapsed: 4.226 sec - in org.apache.hadoop.hbase.coprocessor.TestBigDecimalColumnInterpreter
Running org.apache.hadoop.hbase.coprocessor.TestCoprocessorEndpoint
Tests run: 6, Failures: 0, Errors: 0, Skipped: 0, Time elapsed: 1.907 sec - in org.apache.hadoop.hbase.coprocessor.TestCoprocessorEndpoint
Running org.apache.hadoop.hbase.coprocessor.TestRegionServerCoprocessorExceptionWithRemove
Running org.apache.hadoop.hbase.coprocessor.TestAggregateProtocol
Tests run: 44, Failures: 0, Errors: 0, Skipped: 0, Time elapsed: 3.646 sec - in org.apache.hadoop.hbase.coprocessor.TestAggregateProtocol
Tests run: 1, Failures: 0, Errors: 0, Skipped: 0, Time elapsed: 13.125 sec - in org.apache.hadoop.hbase.coprocessor.TestRegionServerCoprocessorExceptionWithRemove
Running org.apache.hadoop.hbase.coprocessor.TestMasterObserver
Running org.apache.hadoop.hbase.coprocessor.TestRegionObserverInterface
Tests run: 6, Failures: 0, Errors: 0, Skipped: 0, Time elapsed: 6.649 sec - in org.apache.hadoop.hbase.coprocessor.TestMasterObserver
Running org.apache.hadoop.hbase.coprocessor.TestRegionServerCoprocessorExceptionWithAbort
Tests run: 2, Failures: 0, Errors: 0, Skipped: 0, Time elapsed: 147.332 sec - in org.apache.hadoop.hbase.mapreduce.TestTableMapReduce
Tests run: 2, Failures: 0, Errors: 0, Skipped: 0, Time elapsed: 13.325 sec - in org.apache.hadoop.hbase.coprocessor.TestRegionServerCoprocessorExceptionWithAbort
Running org.apache.hadoop.hbase.coprocessor.TestRegionObserverBypass
Tests run: 2, Failures: 0, Errors: 0, Skipped: 0, Time elapsed: 2.121 sec - in org.apache.hadoop.hbase.coprocessor.TestRegionObserverBypass
Running org.apache.hadoop.hbase.coprocessor.TestRegionObserverScannerOpenHook
Running org.apache.hadoop.hbase.coprocessor.TestMasterCoprocessorExceptionWithRemove
Tests run: 3, Failures: 0, Errors: 0, Skipped: 0, Time elapsed: 8.546 sec - in org.apache.hadoop.hbase.coprocessor.TestRegionObserverScannerOpenHook
Tests run: 1, Failures: 0, Errors: 0, Skipped: 0, Time elapsed: 4.317 sec - in org.apache.hadoop.hbase.coprocessor.TestMasterCoprocessorExceptionWithRemove
Tests run: 12, Failures: 0, Errors: 0, Skipped: 0, Time elapsed: 33.38 sec - in org.apache.hadoop.hbase.coprocessor.TestRegionObserverInterface
Running org.apache.hadoop.hbase.coprocessor.TestRegionServerObserver
Running org.apache.hadoop.hbase.coprocessor.TestWALObserver
Running org.apache.hadoop.hbase.coprocessor.TestDoubleColumnInterpreter
Tests run: 38, Failures: 0, Errors: 0, Skipped: 0, Time elapsed: 3.81 sec - in org.apache.hadoop.hbase.coprocessor.TestDoubleColumnInterpreter
Tests run: 1, Failures: 0, Errors: 0, Skipped: 0, Time elapsed: 12.593 sec - in org.apache.hadoop.hbase.coprocessor.TestRegionServerObserver
Tests run: 3, Failures: 0, Errors: 0, Skipped: 0, Time elapsed: 10.148 sec - in org.apache.hadoop.hbase.coprocessor.TestWALObserver
Running org.apache.hadoop.hbase.coprocessor.TestMasterCoprocessorExceptionWithAbort
Running org.apache.hadoop.hbase.coprocessor.TestBatchCoprocessorEndpoint
Tests run: 4, Failures: 0, Errors: 0, Skipped: 0, Time elapsed: 2.043 sec - in org.apache.hadoop.hbase.coprocessor.TestBatchCoprocessorEndpoint
Running org.apache.hadoop.hbase.coprocessor.TestOpenTableInCoprocessor
Tests run: 2, Failures: 0, Errors: 0, Skipped: 0, Time elapsed: 4.204 sec - in org.apache.hadoop.hbase.coprocessor.TestOpenTableInCoprocessor
Running org.apache.hadoop.hbase.coprocessor.TestCoprocessorStop
Tests run: 1, Failures: 0, Errors: 0, Skipped: 0, Time elapsed: 18.26 sec - in org.apache.hadoop.hbase.coprocessor.TestMasterCoprocessorExceptionWithAbort
Running org.apache.hadoop.hbase.coprocessor.TestClassLoading
Tests run: 1, Failures: 0, Errors: 0, Skipped: 0, Time elapsed: 16.329 sec - in org.apache.hadoop.hbase.coprocessor.TestCoprocessorStop
Running org.apache.hadoop.hbase.TestNamespace
Running org.apache.hadoop.hbase.TestLocalHBaseCluster
Tests run: 8, Failures: 0, Errors: 0, Skipped: 0, Time elapsed: 14.583 sec - in org.apache.hadoop.hbase.coprocessor.TestClassLoading
Tests run: 9, Failures: 0, Errors: 0, Skipped: 1, Time elapsed: 5.993 sec - in org.apache.hadoop.hbase.TestNamespace
Tests run: 1, Failures: 0, Errors: 0, Skipped: 0, Time elapsed: 7.639 sec - in org.apache.hadoop.hbase.TestLocalHBaseCluster
Running org.apache.hadoop.hbase.TestMultiVersions
Running org.apache.hadoop.hbase.TestMetaTableAccessor
Running org.apache.hadoop.hbase.trace.TestHTraceHooks
Tests run: 3, Failures: 0, Errors: 0, Skipped: 0, Time elapsed: 5.056 sec - in org.apache.hadoop.hbase.TestMultiVersions
Tests run: 8, Failures: 0, Errors: 0, Skipped: 0, Time elapsed: 4.436 sec - in org.apache.hadoop.hbase.TestMetaTableAccessor
Tests run: 1, Failures: 0, Errors: 0, Skipped: 0, Time elapsed: 1.706 sec - in org.apache.hadoop.hbase.trace.TestHTraceHooks
Tests run: 5, Failures: 0, Errors: 0, Skipped: 0, Time elapsed: 170.527 sec - in org.apache.hadoop.hbase.mapreduce.TestImportTSVWithVisibilityLabels
Running org.apache.hadoop.hbase.rest.client.TestRemoteTable
Running org.apache.hadoop.hbase.rest.TestMultiRowResource
Running org.apache.hadoop.hbase.rest.TestScannersWithFilters
Tests run: 3, Failures: 0, Errors: 0, Skipped: 0, Time elapsed: 2.907 sec - in org.apache.hadoop.hbase.rest.TestMultiRowResource
Tests run: 10, Failures: 0, Errors: 0, Skipped: 0, Time elapsed: 6.189 sec - in org.apache.hadoop.hbase.rest.TestScannersWithFilters
Running org.apache.hadoop.hbase.rest.TestDeleteRow
Tests run: 9, Failures: 0, Errors: 0, Skipped: 0, Time elapsed: 10.556 sec - in org.apache.hadoop.hbase.rest.client.TestRemoteTable
Running org.apache.hadoop.hbase.rest.TestVersionResource
Tests run: 2, Failures: 0, Errors: 0, Skipped: 0, Time elapsed: 4.424 sec - in org.apache.hadoop.hbase.rest.TestDeleteRow
Tests run: 7, Failures: 0, Errors: 0, Skipped: 0, Time elapsed: 2.615 sec - in org.apache.hadoop.hbase.rest.TestVersionResource
Running org.apache.hadoop.hbase.rest.TestStatusResource
Running org.apache.hadoop.hbase.rest.TestGetAndPutResource
Running org.apache.hadoop.hbase.rest.TestScannersWithLabels
Tests run: 2, Failures: 0, Errors: 0, Skipped: 0, Time elapsed: 2.395 sec - in org.apache.hadoop.hbase.rest.TestStatusResource
Tests run: 2, Failures: 0, Errors: 0, Skipped: 0, Time elapsed: 2.865 sec - in org.apache.hadoop.hbase.rest.TestScannersWithLabels
Running org.apache.hadoop.hbase.rest.TestGzipFilter
Tests run: 2, Failures: 0, Errors: 0, Skipped: 0, Time elapsed: 3.123 sec - in org.apache.hadoop.hbase.rest.TestGzipFilter
Running org.apache.hadoop.hbase.rest.TestScannerResource
Tests run: 18, Failures: 0, Errors: 0, Skipped: 0, Time elapsed: 16.333 sec - in org.apache.hadoop.hbase.rest.TestGetAndPutResource
Tests run: 5, Failures: 0, Errors: 0, Skipped: 0, Time elapsed: 5.126 sec - in org.apache.hadoop.hbase.rest.TestScannerResource
Running org.apache.hadoop.hbase.rest.TestSchemaResource
Running org.apache.hadoop.hbase.rest.TestTableScan
Tests run: 2, Failures: 0, Errors: 0, Skipped: 0, Time elapsed: 4.033 sec - in org.apache.hadoop.hbase.rest.TestSchemaResource
Running org.apache.hadoop.hbase.TestMetaTableLocator
Running org.apache.hadoop.hbase.rest.TestResourceFilter
Tests run: 1, Failures: 0, Errors: 0, Skipped: 0, Time elapsed: 1.403 sec - in org.apache.hadoop.hbase.rest.TestResourceFilter
Tests run: 7, Failures: 0, Errors: 0, Skipped: 0, Time elapsed: 3.851 sec - in org.apache.hadoop.hbase.TestMetaTableLocator
Tests run: 10, Failures: 0, Errors: 0, Skipped: 0, Time elapsed: 10.811 sec - in org.apache.hadoop.hbase.rest.TestTableScan
Running org.apache.hadoop.hbase.rest.TestTableResource
Running org.apache.hadoop.hbase.snapshot.TestRestoreFlushSnapshotFromClient
Running org.apache.hadoop.hbase.snapshot.TestFlushSnapshotFromClient
Tests run: 8, Failures: 0, Errors: 0, Skipped: 0, Time elapsed: 3.444 sec - in org.apache.hadoop.hbase.rest.TestTableResource
Running org.apache.hadoop.hbase.snapshot.TestExportSnapshot
Running org.apache.hadoop.hbase.snapshot.TestSecureExportSnapshot
Tests run: 9, Failures: 0, Errors: 0, Skipped: 0, Time elapsed: 35.629 sec - in org.apache.hadoop.hbase.snapshot.TestFlushSnapshotFromClient
Running org.apache.hadoop.hbase.snapshot.TestSnapshotDescriptionUtils
Tests run: 2, Failures: 0, Errors: 0, Skipped: 0, Time elapsed: 0.218 sec - in org.apache.hadoop.hbase.snapshot.TestSnapshotDescriptionUtils
Running org.apache.hadoop.hbase.util.TestMiniClusterLoadParallel
Tests run: 5, Failures: 0, Errors: 0, Skipped: 0, Time elapsed: 43.541 sec - in org.apache.hadoop.hbase.snapshot.TestRestoreFlushSnapshotFromClient
Running org.apache.hadoop.hbase.util.TestIdLock
Tests run: 1, Failures: 0, Errors: 0, Skipped: 0, Time elapsed: 15.486 sec - in org.apache.hadoop.hbase.util.TestIdLock
Running org.apache.hadoop.hbase.util.TestHBaseFsck
Tests run: 4, Failures: 0, Errors: 0, Skipped: 0, Time elapsed: 37.526 sec - in org.apache.hadoop.hbase.util.TestMiniClusterLoadParallel
Running org.apache.hadoop.hbase.util.TestMergeTable
Tests run: 11, Failures: 0, Errors: 0, Skipped: 0, Time elapsed: 332.285 sec - in org.apache.hadoop.hbase.mapreduce.TestImportExport
Running org.apache.hadoop.hbase.util.TestFSTableDescriptors
Tests run: 12, Failures: 0, Errors: 0, Skipped: 0, Time elapsed: 1.892 sec - in org.apache.hadoop.hbase.util.TestFSTableDescriptors
Running org.apache.hadoop.hbase.util.TestMiniClusterLoadSequential
Tests run: 1, Failures: 0, Errors: 0, Skipped: 0, Time elapsed: 20.939 sec - in org.apache.hadoop.hbase.util.TestMergeTable
Running org.apache.hadoop.hbase.util.TestDefaultEnvironmentEdge
Tests run: 1, Failures: 0, Errors: 0, Skipped: 0, Time elapsed: 0.413 sec - in org.apache.hadoop.hbase.util.TestDefaultEnvironmentEdge
Running org.apache.hadoop.hbase.util.TestFSVisitor
Tests run: 3, Failures: 0, Errors: 0, Skipped: 0, Time elapsed: 4.022 sec - in org.apache.hadoop.hbase.util.TestFSVisitor
Running org.apache.hadoop.hbase.util.TestHBaseFsckEncryption
Tests run: 1, Failures: 0, Errors: 0, Skipped: 0, Time elapsed: 10.618 sec - in org.apache.hadoop.hbase.util.TestHBaseFsckEncryption
Running org.apache.hadoop.hbase.util.TestFSHDFSUtils
Tests run: 4, Failures: 0, Errors: 0, Skipped: 0, Time elapsed: 38.273 sec - in org.apache.hadoop.hbase.util.TestMiniClusterLoadSequential
Running org.apache.hadoop.hbase.util.TestMiniClusterLoadEncoded
Tests run: 3, Failures: 0, Errors: 0, Skipped: 0, Time elapsed: 5.241 sec - in org.apache.hadoop.hbase.util.TestFSHDFSUtils
Running org.apache.hadoop.hbase.util.TestProcessBasedCluster
Tests run: 1, Failures: 0, Errors: 0, Skipped: 0, Time elapsed: 0.122 sec - in org.apache.hadoop.hbase.util.TestProcessBasedCluster
Running org.apache.hadoop.hbase.util.hbck.TestOfflineMetaRebuildOverlap
Tests run: 1, Failures: 0, Errors: 0, Skipped: 0, Time elapsed: 19.057 sec - in org.apache.hadoop.hbase.util.hbck.TestOfflineMetaRebuildOverlap
Running org.apache.hadoop.hbase.util.hbck.TestOfflineMetaRebuildBase
Tests run: 5, Failures: 0, Errors: 0, Skipped: 0, Time elapsed: 35.197 sec - in org.apache.hadoop.hbase.util.TestMiniClusterLoadEncoded
Running org.apache.hadoop.hbase.util.hbck.TestOfflineMetaRebuildHole
Tests run: 1, Failures: 0, Errors: 0, Skipped: 0, Time elapsed: 17.518 sec - in org.apache.hadoop.hbase.util.hbck.TestOfflineMetaRebuildBase
Running org.apache.hadoop.hbase.util.TestMergeTool
Tests run: 1, Failures: 0, Errors: 0, Skipped: 0, Time elapsed: 17.992 sec - in org.apache.hadoop.hbase.util.hbck.TestOfflineMetaRebuildHole
Running org.apache.hadoop.hbase.util.TestFSUtils
Tests run: 1, Failures: 0, Errors: 0, Skipped: 0, Time elapsed: 19.589 sec - in org.apache.hadoop.hbase.util.TestMergeTool
Tests run: 7, Failures: 0, Errors: 0, Skipped: 0, Time elapsed: 11.885 sec - in org.apache.hadoop.hbase.util.TestFSUtils
Running org.apache.hadoop.hbase.util.TestCoprocessorScanPolicy
Running org.apache.hadoop.hbase.util.TestRegionSplitter
Tests run: 4, Failures: 0, Errors: 0, Skipped: 0, Time elapsed: 4.655 sec - in org.apache.hadoop.hbase.util.TestCoprocessorScanPolicy
Tests run: 6, Failures: 0, Errors: 0, Skipped: 0, Time elapsed: 3.949 sec - in org.apache.hadoop.hbase.util.TestRegionSplitter
Running org.apache.hadoop.hbase.TestFullLogReconstruction
Running org.apache.hadoop.hbase.TestZooKeeper
Tests run: 1, Failures: 0, Errors: 0, Skipped: 0, Time elapsed: 36.738 sec - in org.apache.hadoop.hbase.TestFullLogReconstruction
Running org.apache.hadoop.hbase.filter.TestFilterWithScanLimits
Tests run: 1, Failures: 0, Errors: 0, Skipped: 0, Time elapsed: 1.362 sec - in org.apache.hadoop.hbase.filter.TestFilterWithScanLimits
Running org.apache.hadoop.hbase.filter.TestColumnRangeFilter
Tests run: 1, Failures: 0, Errors: 0, Skipped: 0, Time elapsed: 7.481 sec - in org.apache.hadoop.hbase.filter.TestColumnRangeFilter
Running org.apache.hadoop.hbase.filter.TestFilterWrapper
Tests run: 1, Failures: 0, Errors: 0, Skipped: 0, Time elapsed: 1.332 sec - in org.apache.hadoop.hbase.filter.TestFilterWrapper
Running org.apache.hadoop.hbase.filter.TestFuzzyRowAndColumnRangeFilter
Tests run: 1, Failures: 0, Errors: 0, Skipped: 0, Time elapsed: 2.502 sec - in org.apache.hadoop.hbase.filter.TestFuzzyRowAndColumnRangeFilter
Tests run: 9, Failures: 0, Errors: 0, Skipped: 0, Time elapsed: 287.63 sec - in org.apache.hadoop.hbase.snapshot.TestExportSnapshot
Tests run: 46, Failures: 0, Errors: 0, Skipped: 1, Time elapsed: 240.358 sec - in org.apache.hadoop.hbase.util.TestHBaseFsck
Tests run: 9, Failures: 0, Errors: 0, Skipped: 0, Time elapsed: 294.673 sec - in org.apache.hadoop.hbase.snapshot.TestSecureExportSnapshot
Tests run: 11, Failures: 0, Errors: 0, Skipped: 0, Time elapsed: 192.351 sec - in org.apache.hadoop.hbase.TestZooKeeper

Results :

Failed tests: 
  TestRegionRebalancing.testRebalanceOnRegionServerNumberChange:131->assertRegionsAreBalanced:221
After 5 attempts, region assignments were not balanced.

Tests run: 2044, Failures: 1, Errors: 0, Skipped: 19

[INFO] ------------------------------------------------------------------------
[INFO] Reactor Summary:
[INFO] 
[INFO] HBase ............................................. SUCCESS [5.120s]
[INFO] HBase - Common .................................... SUCCESS [58.996s]
[INFO] HBase - Protocol .................................. SUCCESS [8.917s]
[INFO] HBase - Client .................................... SUCCESS [1:04.340s]
[INFO] HBase - Hadoop Compatibility ...................... SUCCESS [7.147s]
[INFO] HBase - Hadoop Two Compatibility .................. SUCCESS [6.285s]
[INFO] HBase - Prefix Tree ............................... SUCCESS [8.459s]
[INFO] HBase - Server .................................... FAILURE [1:00:18.365s]
[INFO] HBase - Testing Util .............................. SKIPPED
[INFO] HBase - Thrift .................................... SKIPPED
[INFO] HBase - Shell ..................................... SKIPPED
[INFO] HBase - Integration Tests ......................... SKIPPED
[INFO] HBase - Examples .................................. SKIPPED
[INFO] HBase - Assembly .................................. SKIPPED
[INFO] ------------------------------------------------------------------------
[INFO] BUILD FAILURE
[INFO] ------------------------------------------------------------------------
[INFO] Total time: 1:02:58.381s
[INFO] Finished at: Wed Sep 03 05:17:34 UTC 2014
[INFO] Final Memory: 39M/346M
[INFO] ------------------------------------------------------------------------
[ERROR] Failed to execute goal org.apache.maven.plugins:maven-surefire-plugin:2.17:test (secondPartTestsExecution)
on project hbase-server: There are test failures.
[ERROR] 
[ERROR] Please refer to <https://builds.apache.org/job/HBase-TRUNK/ws/hbase-server/target/surefire-reports>
for the individual test results.
[ERROR] -> [Help 1]
[ERROR] 
[ERROR] To see the full stack trace of the errors, re-run Maven with the -e switch.
[ERROR] Re-run Maven using the -X switch to enable full debug logging.
[ERROR] 
[ERROR] For more information about the errors and possible solutions, please read the following
articles:
[ERROR] [Help 1] http://cwiki.apache.org/confluence/display/MAVEN/MojoFailureException
[ERROR] 
[ERROR] After correcting the problems, you can resume the build with the command
[ERROR]   mvn <goals> -rf :hbase-server
Build step 'Invoke top-level Maven targets' marked build as failure
Performing Post build task...
Match found for :.* : True
Logical operation result is TRUE
Running script  :   ZOMBIE_TESTS_COUNT=`jps | grep surefirebooter | wc -l`
  if [[ $ZOMBIE_TESTS_COUNT != 0 ]] ; then
    #It seems sometimes the tests are not dying immediately. Let's give them 10s
    echo "Suspicious java process found - waiting 10s to see if there are just slow to stop"
    sleep 10   
    ZOMBIE_TESTS_COUNT=`jps | grep surefirebooter | wc -l`
    if [[ $ZOMBIE_TESTS_COUNT != 0 ]] ; then
      echo "There are $ZOMBIE_TESTS_COUNT zombie tests, they should have been killed by surefire
but survived"
      echo "************ BEGIN zombies jstack extract"
      ZB_STACK=`jps | grep surefirebooter | cut -d ' ' -f 1 | xargs -n 1 jstack | grep ".test"
| grep "\.java"`
      jps | grep surefirebooter | cut -d ' ' -f 1 | xargs -n 1 jstack
      echo "************ END  zombies jstack extract"
      JIRA_COMMENT="$JIRA_COMMENT

     {color:red}-1 core zombie tests{color}.  There are ${ZOMBIE_TESTS_COUNT} zombie test(s):
${ZB_STACK}"
      BAD=1
      jps | grep surefirebooter | cut -d ' ' -f 1 | xargs kill -9
    else
      echo "We're ok: there is no zombie test, but some tests took some time to stop"
    fi
  else
    echo "We're ok: there is no zombie test"
  fi
[HBase-TRUNK] $ /bin/bash -xe /tmp/hudson2182750987283744407.sh
++ jps
++ grep surefirebooter
++ wc -l
+ ZOMBIE_TESTS_COUNT=0
+ [[ 0 != 0 ]]
+ echo 'We'\''re ok: there is no zombie test'
We're ok: there is no zombie test
POST BUILD TASK : SUCCESS
END OF POST BUILD TASK : 0
Archiving artifacts
Sending artifact delta relative to HBase-TRUNK #5454
Archived 1786 artifacts
Archive block size is 32768
Received 75 blocks and 557005081 bytes
Compression is 0.4%
Took 3 min 24 sec
Recording test results
Updating HBASE-11876

Mime
View raw message