hbase-builds mailing list archives

Site index · List index
Message view « Date » · « Thread »
Top « Date » · « Thread »
From Apache Jenkins Server <jenk...@builds.apache.org>
Subject Build failed in Jenkins: HBase-0.94-security #534
Date Sun, 28 Sep 2014 04:50:54 GMT
See <https://builds.apache.org/job/HBase-0.94-security/534/changes>

Changes:

[larsh] HBASE-11957 addendum 2; fix TestAssignmentManager

------------------------------------------
[...truncated 46998 lines...]
Running org.apache.hadoop.hbase.procedure.TestZKProcedure
Tests run: 4, Failures: 0, Errors: 0, Skipped: 0, Time elapsed: 1.64 sec
Forking command line: /bin/sh -c cd <https://builds.apache.org/job/HBase-0.94-security/ws/>
&& /home/jenkins/tools/java/jdk1.6.0_45-32/jre/bin/java -enableassertions -Xmx1900m
-Djava.security.egd=file:/dev/./urandom -jar <https://builds.apache.org/job/HBase-0.94-security/ws/target/surefire/surefirebooter9189525965964938705.jar>
<https://builds.apache.org/job/HBase-0.94-security/ws/target/surefire/surefire1164004161560683972tmp>
<https://builds.apache.org/job/HBase-0.94-security/ws/target/surefire/surefire_1025574255699638796420tmp>
Running org.apache.hadoop.hbase.io.encoding.TestLoadAndSwitchEncodeOnDisk
Tests run: 1, Failures: 0, Errors: 0, Skipped: 0, Time elapsed: 24.392 sec
Forking command line: /bin/sh -c cd <https://builds.apache.org/job/HBase-0.94-security/ws/>
&& /home/jenkins/tools/java/jdk1.6.0_45-32/jre/bin/java -enableassertions -Xmx1900m
-Djava.security.egd=file:/dev/./urandom -jar <https://builds.apache.org/job/HBase-0.94-security/ws/target/surefire/surefirebooter5552661809271496486.jar>
<https://builds.apache.org/job/HBase-0.94-security/ws/target/surefire/surefire4423274880261123381tmp>
<https://builds.apache.org/job/HBase-0.94-security/ws/target/surefire/surefire_1039122442389305281057tmp>
Running org.apache.hadoop.hbase.mapreduce.TestImportExport
Tests run: 4, Failures: 0, Errors: 0, Skipped: 0, Time elapsed: 102.386 sec
Forking command line: /bin/sh -c cd <https://builds.apache.org/job/HBase-0.94-security/ws/>
&& /home/jenkins/tools/java/jdk1.6.0_45-32/jre/bin/java -enableassertions -Xmx1900m
-Djava.security.egd=file:/dev/./urandom -jar <https://builds.apache.org/job/HBase-0.94-security/ws/target/surefire/surefirebooter5305499149981794294.jar>
<https://builds.apache.org/job/HBase-0.94-security/ws/target/surefire/surefire2245493634353825127tmp>
<https://builds.apache.org/job/HBase-0.94-security/ws/target/surefire/surefire_1046743160415933095854tmp>
Running org.apache.hadoop.hbase.mapreduce.TestHLogRecordReader
Tests run: 2, Failures: 0, Errors: 0, Skipped: 0, Time elapsed: 4.813 sec
Forking command line: /bin/sh -c cd <https://builds.apache.org/job/HBase-0.94-security/ws/>
&& /home/jenkins/tools/java/jdk1.6.0_45-32/jre/bin/java -enableassertions -Xmx1900m
-Djava.security.egd=file:/dev/./urandom -jar <https://builds.apache.org/job/HBase-0.94-security/ws/target/surefire/surefirebooter2458151164248712580.jar>
<https://builds.apache.org/job/HBase-0.94-security/ws/target/surefire/surefire1755819501111963899tmp>
<https://builds.apache.org/job/HBase-0.94-security/ws/target/surefire/surefire_1057233508900282328335tmp>
Running org.apache.hadoop.hbase.catalog.TestCatalogTracker
Tests run: 10, Failures: 0, Errors: 0, Skipped: 1, Time elapsed: 8.556 sec
Forking command line: /bin/sh -c cd <https://builds.apache.org/job/HBase-0.94-security/ws/>
&& /home/jenkins/tools/java/jdk1.6.0_45-32/jre/bin/java -enableassertions -Xmx1900m
-Djava.security.egd=file:/dev/./urandom -jar <https://builds.apache.org/job/HBase-0.94-security/ws/target/surefire/surefirebooter3326271066538387451.jar>
<https://builds.apache.org/job/HBase-0.94-security/ws/target/surefire/surefire3014064696965939262tmp>
<https://builds.apache.org/job/HBase-0.94-security/ws/target/surefire/surefire_1062356980421551442517tmp>
Running org.apache.hadoop.hbase.mapreduce.TestImportTsv
Tests run: 13, Failures: 0, Errors: 0, Skipped: 0, Time elapsed: 222.736 sec
Forking command line: /bin/sh -c cd <https://builds.apache.org/job/HBase-0.94-security/ws/>
&& /home/jenkins/tools/java/jdk1.6.0_45-32/jre/bin/java -enableassertions -Xmx1900m
-Djava.security.egd=file:/dev/./urandom -jar <https://builds.apache.org/job/HBase-0.94-security/ws/target/surefire/surefirebooter610273476231806237.jar>
<https://builds.apache.org/job/HBase-0.94-security/ws/target/surefire/surefire6782600903917064982tmp>
<https://builds.apache.org/job/HBase-0.94-security/ws/target/surefire/surefire_1072265648446831453151tmp>
Running org.apache.hadoop.hbase.catalog.TestMetaReaderEditorNoCluster
Tests run: 1, Failures: 0, Errors: 0, Skipped: 0, Time elapsed: 5.163 sec
Forking command line: /bin/sh -c cd <https://builds.apache.org/job/HBase-0.94-security/ws/>
&& /home/jenkins/tools/java/jdk1.6.0_45-32/jre/bin/java -enableassertions -Xmx1900m
-Djava.security.egd=file:/dev/./urandom -jar <https://builds.apache.org/job/HBase-0.94-security/ws/target/surefire/surefirebooter1163895879686165014.jar>
<https://builds.apache.org/job/HBase-0.94-security/ws/target/surefire/surefire3365224191636139020tmp>
<https://builds.apache.org/job/HBase-0.94-security/ws/target/surefire/surefire_1088958613089735146661tmp>
Running org.apache.hadoop.hbase.rest.client.TestRemoteTable
Tests run: 9, Failures: 0, Errors: 0, Skipped: 0, Time elapsed: 40.567 sec
Forking command line: /bin/sh -c cd <https://builds.apache.org/job/HBase-0.94-security/ws/>
&& /home/jenkins/tools/java/jdk1.6.0_45-32/jre/bin/java -enableassertions -Xmx1900m
-Djava.security.egd=file:/dev/./urandom -jar <https://builds.apache.org/job/HBase-0.94-security/ws/target/surefire/surefirebooter8455997000047061599.jar>
<https://builds.apache.org/job/HBase-0.94-security/ws/target/surefire/surefire1598371893655019763tmp>
<https://builds.apache.org/job/HBase-0.94-security/ws/target/surefire/surefire_1095184601335866619447tmp>
Running org.apache.hadoop.hbase.rest.client.TestRemoteAdmin
Tests run: 5, Failures: 0, Errors: 0, Skipped: 0, Time elapsed: 17.8 sec
Forking command line: /bin/sh -c cd <https://builds.apache.org/job/HBase-0.94-security/ws/>
&& /home/jenkins/tools/java/jdk1.6.0_45-32/jre/bin/java -enableassertions -Xmx1900m
-Djava.security.egd=file:/dev/./urandom -jar <https://builds.apache.org/job/HBase-0.94-security/ws/target/surefire/surefirebooter1734019735546818479.jar>
<https://builds.apache.org/job/HBase-0.94-security/ws/target/surefire/surefire6637485923308614388tmp>
<https://builds.apache.org/job/HBase-0.94-security/ws/target/surefire/surefire_1109056450489166462725tmp>
Running org.apache.hadoop.hbase.rest.TestStatusResource
Tests run: 2, Failures: 0, Errors: 0, Skipped: 0, Time elapsed: 12.066 sec
Forking command line: /bin/sh -c cd <https://builds.apache.org/job/HBase-0.94-security/ws/>
&& /home/jenkins/tools/java/jdk1.6.0_45-32/jre/bin/java -enableassertions -Xmx1900m
-Djava.security.egd=file:/dev/./urandom -jar <https://builds.apache.org/job/HBase-0.94-security/ws/target/surefire/surefirebooter2617427370696408504.jar>
<https://builds.apache.org/job/HBase-0.94-security/ws/target/surefire/surefire8790558345576687790tmp>
<https://builds.apache.org/job/HBase-0.94-security/ws/target/surefire/surefire_1117566674716773304090tmp>
Running org.apache.hadoop.hbase.rest.TestRowResource
Tests run: 12, Failures: 0, Errors: 0, Skipped: 0, Time elapsed: 17.234 sec
Forking command line: /bin/sh -c cd <https://builds.apache.org/job/HBase-0.94-security/ws/>
&& /home/jenkins/tools/java/jdk1.6.0_45-32/jre/bin/java -enableassertions -Xmx1900m
-Djava.security.egd=file:/dev/./urandom -jar <https://builds.apache.org/job/HBase-0.94-security/ws/target/surefire/surefirebooter6860508910777515616.jar>
<https://builds.apache.org/job/HBase-0.94-security/ws/target/surefire/surefire4566270740819335984tmp>
<https://builds.apache.org/job/HBase-0.94-security/ws/target/surefire/surefire_1123730455262408591789tmp>
Running org.apache.hadoop.hbase.rest.TestTableResource
Tests run: 8, Failures: 0, Errors: 0, Skipped: 0, Time elapsed: 28.073 sec
Forking command line: /bin/sh -c cd <https://builds.apache.org/job/HBase-0.94-security/ws/>
&& /home/jenkins/tools/java/jdk1.6.0_45-32/jre/bin/java -enableassertions -Xmx1900m
-Djava.security.egd=file:/dev/./urandom -jar <https://builds.apache.org/job/HBase-0.94-security/ws/target/surefire/surefirebooter5847104011830205099.jar>
<https://builds.apache.org/job/HBase-0.94-security/ws/target/surefire/surefire6836889080558051443tmp>
<https://builds.apache.org/job/HBase-0.94-security/ws/target/surefire/surefire_1137877355488014532751tmp>
Running org.apache.hadoop.hbase.rest.TestVersionResource
Tests run: 7, Failures: 0, Errors: 0, Skipped: 0, Time elapsed: 12.138 sec
Forking command line: /bin/sh -c cd <https://builds.apache.org/job/HBase-0.94-security/ws/>
&& /home/jenkins/tools/java/jdk1.6.0_45-32/jre/bin/java -enableassertions -Xmx1900m
-Djava.security.egd=file:/dev/./urandom -jar <https://builds.apache.org/job/HBase-0.94-security/ws/target/surefire/surefirebooter5764129406600879792.jar>
<https://builds.apache.org/job/HBase-0.94-security/ws/target/surefire/surefire6772835659239528127tmp>
<https://builds.apache.org/job/HBase-0.94-security/ws/target/surefire/surefire_1142752628223749277508tmp>
Running org.apache.hadoop.hbase.rest.TestGZIPResponseWrapper
Tests run: 5, Failures: 0, Errors: 0, Skipped: 0, Time elapsed: 0.238 sec
Forking command line: /bin/sh -c cd <https://builds.apache.org/job/HBase-0.94-security/ws/>
&& /home/jenkins/tools/java/jdk1.6.0_45-32/jre/bin/java -enableassertions -Xmx1900m
-Djava.security.egd=file:/dev/./urandom -jar <https://builds.apache.org/job/HBase-0.94-security/ws/target/surefire/surefirebooter303590590956263039.jar>
<https://builds.apache.org/job/HBase-0.94-security/ws/target/surefire/surefire1042026910792378322tmp>
<https://builds.apache.org/job/HBase-0.94-security/ws/target/surefire/surefire_1153923778654155272057tmp>
Running org.apache.hadoop.hbase.rest.TestGzipFilter
Tests run: 2, Failures: 0, Errors: 0, Skipped: 0, Time elapsed: 13.918 sec
Forking command line: /bin/sh -c cd <https://builds.apache.org/job/HBase-0.94-security/ws/>
&& /home/jenkins/tools/java/jdk1.6.0_45-32/jre/bin/java -enableassertions -Xmx1900m
-Djava.security.egd=file:/dev/./urandom -jar <https://builds.apache.org/job/HBase-0.94-security/ws/target/surefire/surefirebooter6740574230024952969.jar>
<https://builds.apache.org/job/HBase-0.94-security/ws/target/surefire/surefire5315100162209286972tmp>
<https://builds.apache.org/job/HBase-0.94-security/ws/target/surefire/surefire_1166669163896896878629tmp>
Running org.apache.hadoop.hbase.rest.TestScannerResource
Tests run: 5, Failures: 0, Errors: 0, Skipped: 0, Time elapsed: 40.003 sec
Forking command line: /bin/sh -c cd <https://builds.apache.org/job/HBase-0.94-security/ws/>
&& /home/jenkins/tools/java/jdk1.6.0_45-32/jre/bin/java -enableassertions -Xmx1900m
-Djava.security.egd=file:/dev/./urandom -jar <https://builds.apache.org/job/HBase-0.94-security/ws/target/surefire/surefirebooter7037687939448038071.jar>
<https://builds.apache.org/job/HBase-0.94-security/ws/target/surefire/surefire8337054538665851513tmp>
<https://builds.apache.org/job/HBase-0.94-security/ws/target/surefire/surefire_1176563207139796576492tmp>
Running org.apache.hadoop.hbase.rest.TestScannersWithFilters
Tests run: 10, Failures: 0, Errors: 0, Skipped: 0, Time elapsed: 18.926 sec
Forking command line: /bin/sh -c cd <https://builds.apache.org/job/HBase-0.94-security/ws/>
&& /home/jenkins/tools/java/jdk1.6.0_45-32/jre/bin/java -enableassertions -Xmx1900m
-Djava.security.egd=file:/dev/./urandom -jar <https://builds.apache.org/job/HBase-0.94-security/ws/target/surefire/surefirebooter7464214268476563586.jar>
<https://builds.apache.org/job/HBase-0.94-security/ws/target/surefire/surefire1211974830842529962tmp>
<https://builds.apache.org/job/HBase-0.94-security/ws/target/surefire/surefire_1184625749795935093399tmp>
Running org.apache.hadoop.hbase.rest.TestMultiRowResource
Tests run: 3, Failures: 0, Errors: 0, Skipped: 0, Time elapsed: 13.587 sec
Forking command line: /bin/sh -c cd <https://builds.apache.org/job/HBase-0.94-security/ws/>
&& /home/jenkins/tools/java/jdk1.6.0_45-32/jre/bin/java -enableassertions -Xmx1900m
-Djava.security.egd=file:/dev/./urandom -jar <https://builds.apache.org/job/HBase-0.94-security/ws/target/surefire/surefirebooter6905764255844044912.jar>
<https://builds.apache.org/job/HBase-0.94-security/ws/target/surefire/surefire4018737590381586612tmp>
<https://builds.apache.org/job/HBase-0.94-security/ws/target/surefire/surefire_1192460628156477099926tmp>
Running org.apache.hadoop.hbase.rest.TestSchemaResource
Tests run: 2, Failures: 0, Errors: 0, Skipped: 0, Time elapsed: 19.36 sec
Forking command line: /bin/sh -c cd <https://builds.apache.org/job/HBase-0.94-security/ws/>
&& /home/jenkins/tools/java/jdk1.6.0_45-32/jre/bin/java -enableassertions -Xmx1900m
-Djava.security.egd=file:/dev/./urandom -jar <https://builds.apache.org/job/HBase-0.94-security/ws/target/surefire/surefirebooter2842978920958617337.jar>
<https://builds.apache.org/job/HBase-0.94-security/ws/target/surefire/surefire5574812669006702159tmp>
<https://builds.apache.org/job/HBase-0.94-security/ws/target/surefire/surefire_1201250926631417853130tmp>
Running org.apache.hadoop.hbase.monitoring.TestMemoryBoundedLogMessageBuffer
Tests run: 2, Failures: 0, Errors: 0, Skipped: 0, Time elapsed: 0.241 sec
Forking command line: /bin/sh -c cd <https://builds.apache.org/job/HBase-0.94-security/ws/>
&& /home/jenkins/tools/java/jdk1.6.0_45-32/jre/bin/java -enableassertions -Xmx1900m
-Djava.security.egd=file:/dev/./urandom -jar <https://builds.apache.org/job/HBase-0.94-security/ws/target/surefire/surefirebooter6816073241328079173.jar>
<https://builds.apache.org/job/HBase-0.94-security/ws/target/surefire/surefire5650048669780108546tmp>
<https://builds.apache.org/job/HBase-0.94-security/ws/target/surefire/surefire_1215674753488753978678tmp>
Running org.apache.hadoop.hbase.monitoring.TestTaskMonitor
Tests run: 3, Failures: 0, Errors: 0, Skipped: 0, Time elapsed: 0.323 sec
Forking command line: /bin/sh -c cd <https://builds.apache.org/job/HBase-0.94-security/ws/>
&& /home/jenkins/tools/java/jdk1.6.0_45-32/jre/bin/java -enableassertions -Xmx1900m
-Djava.security.egd=file:/dev/./urandom -jar <https://builds.apache.org/job/HBase-0.94-security/ws/target/surefire/surefirebooter8135467634952982101.jar>
<https://builds.apache.org/job/HBase-0.94-security/ws/target/surefire/surefire1010924922499334394tmp>
<https://builds.apache.org/job/HBase-0.94-security/ws/target/surefire/surefire_1227521579102759575673tmp>
Running org.apache.hadoop.hbase.snapshot.TestExportSnapshot
Tests run: 8, Failures: 0, Errors: 0, Skipped: 0, Time elapsed: 99.895 sec
Forking command line: /bin/sh -c cd <https://builds.apache.org/job/HBase-0.94-security/ws/>
&& /home/jenkins/tools/java/jdk1.6.0_45-32/jre/bin/java -enableassertions -Xmx1900m
-Djava.security.egd=file:/dev/./urandom -jar <https://builds.apache.org/job/HBase-0.94-security/ws/target/surefire/surefirebooter6699456340038407590.jar>
<https://builds.apache.org/job/HBase-0.94-security/ws/target/surefire/surefire8402695052369913972tmp>
<https://builds.apache.org/job/HBase-0.94-security/ws/target/surefire/surefire_1238604511385948464053tmp>
Running org.apache.hadoop.hbase.snapshot.TestSnapshotDescriptionUtils
Tests run: 2, Failures: 0, Errors: 0, Skipped: 0, Time elapsed: 0.581 sec
Forking command line: /bin/sh -c cd <https://builds.apache.org/job/HBase-0.94-security/ws/>
&& /home/jenkins/tools/java/jdk1.6.0_45-32/jre/bin/java -enableassertions -Xmx1900m
-Djava.security.egd=file:/dev/./urandom -jar <https://builds.apache.org/job/HBase-0.94-security/ws/target/surefire/surefirebooter2907679266537090841.jar>
<https://builds.apache.org/job/HBase-0.94-security/ws/target/surefire/surefire4440691991589464532tmp>
<https://builds.apache.org/job/HBase-0.94-security/ws/target/surefire/surefire_1248377432154947448715tmp>
Running org.apache.hadoop.hbase.TestAcidGuarantees
Tests run: 3, Failures: 0, Errors: 0, Skipped: 0, Time elapsed: 96.506 sec
Forking command line: /bin/sh -c cd <https://builds.apache.org/job/HBase-0.94-security/ws/>
&& /home/jenkins/tools/java/jdk1.6.0_45-32/jre/bin/java -enableassertions -Xmx1900m
-Djava.security.egd=file:/dev/./urandom -jar <https://builds.apache.org/job/HBase-0.94-security/ws/target/surefire/surefirebooter52430879459652.jar>
<https://builds.apache.org/job/HBase-0.94-security/ws/target/surefire/surefire7640564282871038937tmp>
<https://builds.apache.org/job/HBase-0.94-security/ws/target/surefire/surefire_1258507006146966664908tmp>
Running org.apache.hadoop.hbase.TestGlobalMemStoreSize
Tests run: 1, Failures: 0, Errors: 0, Skipped: 0, Time elapsed: 17.582 sec
Forking command line: /bin/sh -c cd <https://builds.apache.org/job/HBase-0.94-security/ws/>
&& /home/jenkins/tools/java/jdk1.6.0_45-32/jre/bin/java -enableassertions -Xmx1900m
-Djava.security.egd=file:/dev/./urandom -jar <https://builds.apache.org/job/HBase-0.94-security/ws/target/surefire/surefirebooter506815116889592660.jar>
<https://builds.apache.org/job/HBase-0.94-security/ws/target/surefire/surefire270536200871030083tmp>
<https://builds.apache.org/job/HBase-0.94-security/ws/target/surefire/surefire_1267896013361555545014tmp>
Running org.apache.hadoop.hbase.TestLocalHBaseCluster
Tests run: 1, Failures: 0, Errors: 0, Skipped: 0, Time elapsed: 9.974 sec
Forking command line: /bin/sh -c cd <https://builds.apache.org/job/HBase-0.94-security/ws/>
&& /home/jenkins/tools/java/jdk1.6.0_45-32/jre/bin/java -enableassertions -Xmx1900m
-Djava.security.egd=file:/dev/./urandom -jar <https://builds.apache.org/job/HBase-0.94-security/ws/target/surefire/surefirebooter1138113649384047359.jar>
<https://builds.apache.org/job/HBase-0.94-security/ws/target/surefire/surefire6725648201077052655tmp>
<https://builds.apache.org/job/HBase-0.94-security/ws/target/surefire/surefire_1271845227890537264433tmp>
Running org.apache.hadoop.hbase.TestHBaseFileSystem
Tests run: 2, Failures: 0, Errors: 0, Skipped: 0, Time elapsed: 20.555 sec
Forking command line: /bin/sh -c cd <https://builds.apache.org/job/HBase-0.94-security/ws/>
&& /home/jenkins/tools/java/jdk1.6.0_45-32/jre/bin/java -enableassertions -Xmx1900m
-Djava.security.egd=file:/dev/./urandom -jar <https://builds.apache.org/job/HBase-0.94-security/ws/target/surefire/surefirebooter5723585801519057871.jar>
<https://builds.apache.org/job/HBase-0.94-security/ws/target/surefire/surefire3959522411528098735tmp>
<https://builds.apache.org/job/HBase-0.94-security/ws/target/surefire/surefire_1287373663376459124677tmp>
Running org.apache.hadoop.hbase.master.TestDefaultLoadBalancer
Tests run: 4, Failures: 0, Errors: 0, Skipped: 0, Time elapsed: 1.384 sec
Forking command line: /bin/sh -c cd <https://builds.apache.org/job/HBase-0.94-security/ws/>
&& /home/jenkins/tools/java/jdk1.6.0_45-32/jre/bin/java -enableassertions -Xmx1900m
-Djava.security.egd=file:/dev/./urandom -jar <https://builds.apache.org/job/HBase-0.94-security/ws/target/surefire/surefirebooter4030597101145328475.jar>
<https://builds.apache.org/job/HBase-0.94-security/ws/target/surefire/surefire4767592501106963945tmp>
<https://builds.apache.org/job/HBase-0.94-security/ws/target/surefire/surefire_1291134683768146730527tmp>
Running org.apache.hadoop.hbase.master.TestMXBean
Tests run: 1, Failures: 0, Errors: 0, Skipped: 0, Time elapsed: 15.915 sec
Forking command line: /bin/sh -c cd <https://builds.apache.org/job/HBase-0.94-security/ws/>
&& /home/jenkins/tools/java/jdk1.6.0_45-32/jre/bin/java -enableassertions -Xmx1900m
-Djava.security.egd=file:/dev/./urandom -jar <https://builds.apache.org/job/HBase-0.94-security/ws/target/surefire/surefirebooter6460714888324214500.jar>
<https://builds.apache.org/job/HBase-0.94-security/ws/target/surefire/surefire5466739887497366081tmp>
<https://builds.apache.org/job/HBase-0.94-security/ws/target/surefire/surefire_1308474575954625061310tmp>
Running org.apache.hadoop.hbase.master.TestActiveMasterManager
Tests run: 2, Failures: 0, Errors: 0, Skipped: 0, Time elapsed: 0.992 sec
Forking command line: /bin/sh -c cd <https://builds.apache.org/job/HBase-0.94-security/ws/>
&& /home/jenkins/tools/java/jdk1.6.0_45-32/jre/bin/java -enableassertions -Xmx1900m
-Djava.security.egd=file:/dev/./urandom -jar <https://builds.apache.org/job/HBase-0.94-security/ws/target/surefire/surefirebooter5995591846875057395.jar>
<https://builds.apache.org/job/HBase-0.94-security/ws/target/surefire/surefire3743178111369759622tmp>
<https://builds.apache.org/job/HBase-0.94-security/ws/target/surefire/surefire_1311071710532980774258tmp>
Running org.apache.hadoop.hbase.master.TestSplitLogManager
Tests run: 12, Failures: 0, Errors: 0, Skipped: 0, Time elapsed: 80.8 sec
Forking command line: /bin/sh -c cd <https://builds.apache.org/job/HBase-0.94-security/ws/>
&& /home/jenkins/tools/java/jdk1.6.0_45-32/jre/bin/java -enableassertions -Xmx1900m
-Djava.security.egd=file:/dev/./urandom -jar <https://builds.apache.org/job/HBase-0.94-security/ws/target/surefire/surefirebooter4256532345755785314.jar>
<https://builds.apache.org/job/HBase-0.94-security/ws/target/surefire/surefire3501463134204545499tmp>
<https://builds.apache.org/job/HBase-0.94-security/ws/target/surefire/surefire_1326838955698551860438tmp>
Running org.apache.hadoop.hbase.master.metrics.TestMasterStatistics
Tests run: 2, Failures: 0, Errors: 0, Skipped: 0, Time elapsed: 1.174 sec
Forking command line: /bin/sh -c cd <https://builds.apache.org/job/HBase-0.94-security/ws/>
&& /home/jenkins/tools/java/jdk1.6.0_45-32/jre/bin/java -enableassertions -Xmx1900m
-Djava.security.egd=file:/dev/./urandom -jar <https://builds.apache.org/job/HBase-0.94-security/ws/target/surefire/surefirebooter3563283047465448032.jar>
<https://builds.apache.org/job/HBase-0.94-security/ws/target/surefire/surefire8445567874964650939tmp>
<https://builds.apache.org/job/HBase-0.94-security/ws/target/surefire/surefire_1335743000039814409080tmp>
Running org.apache.hadoop.hbase.master.TestMasterFileSystem
Tests run: 1, Failures: 0, Errors: 0, Skipped: 0, Time elapsed: 10.364 sec
Forking command line: /bin/sh -c cd <https://builds.apache.org/job/HBase-0.94-security/ws/>
&& /home/jenkins/tools/java/jdk1.6.0_45-32/jre/bin/java -enableassertions -Xmx1900m
-Djava.security.egd=file:/dev/./urandom -jar <https://builds.apache.org/job/HBase-0.94-security/ws/target/surefire/surefirebooter4648128768824764607.jar>
<https://builds.apache.org/job/HBase-0.94-security/ws/target/surefire/surefire1819107821012683903tmp>
<https://builds.apache.org/job/HBase-0.94-security/ws/target/surefire/surefire_1342088258474012899342tmp>
Running org.apache.hadoop.hbase.master.TestDeadServer
Tests run: 1, Failures: 0, Errors: 0, Skipped: 0, Time elapsed: 0.208 sec
Forking command line: /bin/sh -c cd <https://builds.apache.org/job/HBase-0.94-security/ws/>
&& /home/jenkins/tools/java/jdk1.6.0_45-32/jre/bin/java -enableassertions -Xmx1900m
-Djava.security.egd=file:/dev/./urandom -jar <https://builds.apache.org/job/HBase-0.94-security/ws/target/surefire/surefirebooter7263198896009359203.jar>
<https://builds.apache.org/job/HBase-0.94-security/ws/target/surefire/surefire7993761095553009244tmp>
<https://builds.apache.org/job/HBase-0.94-security/ws/target/surefire/surefire_1357873942596807348180tmp>
Running org.apache.hadoop.hbase.master.TestZKBasedOpenCloseRegion
Tests run: 3, Failures: 0, Errors: 0, Skipped: 0, Time elapsed: 20.885 sec
Forking command line: /bin/sh -c cd <https://builds.apache.org/job/HBase-0.94-security/ws/>
&& /home/jenkins/tools/java/jdk1.6.0_45-32/jre/bin/java -enableassertions -Xmx1900m
-Djava.security.egd=file:/dev/./urandom -jar <https://builds.apache.org/job/HBase-0.94-security/ws/target/surefire/surefirebooter586972829601030754.jar>
<https://builds.apache.org/job/HBase-0.94-security/ws/target/surefire/surefire8816676047722136543tmp>
<https://builds.apache.org/job/HBase-0.94-security/ws/target/surefire/surefire_1361105054762529105191tmp>
Running org.apache.hadoop.hbase.master.TestMasterZKSessionRecovery
Tests run: 2, Failures: 0, Errors: 0, Skipped: 0, Time elapsed: 29.291 sec
Forking command line: /bin/sh -c cd <https://builds.apache.org/job/HBase-0.94-security/ws/>
&& /home/jenkins/tools/java/jdk1.6.0_45-32/jre/bin/java -enableassertions -Xmx1900m
-Djava.security.egd=file:/dev/./urandom -jar <https://builds.apache.org/job/HBase-0.94-security/ws/target/surefire/surefirebooter8654698668757315594.jar>
<https://builds.apache.org/job/HBase-0.94-security/ws/target/surefire/surefire815023836583514642tmp>
<https://builds.apache.org/job/HBase-0.94-security/ws/target/surefire/surefire_1375065572308104421792tmp>
Running org.apache.hadoop.hbase.master.TestMasterStatusServlet
Tests run: 5, Failures: 0, Errors: 0, Skipped: 0, Time elapsed: 0.99 sec
Forking command line: /bin/sh -c cd <https://builds.apache.org/job/HBase-0.94-security/ws/>
&& /home/jenkins/tools/java/jdk1.6.0_45-32/jre/bin/java -enableassertions -Xmx1900m
-Djava.security.egd=file:/dev/./urandom -jar <https://builds.apache.org/job/HBase-0.94-security/ws/target/surefire/surefirebooter6779045616566648518.jar>
<https://builds.apache.org/job/HBase-0.94-security/ws/target/surefire/surefire2207989088718007755tmp>
<https://builds.apache.org/job/HBase-0.94-security/ws/target/surefire/surefire_1383060491914172739680tmp>
Running org.apache.hadoop.hbase.master.handler.TestCreateTableHandler
Tests run: 3, Failures: 0, Errors: 0, Skipped: 0, Time elapsed: 42.252 sec
Forking command line: /bin/sh -c cd <https://builds.apache.org/job/HBase-0.94-security/ws/>
&& /home/jenkins/tools/java/jdk1.6.0_45-32/jre/bin/java -enableassertions -Xmx1900m
-Djava.security.egd=file:/dev/./urandom -jar <https://builds.apache.org/job/HBase-0.94-security/ws/target/surefire/surefirebooter6870554061998712314.jar>
<https://builds.apache.org/job/HBase-0.94-security/ws/target/surefire/surefire3707350737604681186tmp>
<https://builds.apache.org/job/HBase-0.94-security/ws/target/surefire/surefire_1398499385790925793412tmp>
Running org.apache.hadoop.hbase.master.TestMaster
Tests run: 2, Failures: 0, Errors: 0, Skipped: 0, Time elapsed: 14.829 sec
Forking command line: /bin/sh -c cd <https://builds.apache.org/job/HBase-0.94-security/ws/>
&& /home/jenkins/tools/java/jdk1.6.0_45-32/jre/bin/java -enableassertions -Xmx1900m
-Djava.security.egd=file:/dev/./urandom -jar <https://builds.apache.org/job/HBase-0.94-security/ws/target/surefire/surefirebooter3200703650424541301.jar>
<https://builds.apache.org/job/HBase-0.94-security/ws/target/surefire/surefire8100688150382330895tmp>
<https://builds.apache.org/job/HBase-0.94-security/ws/target/surefire/surefire_1403601091975122241768tmp>
Running org.apache.hadoop.hbase.master.TestClockSkewDetection
Tests run: 1, Failures: 0, Errors: 0, Skipped: 0, Time elapsed: 0.3 sec
Forking command line: /bin/sh -c cd <https://builds.apache.org/job/HBase-0.94-security/ws/>
&& /home/jenkins/tools/java/jdk1.6.0_45-32/jre/bin/java -enableassertions -Xmx1900m
-Djava.security.egd=file:/dev/./urandom -jar <https://builds.apache.org/job/HBase-0.94-security/ws/target/surefire/surefirebooter4573944199903461765.jar>
<https://builds.apache.org/job/HBase-0.94-security/ws/target/surefire/surefire6164541829529934141tmp>
<https://builds.apache.org/job/HBase-0.94-security/ws/target/surefire/surefire_141331736300570568954tmp>
Running org.apache.hadoop.hbase.master.snapshot.TestSnapshotFileCache
Tests run: 6, Failures: 0, Errors: 0, Skipped: 0, Time elapsed: 3.63 sec
Forking command line: /bin/sh -c cd <https://builds.apache.org/job/HBase-0.94-security/ws/>
&& /home/jenkins/tools/java/jdk1.6.0_45-32/jre/bin/java -enableassertions -Xmx1900m
-Djava.security.egd=file:/dev/./urandom -jar <https://builds.apache.org/job/HBase-0.94-security/ws/target/surefire/surefirebooter6837528079670561092.jar>
<https://builds.apache.org/job/HBase-0.94-security/ws/target/surefire/surefire1324737764966234839tmp>
<https://builds.apache.org/job/HBase-0.94-security/ws/target/surefire/surefire_1427573735648154556276tmp>
Running org.apache.hadoop.hbase.master.TestAssignmentManager
Tests run: 15, Failures: 0, Errors: 0, Skipped: 0, Time elapsed: 3.272 sec
Forking command line: /bin/sh -c cd <https://builds.apache.org/job/HBase-0.94-security/ws/>
&& /home/jenkins/tools/java/jdk1.6.0_45-32/jre/bin/java -enableassertions -Xmx1900m
-Djava.security.egd=file:/dev/./urandom -jar <https://builds.apache.org/job/HBase-0.94-security/ws/target/surefire/surefirebooter1558735360621924198.jar>
<https://builds.apache.org/job/HBase-0.94-security/ws/target/surefire/surefire1755623421937517545tmp>
<https://builds.apache.org/job/HBase-0.94-security/ws/target/surefire/surefire_1432964639825171423642tmp>
Running org.apache.hadoop.hbase.master.cleaner.TestLogsCleaner
Tests run: 1, Failures: 0, Errors: 0, Skipped: 0, Time elapsed: 3.049 sec
Forking command line: /bin/sh -c cd <https://builds.apache.org/job/HBase-0.94-security/ws/>
&& /home/jenkins/tools/java/jdk1.6.0_45-32/jre/bin/java -enableassertions -Xmx1900m
-Djava.security.egd=file:/dev/./urandom -jar <https://builds.apache.org/job/HBase-0.94-security/ws/target/surefire/surefirebooter8024481556996481510.jar>
<https://builds.apache.org/job/HBase-0.94-security/ws/target/surefire/surefire2512741803583030525tmp>
<https://builds.apache.org/job/HBase-0.94-security/ws/target/surefire/surefire_1449127495016726236662tmp>
Running org.apache.hadoop.hbase.master.cleaner.TestSnapshotFromMaster
Tests run: 4, Failures: 0, Errors: 0, Skipped: 0, Time elapsed: 31.397 sec
Forking command line: /bin/sh -c cd <https://builds.apache.org/job/HBase-0.94-security/ws/>
&& /home/jenkins/tools/java/jdk1.6.0_45-32/jre/bin/java -enableassertions -Xmx1900m
-Djava.security.egd=file:/dev/./urandom -jar <https://builds.apache.org/job/HBase-0.94-security/ws/target/surefire/surefirebooter7962224907666421342.jar>
<https://builds.apache.org/job/HBase-0.94-security/ws/target/surefire/surefire1451973827469078571tmp>
<https://builds.apache.org/job/HBase-0.94-security/ws/target/surefire/surefire_1451462509885884430416tmp>
Running org.apache.hadoop.hbase.master.cleaner.TestHFileCleaner
Tests run: 3, Failures: 0, Errors: 0, Skipped: 0, Time elapsed: 3.776 sec
Forking command line: /bin/sh -c cd <https://builds.apache.org/job/HBase-0.94-security/ws/>
&& /home/jenkins/tools/java/jdk1.6.0_45-32/jre/bin/java -enableassertions -Xmx1900m
-Djava.security.egd=file:/dev/./urandom -jar <https://builds.apache.org/job/HBase-0.94-security/ws/target/surefire/surefirebooter8773579545158653113.jar>
<https://builds.apache.org/job/HBase-0.94-security/ws/target/surefire/surefire3264269949398631555tmp>
<https://builds.apache.org/job/HBase-0.94-security/ws/target/surefire/surefire_1468343371885216429397tmp>
Running org.apache.hadoop.hbase.master.TestHMasterRPCException
Tests run: 1, Failures: 0, Errors: 0, Skipped: 0, Time elapsed: 1.452 sec
Forking command line: /bin/sh -c cd <https://builds.apache.org/job/HBase-0.94-security/ws/>
&& /home/jenkins/tools/java/jdk1.6.0_45-32/jre/bin/java -enableassertions -Xmx1900m
-Djava.security.egd=file:/dev/./urandom -jar <https://builds.apache.org/job/HBase-0.94-security/ws/target/surefire/surefirebooter2132057618440180522.jar>
<https://builds.apache.org/job/HBase-0.94-security/ws/target/surefire/surefire4330769205257443782tmp>
<https://builds.apache.org/job/HBase-0.94-security/ws/target/surefire/surefire_147698896324346835000tmp>
Running org.apache.hadoop.hbase.master.TestOpenedRegionHandler
Tests run: 2, Failures: 0, Errors: 0, Skipped: 0, Time elapsed: 14.634 sec
Forking command line: /bin/sh -c cd <https://builds.apache.org/job/HBase-0.94-security/ws/>
&& /home/jenkins/tools/java/jdk1.6.0_45-32/jre/bin/java -enableassertions -Xmx1900m
-Djava.security.egd=file:/dev/./urandom -jar <https://builds.apache.org/job/HBase-0.94-security/ws/target/surefire/surefirebooter5407281918942580262.jar>
<https://builds.apache.org/job/HBase-0.94-security/ws/target/surefire/surefire7825286926592714116tmp>
<https://builds.apache.org/job/HBase-0.94-security/ws/target/surefire/surefire_148742343468787028681tmp>
Running org.apache.hadoop.hbase.util.TestRegionSplitter
Tests run: 5, Failures: 0, Errors: 0, Skipped: 0, Time elapsed: 15.122 sec
Forking command line: /bin/sh -c cd <https://builds.apache.org/job/HBase-0.94-security/ws/>
&& /home/jenkins/tools/java/jdk1.6.0_45-32/jre/bin/java -enableassertions -Xmx1900m
-Djava.security.egd=file:/dev/./urandom -jar <https://builds.apache.org/job/HBase-0.94-security/ws/target/surefire/surefirebooter6486909139847305973.jar>
<https://builds.apache.org/job/HBase-0.94-security/ws/target/surefire/surefire3202341948807803823tmp>
<https://builds.apache.org/job/HBase-0.94-security/ws/target/surefire/surefire_1496284234678345428711tmp>
Forking command line: /bin/sh -c cd <https://builds.apache.org/job/HBase-0.94-security/ws/>
&& /home/jenkins/tools/java/jdk1.6.0_45-32/jre/bin/java -enableassertions -Xmx1900m
-Djava.security.egd=file:/dev/./urandom -jar <https://builds.apache.org/job/HBase-0.94-security/ws/target/surefire/surefirebooter3435161717251098118.jar>
<https://builds.apache.org/job/HBase-0.94-security/ws/target/surefire/surefire6184202199856356468tmp>
<https://builds.apache.org/job/HBase-0.94-security/ws/target/surefire/surefire_1502277428037682196996tmp>
Running org.apache.hadoop.hbase.util.TestEnvironmentEdgeManager
Tests run: 2, Failures: 0, Errors: 0, Skipped: 0, Time elapsed: 0.368 sec
Forking command line: /bin/sh -c cd <https://builds.apache.org/job/HBase-0.94-security/ws/>
&& /home/jenkins/tools/java/jdk1.6.0_45-32/jre/bin/java -enableassertions -Xmx1900m
-Djava.security.egd=file:/dev/./urandom -jar <https://builds.apache.org/job/HBase-0.94-security/ws/target/surefire/surefirebooter2672133337554589057.jar>
<https://builds.apache.org/job/HBase-0.94-security/ws/target/surefire/surefire1273505046406253619tmp>
<https://builds.apache.org/job/HBase-0.94-security/ws/target/surefire/surefire_1516334639681729216747tmp>
Running org.apache.hadoop.hbase.util.TestFSVisitor
Tests run: 3, Failures: 0, Errors: 0, Skipped: 0, Time elapsed: 1.629 sec
Forking command line: /bin/sh -c cd <https://builds.apache.org/job/HBase-0.94-security/ws/>
&& /home/jenkins/tools/java/jdk1.6.0_45-32/jre/bin/java -enableassertions -Xmx1900m
-Djava.security.egd=file:/dev/./urandom -jar <https://builds.apache.org/job/HBase-0.94-security/ws/target/surefire/surefirebooter7337208663724395347.jar>
<https://builds.apache.org/job/HBase-0.94-security/ws/target/surefire/surefire1583390984181568265tmp>
<https://builds.apache.org/job/HBase-0.94-security/ws/target/surefire/surefire_1528517774688593826661tmp>
Running org.apache.hadoop.hbase.util.TestFSHDFSUtils
Tests run: 3, Failures: 0, Errors: 0, Skipped: 0, Time elapsed: 3.745 sec
Forking command line: /bin/sh -c cd <https://builds.apache.org/job/HBase-0.94-security/ws/>
&& /home/jenkins/tools/java/jdk1.6.0_45-32/jre/bin/java -enableassertions -Xmx1900m
-Djava.security.egd=file:/dev/./urandom -jar <https://builds.apache.org/job/HBase-0.94-security/ws/target/surefire/surefirebooter736471624419986458.jar>
<https://builds.apache.org/job/HBase-0.94-security/ws/target/surefire/surefire2258813482334987402tmp>
<https://builds.apache.org/job/HBase-0.94-security/ws/target/surefire/surefire_1534752676458881352985tmp>
Running org.apache.hadoop.hbase.util.hbck.TestOfflineMetaRebuildOverlap
Tests run: 1, Failures: 0, Errors: 0, Skipped: 0, Time elapsed: 26.081 sec
Forking command line: /bin/sh -c cd <https://builds.apache.org/job/HBase-0.94-security/ws/>
&& /home/jenkins/tools/java/jdk1.6.0_45-32/jre/bin/java -enableassertions -Xmx1900m
-Djava.security.egd=file:/dev/./urandom -jar <https://builds.apache.org/job/HBase-0.94-security/ws/target/surefire/surefirebooter2398126443192408594.jar>
<https://builds.apache.org/job/HBase-0.94-security/ws/target/surefire/surefire3590734876798398792tmp>
<https://builds.apache.org/job/HBase-0.94-security/ws/target/surefire/surefire_1547000297013622963314tmp>
Running org.apache.hadoop.hbase.util.hbck.TestOfflineMetaRebuildHole
Tests run: 1, Failures: 0, Errors: 0, Skipped: 0, Time elapsed: 26.212 sec
Forking command line: /bin/sh -c cd <https://builds.apache.org/job/HBase-0.94-security/ws/>
&& /home/jenkins/tools/java/jdk1.6.0_45-32/jre/bin/java -enableassertions -Xmx1900m
-Djava.security.egd=file:/dev/./urandom -jar <https://builds.apache.org/job/HBase-0.94-security/ws/target/surefire/surefirebooter1805618880958114229.jar>
<https://builds.apache.org/job/HBase-0.94-security/ws/target/surefire/surefire2264858804767785444tmp>
<https://builds.apache.org/job/HBase-0.94-security/ws/target/surefire/surefire_155931477728392466078tmp>
Running org.apache.hadoop.hbase.util.TestFSTableDescriptors
Tests run: 11, Failures: 0, Errors: 0, Skipped: 0, Time elapsed: 0.91 sec
Forking command line: /bin/sh -c cd <https://builds.apache.org/job/HBase-0.94-security/ws/>
&& /home/jenkins/tools/java/jdk1.6.0_45-32/jre/bin/java -enableassertions -Xmx1900m
-Djava.security.egd=file:/dev/./urandom -jar <https://builds.apache.org/job/HBase-0.94-security/ws/target/surefire/surefirebooter2431067322720773965.jar>
<https://builds.apache.org/job/HBase-0.94-security/ws/target/surefire/surefire3558662268567333953tmp>
<https://builds.apache.org/job/HBase-0.94-security/ws/target/surefire/surefire_156805030496374602053tmp>
Running org.apache.hadoop.hbase.util.TestDefaultEnvironmentEdge
Tests run: 1, Failures: 0, Errors: 0, Skipped: 0, Time elapsed: 0.212 sec
Forking command line: /bin/sh -c cd <https://builds.apache.org/job/HBase-0.94-security/ws/>
&& /home/jenkins/tools/java/jdk1.6.0_45-32/jre/bin/java -enableassertions -Xmx1900m
-Djava.security.egd=file:/dev/./urandom -jar <https://builds.apache.org/job/HBase-0.94-security/ws/target/surefire/surefirebooter6968034569064207166.jar>
<https://builds.apache.org/job/HBase-0.94-security/ws/target/surefire/surefire1090349967982217157tmp>
<https://builds.apache.org/job/HBase-0.94-security/ws/target/surefire/surefire_1576752095404341278883tmp>
Running org.apache.hadoop.hbase.util.TestIdLock
Tests run: 1, Failures: 0, Errors: 0, Skipped: 0, Time elapsed: 15.391 sec
Forking command line: /bin/sh -c cd <https://builds.apache.org/job/HBase-0.94-security/ws/>
&& /home/jenkins/tools/java/jdk1.6.0_45-32/jre/bin/java -enableassertions -Xmx1900m
-Djava.security.egd=file:/dev/./urandom -jar <https://builds.apache.org/job/HBase-0.94-security/ws/target/surefire/surefirebooter1555316282433233246.jar>
<https://builds.apache.org/job/HBase-0.94-security/ws/target/surefire/surefire4060537647428244775tmp>
<https://builds.apache.org/job/HBase-0.94-security/ws/target/surefire/surefire_1585243450710971409411tmp>
Running org.apache.hadoop.hbase.util.hbck.TestOfflineMetaRebuildBase
Tests run: 1, Failures: 0, Errors: 0, Skipped: 0, Time elapsed: 26.58 sec
Forking command line: /bin/sh -c cd <https://builds.apache.org/job/HBase-0.94-security/ws/>
&& /home/jenkins/tools/java/jdk1.6.0_45-32/jre/bin/java -enableassertions -Xmx1900m
-Djava.security.egd=file:/dev/./urandom -jar <https://builds.apache.org/job/HBase-0.94-security/ws/target/surefire/surefirebooter5310422516951331558.jar>
<https://builds.apache.org/job/HBase-0.94-security/ws/target/surefire/surefire3626411314539264054tmp>
<https://builds.apache.org/job/HBase-0.94-security/ws/target/surefire/surefire_1593048088923383461832tmp>
Running org.apache.hadoop.hbase.util.TestCoprocessorScanPolicy
Tests run: 2, Failures: 0, Errors: 0, Skipped: 0, Time elapsed: 15.698 sec
Forking command line: /bin/sh -c cd <https://builds.apache.org/job/HBase-0.94-security/ws/>
&& /home/jenkins/tools/java/jdk1.6.0_45-32/jre/bin/java -enableassertions -Xmx1900m
-Djava.security.egd=file:/dev/./urandom -jar <https://builds.apache.org/job/HBase-0.94-security/ws/target/surefire/surefirebooter4314222435837271268.jar>
<https://builds.apache.org/job/HBase-0.94-security/ws/target/surefire/surefire1636868459920941134tmp>
<https://builds.apache.org/job/HBase-0.94-security/ws/target/surefire/surefire_1605731977495207635884tmp>
Running org.apache.hadoop.hbase.util.TestPoolMap$TestRoundRobinPoolType
Tests run: 3, Failures: 0, Errors: 0, Skipped: 0, Time elapsed: 0.01 sec
Running org.apache.hadoop.hbase.util.TestPoolMap$TestThreadLocalPoolType
Tests run: 3, Failures: 0, Errors: 0, Skipped: 0, Time elapsed: 0.007 sec
Running org.apache.hadoop.hbase.util.TestPoolMap$TestReusablePoolType
Tests run: 3, Failures: 0, Errors: 0, Skipped: 0, Time elapsed: 0.035 sec
Forking command line: /bin/sh -c cd <https://builds.apache.org/job/HBase-0.94-security/ws/>
&& /home/jenkins/tools/java/jdk1.6.0_45-32/jre/bin/java -enableassertions -Xmx1900m
-Djava.security.egd=file:/dev/./urandom -jar <https://builds.apache.org/job/HBase-0.94-security/ws/target/surefire/surefirebooter6780364273426095973.jar>
<https://builds.apache.org/job/HBase-0.94-security/ws/target/surefire/surefire7223386336317778318tmp>
<https://builds.apache.org/job/HBase-0.94-security/ws/target/surefire/surefire_1615593486922409576134tmp>
Running org.apache.hadoop.hbase.util.TestFSUtils
Tests run: 4, Failures: 0, Errors: 0, Skipped: 0, Time elapsed: 19.878 sec
Forking command line: /bin/sh -c cd <https://builds.apache.org/job/HBase-0.94-security/ws/>
&& /home/jenkins/tools/java/jdk1.6.0_45-32/jre/bin/java -enableassertions -Xmx1900m
-Djava.security.egd=file:/dev/./urandom -jar <https://builds.apache.org/job/HBase-0.94-security/ws/target/surefire/surefirebooter1488957880242477184.jar>
<https://builds.apache.org/job/HBase-0.94-security/ws/target/surefire/surefire7113012144358748608tmp>
<https://builds.apache.org/job/HBase-0.94-security/ws/target/surefire/surefire_1623813339185806490217tmp>
Running org.apache.hadoop.hbase.util.TestMergeTable
Tests run: 1, Failures: 0, Errors: 0, Skipped: 0, Time elapsed: 25.069 sec
Running org.apache.hadoop.hbase.util.TestSizeBasedThrottler
Tests run: 3, Failures: 0, Errors: 0, Skipped: 0, Time elapsed: 49.909 sec

Results :

Tests run: 925, Failures: 0, Errors: 0, Skipped: 2

[INFO] ------------------------------------------------------------------------
[INFO] BUILD FAILURE
[INFO] ------------------------------------------------------------------------
[INFO] Total time: 45:38.700s
[INFO] Finished at: Sun Sep 28 04:49:26 UTC 2014
[INFO] Final Memory: 71M/839M
[INFO] ------------------------------------------------------------------------
[ERROR] Failed to execute goal org.apache.maven.plugins:maven-surefire-plugin:2.12-TRUNK-HBASE-2:test
(secondPartTestsExecution) on project hbase: Failure or timeout -> [Help 1]
org.apache.maven.lifecycle.LifecycleExecutionException: Failed to execute goal org.apache.maven.plugins:maven-surefire-plugin:2.12-TRUNK-HBASE-2:test
(secondPartTestsExecution) on project hbase: Failure or timeout
	at org.apache.maven.lifecycle.internal.MojoExecutor.execute(MojoExecutor.java:217)
	at org.apache.maven.lifecycle.internal.MojoExecutor.execute(MojoExecutor.java:153)
	at org.apache.maven.lifecycle.internal.MojoExecutor.execute(MojoExecutor.java:145)
	at org.apache.maven.lifecycle.internal.MojoExecutor.executeForkedExecutions(MojoExecutor.java:365)
	at org.apache.maven.lifecycle.internal.MojoExecutor.execute(MojoExecutor.java:199)
	at org.apache.maven.lifecycle.internal.MojoExecutor.execute(MojoExecutor.java:153)
	at org.apache.maven.lifecycle.internal.MojoExecutor.execute(MojoExecutor.java:145)
	at org.apache.maven.lifecycle.internal.LifecycleModuleBuilder.buildProject(LifecycleModuleBuilder.java:84)
	at org.apache.maven.lifecycle.internal.LifecycleModuleBuilder.buildProject(LifecycleModuleBuilder.java:59)
	at org.apache.maven.lifecycle.internal.LifecycleStarter.singleThreadedBuild(LifecycleStarter.java:183)
	at org.apache.maven.lifecycle.internal.LifecycleStarter.execute(LifecycleStarter.java:161)
	at org.apache.maven.DefaultMaven.doExecute(DefaultMaven.java:320)
	at org.apache.maven.DefaultMaven.execute(DefaultMaven.java:156)
	at org.apache.maven.cli.MavenCli.execute(MavenCli.java:537)
	at org.apache.maven.cli.MavenCli.doMain(MavenCli.java:196)
	at org.apache.maven.cli.MavenCli.main(MavenCli.java:141)
	at sun.reflect.NativeMethodAccessorImpl.invoke0(Native Method)
	at sun.reflect.NativeMethodAccessorImpl.invoke(NativeMethodAccessorImpl.java:39)
	at sun.reflect.DelegatingMethodAccessorImpl.invoke(DelegatingMethodAccessorImpl.java:25)
	at java.lang.reflect.Method.invoke(Method.java:597)
	at org.codehaus.plexus.classworlds.launcher.Launcher.launchEnhanced(Launcher.java:290)
	at org.codehaus.plexus.classworlds.launcher.Launcher.launch(Launcher.java:230)
	at org.codehaus.plexus.classworlds.launcher.Launcher.mainWithExitCode(Launcher.java:409)
	at org.codehaus.plexus.classworlds.launcher.Launcher.main(Launcher.java:352)
Caused by: org.apache.maven.plugin.MojoExecutionException: Failure or timeout
	at org.apache.maven.plugin.surefire.SurefirePlugin.assertNoFailureOrTimeout(SurefirePlugin.java:643)
	at org.apache.maven.plugin.surefire.SurefirePlugin.handleSummary(SurefirePlugin.java:624)
	at org.apache.maven.plugin.surefire.AbstractSurefireMojo.executeAfterPreconditionsChecked(AbstractSurefireMojo.java:137)
	at org.apache.maven.plugin.surefire.AbstractSurefireMojo.execute(AbstractSurefireMojo.java:98)
	at org.apache.maven.plugin.DefaultBuildPluginManager.executeMojo(DefaultBuildPluginManager.java:101)
	at org.apache.maven.lifecycle.internal.MojoExecutor.execute(MojoExecutor.java:209)
	... 23 more
[ERROR] 
[ERROR] 
[ERROR] For more information about the errors and possible solutions, please read the following
articles:
[ERROR] [Help 1] http://cwiki.apache.org/confluence/display/MAVEN/MojoExecutionException
Build step 'Invoke top-level Maven targets' marked build as failure
Archiving artifacts
Sending artifact delta relative to HBase-0.94-security #523
Archived 958 artifacts
Archive block size is 32768
Received 41 blocks and 135122953 bytes
Compression is 1.0%
Took 44 sec
Updating HBASE-11957
Recording test results

Mime
View raw message