hbase-builds mailing list archives

Site index · List index
Message view « Date » · « Thread »
Top « Date » · « Thread »
From Stack <st...@duboce.net>
Subject Re: Build failed in Jenkins: HBase-0.98 #478
Date Wed, 27 Aug 2014 18:52:27 GMT
This looks like my commit.  Let me fix.


On Wed, Aug 27, 2014 at 11:18 AM, Apache Jenkins Server <
jenkins@builds.apache.org> wrote:

> See <https://builds.apache.org/job/HBase-0.98/478/changes>
>
> Changes:
>
> [stack] HBASE-9875 NamespaceJanitor chore is not used
>
> ------------------------------------------
> [...truncated 470 lines...]
> [INFO] Surefire report directory: <
> https://builds.apache.org/job/HBase-0.98/ws/hbase-hadoop2-compat/target/surefire-reports
> >
> [INFO] Using configured provider
> org.apache.maven.surefire.junitcore.JUnitCoreProvider
>
> -------------------------------------------------------
>  T E S T S
> -------------------------------------------------------
> Running
> org.apache.hadoop.hbase.thrift.TestMetricsThriftServerSourceFactoryImpl
> Tests run: 3, Failures: 0, Errors: 0, Skipped: 0, Time elapsed: 0.251 sec
> Running org.apache.hadoop.hbase.metrics.TestBaseSourceImpl
> Tests run: 5, Failures: 0, Errors: 0, Skipped: 0, Time elapsed: 0.003 sec
> Running
> org.apache.hadoop.hbase.replication.regionserver.TestMetricsReplicationSourceImpl
> Tests run: 1, Failures: 0, Errors: 0, Skipped: 0, Time elapsed: 0.002 sec
> Running org.apache.hadoop.hbase.rest.TestMetricsRESTSourceImpl
> Tests run: 1, Failures: 0, Errors: 0, Skipped: 0, Time elapsed: 0.003 sec
> Running org.apache.hadoop.hbase.master.TestMetricsMasterSourceImpl
> Tests run: 1, Failures: 0, Errors: 0, Skipped: 0, Time elapsed: 0.004 sec
> Running org.apache.hadoop.hbase.regionserver.wal.TestMetricsWALSourceImpl
> Tests run: 1, Failures: 0, Errors: 0, Skipped: 0, Time elapsed: 0.007 sec
> Running
> org.apache.hadoop.hbase.regionserver.TestMetricsRegionServerSourceImpl
> Tests run: 2, Failures: 0, Errors: 0, Skipped: 0, Time elapsed: 0.005 sec
> Running org.apache.hadoop.hbase.regionserver.TestMetricsRegionSourceImpl
> Tests run: 2, Failures: 0, Errors: 0, Skipped: 0, Time elapsed: 0.299 sec
>
> Results :
>
> Tests run: 16, Failures: 0, Errors: 0, Skipped: 0
>
> [INFO]
> [INFO] --- maven-surefire-plugin:2.12-TRUNK-HBASE-2:test
> (secondPartTestsExecution) @ hbase-hadoop2-compat ---
> [INFO] Tests are skipped.
> [INFO]
> [INFO] --- maven-source-plugin:2.2.1:jar-no-fork (attach-sources) @
> hbase-hadoop2-compat ---
> [INFO] Building jar: <
> https://builds.apache.org/job/HBase-0.98/ws/hbase-hadoop2-compat/target/hbase-hadoop2-compat-0.98.6-sources.jar
> >
> [INFO]
> [INFO] --- maven-jar-plugin:2.4:test-jar (default) @ hbase-hadoop2-compat
> ---
> [INFO] Building jar: <
> https://builds.apache.org/job/HBase-0.98/ws/hbase-hadoop2-compat/target/hbase-hadoop2-compat-0.98.6-tests.jar
> >
> [INFO]
> [INFO] --- maven-jar-plugin:2.4:jar (default-jar) @ hbase-hadoop2-compat
> ---
> [INFO] Building jar: <
> https://builds.apache.org/job/HBase-0.98/ws/hbase-hadoop2-compat/target/hbase-hadoop2-compat-0.98.6.jar
> >
> [INFO]
> [INFO] --- maven-install-plugin:2.3.1:install (default-install) @
> hbase-hadoop2-compat ---
> [INFO] Installing <
> https://builds.apache.org/job/HBase-0.98/ws/hbase-hadoop2-compat/target/hbase-hadoop2-compat-0.98.6.jar>
> to
> /home/jenkins/.m2/repository/org/apache/hbase/hbase-hadoop2-compat/0.98.6/hbase-hadoop2-compat-0.98.6.jar
> [INFO] Installing <
> https://builds.apache.org/job/HBase-0.98/ws/hbase-hadoop2-compat/pom.xml>
> to
> /home/jenkins/.m2/repository/org/apache/hbase/hbase-hadoop2-compat/0.98.6/hbase-hadoop2-compat-0.98.6.pom
> [INFO] Installing <
> https://builds.apache.org/job/HBase-0.98/ws/hbase-hadoop2-compat/target/hbase-hadoop2-compat-0.98.6-sources.jar>
> to
> /home/jenkins/.m2/repository/org/apache/hbase/hbase-hadoop2-compat/0.98.6/hbase-hadoop2-compat-0.98.6-sources.jar
> [INFO] Installing <
> https://builds.apache.org/job/HBase-0.98/ws/hbase-hadoop2-compat/target/hbase-hadoop2-compat-0.98.6-tests.jar>
> to
> /home/jenkins/.m2/repository/org/apache/hbase/hbase-hadoop2-compat/0.98.6/hbase-hadoop2-compat-0.98.6-tests.jar
> [INFO]
> [INFO]
> ------------------------------------------------------------------------
> [INFO] Building HBase - Prefix Tree 0.98.6
> [INFO]
> ------------------------------------------------------------------------
> [INFO]
> [INFO] --- maven-remote-resources-plugin:1.4:process (default) @
> hbase-prefix-tree ---
> [INFO]
> [INFO] --- maven-resources-plugin:2.6:resources (default-resources) @
> hbase-prefix-tree ---
> [INFO] Using 'UTF-8' encoding to copy filtered resources.
> [INFO] skip non existing resourceDirectory <
> https://builds.apache.org/job/HBase-0.98/ws/hbase-prefix-tree/src/main/resources
> >
> [INFO] Copying 3 resources
> [INFO]
> [INFO] --- maven-compiler-plugin:2.5.1:compile (default-compile) @
> hbase-prefix-tree ---
> [INFO] Compiling 39 source files to <
> https://builds.apache.org/job/HBase-0.98/ws/hbase-prefix-tree/target/classes
> >
> [INFO]
> [INFO] --- maven-resources-plugin:2.6:testResources
> (default-testResources) @ hbase-prefix-tree ---
> [INFO] Using 'UTF-8' encoding to copy filtered resources.
> [INFO] skip non existing resourceDirectory <
> https://builds.apache.org/job/HBase-0.98/ws/hbase-prefix-tree/src/test/resources
> >
> [INFO] Copying 3 resources
> [INFO]
> [INFO] --- maven-compiler-plugin:2.5.1:testCompile (default-testCompile) @
> hbase-prefix-tree ---
> [INFO] Compiling 46 source files to <
> https://builds.apache.org/job/HBase-0.98/ws/hbase-prefix-tree/target/test-classes
> >
> [INFO]
> [INFO] --- maven-surefire-plugin:2.12-TRUNK-HBASE-2:test (default-test) @
> hbase-prefix-tree ---
> [INFO] Surefire report directory: <
> https://builds.apache.org/job/HBase-0.98/ws/hbase-prefix-tree/target/surefire-reports
> >
> [INFO] Using configured provider
> org.apache.maven.surefire.junitcore.JUnitCoreProvider
>
> -------------------------------------------------------
>  T E S T S
> -------------------------------------------------------
> Running org.apache.hadoop.hbase.util.vint.TestFIntTool
> Tests run: 7, Failures: 0, Errors: 0, Skipped: 0, Time elapsed: 0.004 sec
> Running org.apache.hadoop.hbase.util.vint.TestVIntTool
> Tests run: 6, Failures: 0, Errors: 0, Skipped: 0, Time elapsed: 0.036 sec
> Running org.apache.hadoop.hbase.util.vint.TestVLongTool
> Tests run: 6, Failures: 0, Errors: 0, Skipped: 0, Time elapsed: 0.056 sec
> Running org.apache.hadoop.hbase.util.bytes.TestByteRange
> Tests run: 1, Failures: 0, Errors: 0, Skipped: 0, Time elapsed: 0.002 sec
> Running org.apache.hadoop.hbase.codec.prefixtree.blockmeta.TestBlockMeta
> Tests run: 1, Failures: 0, Errors: 0, Skipped: 0, Time elapsed: 0.001 sec
> Running org.apache.hadoop.hbase.codec.prefixtree.row.TestRowEncoder
> Tests run: 85, Failures: 0, Errors: 0, Skipped: 0, Time elapsed: 0.454 sec
> Running org.apache.hadoop.hbase.codec.prefixtree.row.TestPrefixTreeSearcher
> Tests run: 85, Failures: 0, Errors: 0, Skipped: 0, Time elapsed: 0.572 sec
> Running org.apache.hadoop.hbase.codec.prefixtree.builder.TestTokenizer
> Tests run: 4, Failures: 0, Errors: 0, Skipped: 0, Time elapsed: 0.005 sec
> Running org.apache.hadoop.hbase.codec.prefixtree.builder.TestTreeDepth
> Tests run: 7, Failures: 0, Errors: 0, Skipped: 0, Time elapsed: 0.001 sec
> Running org.apache.hadoop.hbase.codec.prefixtree.column.TestColumnBuilder
> Tests run: 17, Failures: 0, Errors: 0, Skipped: 0, Time elapsed: 0.112 sec
> Running
> org.apache.hadoop.hbase.codec.prefixtree.timestamp.TestTimestampEncoder
> Tests run: 12, Failures: 0, Errors: 0, Skipped: 0, Time elapsed: 0.002 sec
> Running org.apache.hadoop.hbase.codec.keyvalue.TestKeyValueTool
> Tests run: 17, Failures: 0, Errors: 0, Skipped: 0, Time elapsed: 1.485 sec
>
> Results :
>
> Tests run: 248, Failures: 0, Errors: 0, Skipped: 0
>
> [INFO]
> [INFO] --- maven-surefire-plugin:2.12-TRUNK-HBASE-2:test
> (secondPartTestsExecution) @ hbase-prefix-tree ---
> [INFO] Tests are skipped.
> [INFO]
> [INFO] --- maven-source-plugin:2.2.1:jar-no-fork (attach-sources) @
> hbase-prefix-tree ---
> [INFO] Building jar: <
> https://builds.apache.org/job/HBase-0.98/ws/hbase-prefix-tree/target/hbase-prefix-tree-0.98.6-sources.jar
> >
> [INFO]
> [INFO] --- maven-jar-plugin:2.4:test-jar (default) @ hbase-prefix-tree ---
> [INFO] Building jar: <
> https://builds.apache.org/job/HBase-0.98/ws/hbase-prefix-tree/target/hbase-prefix-tree-0.98.6-tests.jar
> >
> [INFO]
> [INFO] --- maven-jar-plugin:2.4:jar (default-jar) @ hbase-prefix-tree ---
> [INFO] Building jar: <
> https://builds.apache.org/job/HBase-0.98/ws/hbase-prefix-tree/target/hbase-prefix-tree-0.98.6.jar
> >
> [INFO]
> [INFO] --- maven-install-plugin:2.3.1:install (default-install) @
> hbase-prefix-tree ---
> [INFO] Installing <
> https://builds.apache.org/job/HBase-0.98/ws/hbase-prefix-tree/target/hbase-prefix-tree-0.98.6.jar>
> to
> /home/jenkins/.m2/repository/org/apache/hbase/hbase-prefix-tree/0.98.6/hbase-prefix-tree-0.98.6.jar
> [INFO] Installing <
> https://builds.apache.org/job/HBase-0.98/ws/hbase-prefix-tree/pom.xml> to
> /home/jenkins/.m2/repository/org/apache/hbase/hbase-prefix-tree/0.98.6/hbase-prefix-tree-0.98.6.pom
> [INFO] Installing <
> https://builds.apache.org/job/HBase-0.98/ws/hbase-prefix-tree/target/hbase-prefix-tree-0.98.6-sources.jar>
> to
> /home/jenkins/.m2/repository/org/apache/hbase/hbase-prefix-tree/0.98.6/hbase-prefix-tree-0.98.6-sources.jar
> [INFO] Installing <
> https://builds.apache.org/job/HBase-0.98/ws/hbase-prefix-tree/target/hbase-prefix-tree-0.98.6-tests.jar>
> to
> /home/jenkins/.m2/repository/org/apache/hbase/hbase-prefix-tree/0.98.6/hbase-prefix-tree-0.98.6-tests.jar
> [INFO]
> [INFO]
> ------------------------------------------------------------------------
> [INFO] Building HBase - Server 0.98.6
> [INFO]
> ------------------------------------------------------------------------
> [INFO]
> [INFO] --- maven-antrun-plugin:1.6:run (generate) @ hbase-server ---
> [INFO] Executing tasks
>
> main:
>     [mkdir] Created dir: <
> https://builds.apache.org/job/HBase-0.98/ws/hbase-server/target/hbase-webapps
> >
>      [copy] Copying 20 files to <
> https://builds.apache.org/job/HBase-0.98/ws/hbase-server/target/hbase-webapps
> >
> log4j:WARN No appenders could be found for logger (org.mortbay.log).
> log4j:WARN Please initialize the log4j system properly.
> log4j:WARN See http://logging.apache.org/log4j/1.2/faq.html#noconfig for
> more info.
>     [mkdir] Created dir: <
> https://builds.apache.org/job/HBase-0.98/ws/hbase-server/target/hbase-webapps/master/WEB-INF
> >
>     [mkdir] Created dir: <
> https://builds.apache.org/job/HBase-0.98/ws/hbase-server/target/hbase-webapps/regionserver/WEB-INF
> >
>     [mkdir] Created dir: <
> https://builds.apache.org/job/HBase-0.98/ws/hbase-server/target/hbase-webapps/rest/WEB-INF
> >
> [INFO] Executed tasks
> [INFO]
> [INFO] --- build-helper-maven-plugin:1.5:add-source
> (jspcSource-packageInfo-source) @ hbase-server ---
> [INFO] Source directory: <
> https://builds.apache.org/job/HBase-0.98/ws/hbase-server/target/generated-jamon>
> added.
> [INFO] Source directory: <
> https://builds.apache.org/job/HBase-0.98/ws/hbase-server/target/generated-sources/java>
> added.
> [INFO]
> [INFO] --- jamon-maven-plugin:2.3.4:translate (default) @ hbase-server ---
> [INFO] Translating 10 templates from <
> https://builds.apache.org/job/HBase-0.98/ws/hbase-server/src/main/jamon>
> to <
> https://builds.apache.org/job/HBase-0.98/ws/hbase-server/target/generated-jamon
> >
> [INFO]
> [INFO] --- maven-remote-resources-plugin:1.4:process (default) @
> hbase-server ---
> [INFO]
> [INFO] --- maven-resources-plugin:2.6:resources (default-resources) @
> hbase-server ---
> [INFO] Using 'UTF-8' encoding to copy filtered resources.
> [INFO] Copying 23 resources
> [INFO] Copying 3 resources
> [INFO]
> [INFO] --- maven-compiler-plugin:2.5.1:compile (default-compile) @
> hbase-server ---
> [INFO] Compiling 700 source files to <
> https://builds.apache.org/job/HBase-0.98/ws/hbase-server/target/classes>
> [INFO] -------------------------------------------------------------
> [ERROR] COMPILATION ERROR :
> [INFO] -------------------------------------------------------------
> [ERROR] <
> https://builds.apache.org/job/HBase-0.98/ws/hbase-server/src/main/java/org/apache/hadoop/hbase/master/HMaster.java>:[913,6]
> cannot find symbol
> symbol  : method startCatalogJanitorChore()
> location: class org.apache.hadoop.hbase.master.HMaster
> [INFO] 1 error
> [INFO] -------------------------------------------------------------
> [INFO]
> ------------------------------------------------------------------------
> [INFO] Reactor Summary:
> [INFO]
> [INFO] HBase ............................................. SUCCESS [2.750s]
> [INFO] HBase - Common .................................... SUCCESS
> [23.591s]
> [INFO] HBase - Protocol .................................. SUCCESS
> [19.985s]
> [INFO] HBase - Client .................................... SUCCESS
> [38.718s]
> [INFO] HBase - Hadoop Compatibility ...................... SUCCESS [5.377s]
> [INFO] HBase - Hadoop Two Compatibility .................. SUCCESS [1.603s]
> [INFO] HBase - Prefix Tree ............................... SUCCESS [3.703s]
> [INFO] HBase - Server .................................... FAILURE [5.729s]
> [INFO] HBase - Testing Util .............................. SKIPPED
> [INFO] HBase - Thrift .................................... SKIPPED
> [INFO] HBase - Shell ..................................... SKIPPED
> [INFO] HBase - Integration Tests ......................... SKIPPED
> [INFO] HBase - Examples .................................. SKIPPED
> [INFO] HBase - Assembly .................................. SKIPPED
> [INFO]
> ------------------------------------------------------------------------
> [INFO] BUILD FAILURE
> [INFO]
> ------------------------------------------------------------------------
> [INFO] Total time: 1:42.232s
> [INFO] Finished at: Wed Aug 27 18:19:00 UTC 2014
> [INFO] Final Memory: 55M/940M
> [INFO]
> ------------------------------------------------------------------------
> [ERROR] Failed to execute goal
> org.apache.maven.plugins:maven-compiler-plugin:2.5.1:compile
> (default-compile) on project hbase-server: Compilation failure
> [ERROR] <
> https://builds.apache.org/job/HBase-0.98/ws/hbase-server/src/main/java/org/apache/hadoop/hbase/master/HMaster.java>:[913,6]
> cannot find symbol
> [ERROR] symbol  : method startCatalogJanitorChore()
> [ERROR] location: class org.apache.hadoop.hbase.master.HMaster
> [ERROR] -> [Help 1]
> [ERROR]
> [ERROR] To see the full stack trace of the errors, re-run Maven with the
> -e switch.
> [ERROR] Re-run Maven using the -X switch to enable full debug logging.
> [ERROR]
> [ERROR] For more information about the errors and possible solutions,
> please read the following articles:
> [ERROR] [Help 1]
> http://cwiki.apache.org/confluence/display/MAVEN/MojoFailureException
> [ERROR]
> [ERROR] After correcting the problems, you can resume the build with the
> command
> [ERROR]   mvn <goals> -rf :hbase-server
> Build step 'Invoke top-level Maven targets' marked build as failure
> Performing Post build task...
> Match found for :.* : True
> Logical operation result is TRUE
> Running script  :   ZOMBIE_TESTS_COUNT=`jps | grep surefirebooter | wc -l`
>   if [[ $ZOMBIE_TESTS_COUNT != 0 ]] ; then
>     #It seems sometimes the tests are not dying immediately. Let's give
> them 10s
>     echo "Suspicious java process found - waiting 10s to see if there are
> just slow to stop"
>     sleep 10
>     ZOMBIE_TESTS_COUNT=`jps | grep surefirebooter | wc -l`
>     if [[ $ZOMBIE_TESTS_COUNT != 0 ]] ; then
>       echo "There are $ZOMBIE_TESTS_COUNT zombie tests, they should have
> been killed by surefire but survived"
>       echo "************ BEGIN zombies jstack extract"
>       ZB_STACK=`jps | grep surefirebooter | cut -d ' ' -f 1 | xargs -n 1
> jstack | grep ".test" | grep "\.java"`
>       jps | grep surefirebooter | cut -d ' ' -f 1 | xargs -n 1 jstack
>       echo "************ END  zombies jstack extract"
>       JIRA_COMMENT="$JIRA_COMMENT
>
>      {color:red}-1 core zombie tests{color}.  There are
> ${ZOMBIE_TESTS_COUNT} zombie test(s): ${ZB_STACK}"
>       BAD=1
>       jps | grep surefirebooter | cut -d ' ' -f 1 | xargs kill -9
>     else
>       echo "We're ok: there is no zombie test, but some tests took some
> time to stop"
>     fi
>   else
>     echo "We're ok: there is no zombie test"
>   fi
> [HBase-0.98] $ /bin/bash -xe /tmp/hudson8534593900804541548.sh
> ++ jps
> ++ wc -l
> ++ grep surefirebooter
> + ZOMBIE_TESTS_COUNT=0
> + [[ 0 != 0 ]]
> + echo 'We'\''re ok: there is no zombie test'
> We're ok: there is no zombie test
> POST BUILD TASK : SUCCESS
> END OF POST BUILD TASK : 0
> Archiving artifacts
> Sending artifact delta relative to HBase-0.98 #477
> Archived 177 artifacts
> Archive block size is 32768
> Received 4 blocks and 578610 bytes
> Compression is 18.5%
> Took 11 sec
> Recording test results
> Updating HBASE-9875
>

Mime
  • Unnamed multipart/alternative (inline, None, 0 bytes)
View raw message