hbase-builds mailing list archives

Site index · List index
Message view « Date » · « Thread »
Top « Date » · « Thread »
From Apache Jenkins Server <jenk...@builds.apache.org>
Subject Build failed in Jenkins: HBase-0.94-security #512
Date Sun, 17 Aug 2014 06:28:42 GMT
See <https://builds.apache.org/job/HBase-0.94-security/512/changes>

Changes:

[larsh] HBASE-11767 [0.94] Unnecessary garbage produced by schema metrics during scanning.

[larsh] forward version to .23-SNAPSHOT

------------------------------------------
[...truncated 53960 lines...]
Running org.apache.hadoop.hbase.procedure.TestZKProcedure
Tests run: 4, Failures: 0, Errors: 0, Skipped: 0, Time elapsed: 1.589 sec
Forking command line: /bin/sh -c cd <https://builds.apache.org/job/HBase-0.94-security/ws/>
&& /home/jenkins/tools/java/jdk1.6.0_45-32/jre/bin/java -enableassertions -Xmx1900m
-Djava.security.egd=file:/dev/./urandom -jar <https://builds.apache.org/job/HBase-0.94-security/ws/target/surefire/surefirebooter6767728926787531574.jar>
<https://builds.apache.org/job/HBase-0.94-security/ws/target/surefire/surefire42401263660326308tmp>
<https://builds.apache.org/job/HBase-0.94-security/ws/target/surefire/surefire_1006273633816807787451tmp>
Running org.apache.hadoop.hbase.io.encoding.TestLoadAndSwitchEncodeOnDisk
Tests run: 1, Failures: 0, Errors: 0, Skipped: 0, Time elapsed: 24.288 sec
Forking command line: /bin/sh -c cd <https://builds.apache.org/job/HBase-0.94-security/ws/>
&& /home/jenkins/tools/java/jdk1.6.0_45-32/jre/bin/java -enableassertions -Xmx1900m
-Djava.security.egd=file:/dev/./urandom -jar <https://builds.apache.org/job/HBase-0.94-security/ws/target/surefire/surefirebooter2318184638991435110.jar>
<https://builds.apache.org/job/HBase-0.94-security/ws/target/surefire/surefire4226435977728688947tmp>
<https://builds.apache.org/job/HBase-0.94-security/ws/target/surefire/surefire_1016180996674619765071tmp>
Running org.apache.hadoop.hbase.mapreduce.TestImportExport
Tests run: 4, Failures: 0, Errors: 0, Skipped: 0, Time elapsed: 102.64 sec
Forking command line: /bin/sh -c cd <https://builds.apache.org/job/HBase-0.94-security/ws/>
&& /home/jenkins/tools/java/jdk1.6.0_45-32/jre/bin/java -enableassertions -Xmx1900m
-Djava.security.egd=file:/dev/./urandom -jar <https://builds.apache.org/job/HBase-0.94-security/ws/target/surefire/surefirebooter8931360108976807707.jar>
<https://builds.apache.org/job/HBase-0.94-security/ws/target/surefire/surefire5547882176205282464tmp>
<https://builds.apache.org/job/HBase-0.94-security/ws/target/surefire/surefire_1028062241209696132619tmp>
Running org.apache.hadoop.hbase.mapreduce.TestHLogRecordReader
Tests run: 2, Failures: 0, Errors: 0, Skipped: 0, Time elapsed: 5.225 sec
Forking command line: /bin/sh -c cd <https://builds.apache.org/job/HBase-0.94-security/ws/>
&& /home/jenkins/tools/java/jdk1.6.0_45-32/jre/bin/java -enableassertions -Xmx1900m
-Djava.security.egd=file:/dev/./urandom -jar <https://builds.apache.org/job/HBase-0.94-security/ws/target/surefire/surefirebooter188859119914186576.jar>
<https://builds.apache.org/job/HBase-0.94-security/ws/target/surefire/surefire5337980469407837312tmp>
<https://builds.apache.org/job/HBase-0.94-security/ws/target/surefire/surefire_1031778519680520567365tmp>
Running org.apache.hadoop.hbase.catalog.TestCatalogTracker
Tests run: 10, Failures: 0, Errors: 0, Skipped: 1, Time elapsed: 8.518 sec
Forking command line: /bin/sh -c cd <https://builds.apache.org/job/HBase-0.94-security/ws/>
&& /home/jenkins/tools/java/jdk1.6.0_45-32/jre/bin/java -enableassertions -Xmx1900m
-Djava.security.egd=file:/dev/./urandom -jar <https://builds.apache.org/job/HBase-0.94-security/ws/target/surefire/surefirebooter117453524289019121.jar>
<https://builds.apache.org/job/HBase-0.94-security/ws/target/surefire/surefire1087487052734632231tmp>
<https://builds.apache.org/job/HBase-0.94-security/ws/target/surefire/surefire_1045259908380422050988tmp>
Running org.apache.hadoop.hbase.mapreduce.TestImportTsv
Tests run: 13, Failures: 0, Errors: 0, Skipped: 0, Time elapsed: 277.415 sec
Forking command line: /bin/sh -c cd <https://builds.apache.org/job/HBase-0.94-security/ws/>
&& /home/jenkins/tools/java/jdk1.6.0_45-32/jre/bin/java -enableassertions -Xmx1900m
-Djava.security.egd=file:/dev/./urandom -jar <https://builds.apache.org/job/HBase-0.94-security/ws/target/surefire/surefirebooter7079832653111230057.jar>
<https://builds.apache.org/job/HBase-0.94-security/ws/target/surefire/surefire3814680145202943768tmp>
<https://builds.apache.org/job/HBase-0.94-security/ws/target/surefire/surefire_1052572179317122726487tmp>
Running org.apache.hadoop.hbase.catalog.TestMetaReaderEditorNoCluster
Tests run: 1, Failures: 0, Errors: 0, Skipped: 0, Time elapsed: 5.161 sec
Forking command line: /bin/sh -c cd <https://builds.apache.org/job/HBase-0.94-security/ws/>
&& /home/jenkins/tools/java/jdk1.6.0_45-32/jre/bin/java -enableassertions -Xmx1900m
-Djava.security.egd=file:/dev/./urandom -jar <https://builds.apache.org/job/HBase-0.94-security/ws/target/surefire/surefirebooter763900529410165839.jar>
<https://builds.apache.org/job/HBase-0.94-security/ws/target/surefire/surefire3026719780589428575tmp>
<https://builds.apache.org/job/HBase-0.94-security/ws/target/surefire/surefire_1064731172429831083424tmp>
Running org.apache.hadoop.hbase.rest.client.TestRemoteTable
Tests run: 9, Failures: 0, Errors: 0, Skipped: 0, Time elapsed: 40.798 sec
Forking command line: /bin/sh -c cd <https://builds.apache.org/job/HBase-0.94-security/ws/>
&& /home/jenkins/tools/java/jdk1.6.0_45-32/jre/bin/java -enableassertions -Xmx1900m
-Djava.security.egd=file:/dev/./urandom -jar <https://builds.apache.org/job/HBase-0.94-security/ws/target/surefire/surefirebooter6019632108797020724.jar>
<https://builds.apache.org/job/HBase-0.94-security/ws/target/surefire/surefire8018289608995191853tmp>
<https://builds.apache.org/job/HBase-0.94-security/ws/target/surefire/surefire_1077606233418204525105tmp>
Running org.apache.hadoop.hbase.rest.client.TestRemoteAdmin
Tests run: 5, Failures: 0, Errors: 0, Skipped: 0, Time elapsed: 17.733 sec
Forking command line: /bin/sh -c cd <https://builds.apache.org/job/HBase-0.94-security/ws/>
&& /home/jenkins/tools/java/jdk1.6.0_45-32/jre/bin/java -enableassertions -Xmx1900m
-Djava.security.egd=file:/dev/./urandom -jar <https://builds.apache.org/job/HBase-0.94-security/ws/target/surefire/surefirebooter316168324720823024.jar>
<https://builds.apache.org/job/HBase-0.94-security/ws/target/surefire/surefire5903231002681498816tmp>
<https://builds.apache.org/job/HBase-0.94-security/ws/target/surefire/surefire_1086030184413739815182tmp>
Running org.apache.hadoop.hbase.rest.TestStatusResource
Tests run: 2, Failures: 0, Errors: 0, Skipped: 0, Time elapsed: 12.484 sec
Forking command line: /bin/sh -c cd <https://builds.apache.org/job/HBase-0.94-security/ws/>
&& /home/jenkins/tools/java/jdk1.6.0_45-32/jre/bin/java -enableassertions -Xmx1900m
-Djava.security.egd=file:/dev/./urandom -jar <https://builds.apache.org/job/HBase-0.94-security/ws/target/surefire/surefirebooter1056609375022001567.jar>
<https://builds.apache.org/job/HBase-0.94-security/ws/target/surefire/surefire3017438971058633025tmp>
<https://builds.apache.org/job/HBase-0.94-security/ws/target/surefire/surefire_1093814350397886035901tmp>
Running org.apache.hadoop.hbase.rest.TestRowResource
Tests run: 12, Failures: 0, Errors: 0, Skipped: 0, Time elapsed: 17.657 sec
Forking command line: /bin/sh -c cd <https://builds.apache.org/job/HBase-0.94-security/ws/>
&& /home/jenkins/tools/java/jdk1.6.0_45-32/jre/bin/java -enableassertions -Xmx1900m
-Djava.security.egd=file:/dev/./urandom -jar <https://builds.apache.org/job/HBase-0.94-security/ws/target/surefire/surefirebooter9031557764536763792.jar>
<https://builds.apache.org/job/HBase-0.94-security/ws/target/surefire/surefire7371096547087989280tmp>
<https://builds.apache.org/job/HBase-0.94-security/ws/target/surefire/surefire_1102720550386405242106tmp>
Running org.apache.hadoop.hbase.rest.TestTableResource
Tests run: 8, Failures: 0, Errors: 0, Skipped: 0, Time elapsed: 27.061 sec
Forking command line: /bin/sh -c cd <https://builds.apache.org/job/HBase-0.94-security/ws/>
&& /home/jenkins/tools/java/jdk1.6.0_45-32/jre/bin/java -enableassertions -Xmx1900m
-Djava.security.egd=file:/dev/./urandom -jar <https://builds.apache.org/job/HBase-0.94-security/ws/target/surefire/surefirebooter9068533017896819795.jar>
<https://builds.apache.org/job/HBase-0.94-security/ws/target/surefire/surefire4443585447428405028tmp>
<https://builds.apache.org/job/HBase-0.94-security/ws/target/surefire/surefire_1113031162841964333858tmp>
Running org.apache.hadoop.hbase.rest.TestVersionResource
Tests run: 7, Failures: 0, Errors: 0, Skipped: 0, Time elapsed: 11.898 sec
Forking command line: /bin/sh -c cd <https://builds.apache.org/job/HBase-0.94-security/ws/>
&& /home/jenkins/tools/java/jdk1.6.0_45-32/jre/bin/java -enableassertions -Xmx1900m
-Djava.security.egd=file:/dev/./urandom -jar <https://builds.apache.org/job/HBase-0.94-security/ws/target/surefire/surefirebooter6774566808328314004.jar>
<https://builds.apache.org/job/HBase-0.94-security/ws/target/surefire/surefire6795628001900759308tmp>
<https://builds.apache.org/job/HBase-0.94-security/ws/target/surefire/surefire_1125374440557671561951tmp>
Running org.apache.hadoop.hbase.rest.TestGZIPResponseWrapper
Tests run: 5, Failures: 0, Errors: 0, Skipped: 0, Time elapsed: 0.239 sec
Forking command line: /bin/sh -c cd <https://builds.apache.org/job/HBase-0.94-security/ws/>
&& /home/jenkins/tools/java/jdk1.6.0_45-32/jre/bin/java -enableassertions -Xmx1900m
-Djava.security.egd=file:/dev/./urandom -jar <https://builds.apache.org/job/HBase-0.94-security/ws/target/surefire/surefirebooter7261375192832757675.jar>
<https://builds.apache.org/job/HBase-0.94-security/ws/target/surefire/surefire5163848353050662433tmp>
<https://builds.apache.org/job/HBase-0.94-security/ws/target/surefire/surefire_1135940499887298392543tmp>
Running org.apache.hadoop.hbase.rest.TestGzipFilter
Tests run: 2, Failures: 0, Errors: 0, Skipped: 0, Time elapsed: 15.36 sec
Forking command line: /bin/sh -c cd <https://builds.apache.org/job/HBase-0.94-security/ws/>
&& /home/jenkins/tools/java/jdk1.6.0_45-32/jre/bin/java -enableassertions -Xmx1900m
-Djava.security.egd=file:/dev/./urandom -jar <https://builds.apache.org/job/HBase-0.94-security/ws/target/surefire/surefirebooter2925038753145224523.jar>
<https://builds.apache.org/job/HBase-0.94-security/ws/target/surefire/surefire6866631314408502499tmp>
<https://builds.apache.org/job/HBase-0.94-security/ws/target/surefire/surefire_1143347212531337947351tmp>
Running org.apache.hadoop.hbase.rest.TestScannerResource
Tests run: 5, Failures: 0, Errors: 0, Skipped: 0, Time elapsed: 37.815 sec
Forking command line: /bin/sh -c cd <https://builds.apache.org/job/HBase-0.94-security/ws/>
&& /home/jenkins/tools/java/jdk1.6.0_45-32/jre/bin/java -enableassertions -Xmx1900m
-Djava.security.egd=file:/dev/./urandom -jar <https://builds.apache.org/job/HBase-0.94-security/ws/target/surefire/surefirebooter4438452143358753043.jar>
<https://builds.apache.org/job/HBase-0.94-security/ws/target/surefire/surefire7045079920326580790tmp>
<https://builds.apache.org/job/HBase-0.94-security/ws/target/surefire/surefire_1158526685422304777702tmp>
Running org.apache.hadoop.hbase.rest.TestScannersWithFilters
Tests run: 10, Failures: 0, Errors: 0, Skipped: 0, Time elapsed: 19.67 sec
Forking command line: /bin/sh -c cd <https://builds.apache.org/job/HBase-0.94-security/ws/>
&& /home/jenkins/tools/java/jdk1.6.0_45-32/jre/bin/java -enableassertions -Xmx1900m
-Djava.security.egd=file:/dev/./urandom -jar <https://builds.apache.org/job/HBase-0.94-security/ws/target/surefire/surefirebooter5282244311590595844.jar>
<https://builds.apache.org/job/HBase-0.94-security/ws/target/surefire/surefire6261229070973639437tmp>
<https://builds.apache.org/job/HBase-0.94-security/ws/target/surefire/surefire_116851636720107028777tmp>
Running org.apache.hadoop.hbase.rest.TestMultiRowResource
Tests run: 3, Failures: 0, Errors: 0, Skipped: 0, Time elapsed: 15.141 sec
Forking command line: /bin/sh -c cd <https://builds.apache.org/job/HBase-0.94-security/ws/>
&& /home/jenkins/tools/java/jdk1.6.0_45-32/jre/bin/java -enableassertions -Xmx1900m
-Djava.security.egd=file:/dev/./urandom -jar <https://builds.apache.org/job/HBase-0.94-security/ws/target/surefire/surefirebooter5841633097299279120.jar>
<https://builds.apache.org/job/HBase-0.94-security/ws/target/surefire/surefire1852092436547230648tmp>
<https://builds.apache.org/job/HBase-0.94-security/ws/target/surefire/surefire_1174662790122683393975tmp>
Running org.apache.hadoop.hbase.rest.TestSchemaResource
Tests run: 2, Failures: 0, Errors: 0, Skipped: 0, Time elapsed: 19.032 sec
Forking command line: /bin/sh -c cd <https://builds.apache.org/job/HBase-0.94-security/ws/>
&& /home/jenkins/tools/java/jdk1.6.0_45-32/jre/bin/java -enableassertions -Xmx1900m
-Djava.security.egd=file:/dev/./urandom -jar <https://builds.apache.org/job/HBase-0.94-security/ws/target/surefire/surefirebooter9189134052638504232.jar>
<https://builds.apache.org/job/HBase-0.94-security/ws/target/surefire/surefire7392790312266329304tmp>
<https://builds.apache.org/job/HBase-0.94-security/ws/target/surefire/surefire_1182686953509166441200tmp>
Running org.apache.hadoop.hbase.monitoring.TestMemoryBoundedLogMessageBuffer
Tests run: 2, Failures: 0, Errors: 0, Skipped: 0, Time elapsed: 0.25 sec
Forking command line: /bin/sh -c cd <https://builds.apache.org/job/HBase-0.94-security/ws/>
&& /home/jenkins/tools/java/jdk1.6.0_45-32/jre/bin/java -enableassertions -Xmx1900m
-Djava.security.egd=file:/dev/./urandom -jar <https://builds.apache.org/job/HBase-0.94-security/ws/target/surefire/surefirebooter2037565784704507075.jar>
<https://builds.apache.org/job/HBase-0.94-security/ws/target/surefire/surefire8521680863886666556tmp>
<https://builds.apache.org/job/HBase-0.94-security/ws/target/surefire/surefire_1193280484967100532678tmp>
Running org.apache.hadoop.hbase.monitoring.TestTaskMonitor
Tests run: 3, Failures: 0, Errors: 0, Skipped: 0, Time elapsed: 0.318 sec
Forking command line: /bin/sh -c cd <https://builds.apache.org/job/HBase-0.94-security/ws/>
&& /home/jenkins/tools/java/jdk1.6.0_45-32/jre/bin/java -enableassertions -Xmx1900m
-Djava.security.egd=file:/dev/./urandom -jar <https://builds.apache.org/job/HBase-0.94-security/ws/target/surefire/surefirebooter2446222312675164874.jar>
<https://builds.apache.org/job/HBase-0.94-security/ws/target/surefire/surefire1337208931408846195tmp>
<https://builds.apache.org/job/HBase-0.94-security/ws/target/surefire/surefire_1203327128148405559356tmp>
Running org.apache.hadoop.hbase.snapshot.TestExportSnapshot
Tests run: 8, Failures: 0, Errors: 0, Skipped: 0, Time elapsed: 99.623 sec
Forking command line: /bin/sh -c cd <https://builds.apache.org/job/HBase-0.94-security/ws/>
&& /home/jenkins/tools/java/jdk1.6.0_45-32/jre/bin/java -enableassertions -Xmx1900m
-Djava.security.egd=file:/dev/./urandom -jar <https://builds.apache.org/job/HBase-0.94-security/ws/target/surefire/surefirebooter341668299154073688.jar>
<https://builds.apache.org/job/HBase-0.94-security/ws/target/surefire/surefire4807866389027082851tmp>
<https://builds.apache.org/job/HBase-0.94-security/ws/target/surefire/surefire_1211312403962367082156tmp>
Running org.apache.hadoop.hbase.snapshot.TestSnapshotDescriptionUtils
Tests run: 2, Failures: 0, Errors: 0, Skipped: 0, Time elapsed: 0.519 sec
Forking command line: /bin/sh -c cd <https://builds.apache.org/job/HBase-0.94-security/ws/>
&& /home/jenkins/tools/java/jdk1.6.0_45-32/jre/bin/java -enableassertions -Xmx1900m
-Djava.security.egd=file:/dev/./urandom -jar <https://builds.apache.org/job/HBase-0.94-security/ws/target/surefire/surefirebooter5643089271159056008.jar>
<https://builds.apache.org/job/HBase-0.94-security/ws/target/surefire/surefire4154270503208430410tmp>
<https://builds.apache.org/job/HBase-0.94-security/ws/target/surefire/surefire_122647550856670609479tmp>
Running org.apache.hadoop.hbase.TestAcidGuarantees
Tests run: 3, Failures: 0, Errors: 0, Skipped: 0, Time elapsed: 95.043 sec
Forking command line: /bin/sh -c cd <https://builds.apache.org/job/HBase-0.94-security/ws/>
&& /home/jenkins/tools/java/jdk1.6.0_45-32/jre/bin/java -enableassertions -Xmx1900m
-Djava.security.egd=file:/dev/./urandom -jar <https://builds.apache.org/job/HBase-0.94-security/ws/target/surefire/surefirebooter3828178159061142510.jar>
<https://builds.apache.org/job/HBase-0.94-security/ws/target/surefire/surefire7232485187749334853tmp>
<https://builds.apache.org/job/HBase-0.94-security/ws/target/surefire/surefire_1235703058493120829828tmp>
Running org.apache.hadoop.hbase.TestGlobalMemStoreSize
Tests run: 1, Failures: 0, Errors: 0, Skipped: 0, Time elapsed: 17.208 sec
Forking command line: /bin/sh -c cd <https://builds.apache.org/job/HBase-0.94-security/ws/>
&& /home/jenkins/tools/java/jdk1.6.0_45-32/jre/bin/java -enableassertions -Xmx1900m
-Djava.security.egd=file:/dev/./urandom -jar <https://builds.apache.org/job/HBase-0.94-security/ws/target/surefire/surefirebooter6663107906538753629.jar>
<https://builds.apache.org/job/HBase-0.94-security/ws/target/surefire/surefire7031467505098494025tmp>
<https://builds.apache.org/job/HBase-0.94-security/ws/target/surefire/surefire_1246605338018405271936tmp>
Running org.apache.hadoop.hbase.TestLocalHBaseCluster
Tests run: 1, Failures: 0, Errors: 0, Skipped: 0, Time elapsed: 9.333 sec
Forking command line: /bin/sh -c cd <https://builds.apache.org/job/HBase-0.94-security/ws/>
&& /home/jenkins/tools/java/jdk1.6.0_45-32/jre/bin/java -enableassertions -Xmx1900m
-Djava.security.egd=file:/dev/./urandom -jar <https://builds.apache.org/job/HBase-0.94-security/ws/target/surefire/surefirebooter598836577156320277.jar>
<https://builds.apache.org/job/HBase-0.94-security/ws/target/surefire/surefire2523435093752133806tmp>
<https://builds.apache.org/job/HBase-0.94-security/ws/target/surefire/surefire_1257597838028905898929tmp>
Running org.apache.hadoop.hbase.TestHBaseFileSystem
Tests run: 2, Failures: 0, Errors: 0, Skipped: 0, Time elapsed: 20.414 sec
Forking command line: /bin/sh -c cd <https://builds.apache.org/job/HBase-0.94-security/ws/>
&& /home/jenkins/tools/java/jdk1.6.0_45-32/jre/bin/java -enableassertions -Xmx1900m
-Djava.security.egd=file:/dev/./urandom -jar <https://builds.apache.org/job/HBase-0.94-security/ws/target/surefire/surefirebooter2991720905380721605.jar>
<https://builds.apache.org/job/HBase-0.94-security/ws/target/surefire/surefire9022998457880014237tmp>
<https://builds.apache.org/job/HBase-0.94-security/ws/target/surefire/surefire_1263115124793836940294tmp>
Running org.apache.hadoop.hbase.master.TestDefaultLoadBalancer
Tests run: 4, Failures: 0, Errors: 0, Skipped: 0, Time elapsed: 1.438 sec
Forking command line: /bin/sh -c cd <https://builds.apache.org/job/HBase-0.94-security/ws/>
&& /home/jenkins/tools/java/jdk1.6.0_45-32/jre/bin/java -enableassertions -Xmx1900m
-Djava.security.egd=file:/dev/./urandom -jar <https://builds.apache.org/job/HBase-0.94-security/ws/target/surefire/surefirebooter2433467726254734227.jar>
<https://builds.apache.org/job/HBase-0.94-security/ws/target/surefire/surefire7245575141465425188tmp>
<https://builds.apache.org/job/HBase-0.94-security/ws/target/surefire/surefire_1271590282017372283084tmp>
Running org.apache.hadoop.hbase.master.TestMXBean
Tests run: 1, Failures: 0, Errors: 0, Skipped: 0, Time elapsed: 14.337 sec
Forking command line: /bin/sh -c cd <https://builds.apache.org/job/HBase-0.94-security/ws/>
&& /home/jenkins/tools/java/jdk1.6.0_45-32/jre/bin/java -enableassertions -Xmx1900m
-Djava.security.egd=file:/dev/./urandom -jar <https://builds.apache.org/job/HBase-0.94-security/ws/target/surefire/surefirebooter7359536416967481159.jar>
<https://builds.apache.org/job/HBase-0.94-security/ws/target/surefire/surefire1305185657360588781tmp>
<https://builds.apache.org/job/HBase-0.94-security/ws/target/surefire/surefire_1287294635602451746095tmp>
Running org.apache.hadoop.hbase.master.TestActiveMasterManager
Tests run: 2, Failures: 0, Errors: 0, Skipped: 0, Time elapsed: 0.938 sec
Forking command line: /bin/sh -c cd <https://builds.apache.org/job/HBase-0.94-security/ws/>
&& /home/jenkins/tools/java/jdk1.6.0_45-32/jre/bin/java -enableassertions -Xmx1900m
-Djava.security.egd=file:/dev/./urandom -jar <https://builds.apache.org/job/HBase-0.94-security/ws/target/surefire/surefirebooter5296879668845083822.jar>
<https://builds.apache.org/job/HBase-0.94-security/ws/target/surefire/surefire7648858744511367869tmp>
<https://builds.apache.org/job/HBase-0.94-security/ws/target/surefire/surefire_129976750240528324058tmp>
Running org.apache.hadoop.hbase.master.TestSplitLogManager
Tests run: 12, Failures: 0, Errors: 0, Skipped: 0, Time elapsed: 80.639 sec
Forking command line: /bin/sh -c cd <https://builds.apache.org/job/HBase-0.94-security/ws/>
&& /home/jenkins/tools/java/jdk1.6.0_45-32/jre/bin/java -enableassertions -Xmx1900m
-Djava.security.egd=file:/dev/./urandom -jar <https://builds.apache.org/job/HBase-0.94-security/ws/target/surefire/surefirebooter2341880843336049181.jar>
<https://builds.apache.org/job/HBase-0.94-security/ws/target/surefire/surefire3760794687596143646tmp>
<https://builds.apache.org/job/HBase-0.94-security/ws/target/surefire/surefire_1301103234329285586489tmp>
Running org.apache.hadoop.hbase.master.metrics.TestMasterStatistics
Tests run: 2, Failures: 0, Errors: 0, Skipped: 0, Time elapsed: 1.179 sec
Forking command line: /bin/sh -c cd <https://builds.apache.org/job/HBase-0.94-security/ws/>
&& /home/jenkins/tools/java/jdk1.6.0_45-32/jre/bin/java -enableassertions -Xmx1900m
-Djava.security.egd=file:/dev/./urandom -jar <https://builds.apache.org/job/HBase-0.94-security/ws/target/surefire/surefirebooter739094655670520190.jar>
<https://builds.apache.org/job/HBase-0.94-security/ws/target/surefire/surefire7413623257142425661tmp>
<https://builds.apache.org/job/HBase-0.94-security/ws/target/surefire/surefire_1316332018890839107622tmp>
Running org.apache.hadoop.hbase.master.TestMasterFileSystem
Tests run: 1, Failures: 0, Errors: 0, Skipped: 0, Time elapsed: 11.647 sec
Forking command line: /bin/sh -c cd <https://builds.apache.org/job/HBase-0.94-security/ws/>
&& /home/jenkins/tools/java/jdk1.6.0_45-32/jre/bin/java -enableassertions -Xmx1900m
-Djava.security.egd=file:/dev/./urandom -jar <https://builds.apache.org/job/HBase-0.94-security/ws/target/surefire/surefirebooter6044694721891758865.jar>
<https://builds.apache.org/job/HBase-0.94-security/ws/target/surefire/surefire693750167802626345tmp>
<https://builds.apache.org/job/HBase-0.94-security/ws/target/surefire/surefire_1325733242739193258911tmp>
Running org.apache.hadoop.hbase.master.TestDeadServer
Tests run: 1, Failures: 0, Errors: 0, Skipped: 0, Time elapsed: 0.212 sec
Forking command line: /bin/sh -c cd <https://builds.apache.org/job/HBase-0.94-security/ws/>
&& /home/jenkins/tools/java/jdk1.6.0_45-32/jre/bin/java -enableassertions -Xmx1900m
-Djava.security.egd=file:/dev/./urandom -jar <https://builds.apache.org/job/HBase-0.94-security/ws/target/surefire/surefirebooter1862547207302129551.jar>
<https://builds.apache.org/job/HBase-0.94-security/ws/target/surefire/surefire1197005066264183809tmp>
<https://builds.apache.org/job/HBase-0.94-security/ws/target/surefire/surefire_1339217898332038700333tmp>
Running org.apache.hadoop.hbase.master.TestZKBasedOpenCloseRegion
Tests run: 3, Failures: 0, Errors: 0, Skipped: 0, Time elapsed: 23.486 sec
Forking command line: /bin/sh -c cd <https://builds.apache.org/job/HBase-0.94-security/ws/>
&& /home/jenkins/tools/java/jdk1.6.0_45-32/jre/bin/java -enableassertions -Xmx1900m
-Djava.security.egd=file:/dev/./urandom -jar <https://builds.apache.org/job/HBase-0.94-security/ws/target/surefire/surefirebooter6683184789416582426.jar>
<https://builds.apache.org/job/HBase-0.94-security/ws/target/surefire/surefire3781301078678752081tmp>
<https://builds.apache.org/job/HBase-0.94-security/ws/target/surefire/surefire_134679801063731511233tmp>
Running org.apache.hadoop.hbase.master.TestMasterZKSessionRecovery
Tests run: 2, Failures: 0, Errors: 0, Skipped: 0, Time elapsed: 32.43 sec
Forking command line: /bin/sh -c cd <https://builds.apache.org/job/HBase-0.94-security/ws/>
&& /home/jenkins/tools/java/jdk1.6.0_45-32/jre/bin/java -enableassertions -Xmx1900m
-Djava.security.egd=file:/dev/./urandom -jar <https://builds.apache.org/job/HBase-0.94-security/ws/target/surefire/surefirebooter5380384122444854746.jar>
<https://builds.apache.org/job/HBase-0.94-security/ws/target/surefire/surefire4158127412469342115tmp>
<https://builds.apache.org/job/HBase-0.94-security/ws/target/surefire/surefire_1358283570264928943105tmp>
Running org.apache.hadoop.hbase.master.TestMasterStatusServlet
Tests run: 5, Failures: 0, Errors: 0, Skipped: 0, Time elapsed: 1.074 sec
Forking command line: /bin/sh -c cd <https://builds.apache.org/job/HBase-0.94-security/ws/>
&& /home/jenkins/tools/java/jdk1.6.0_45-32/jre/bin/java -enableassertions -Xmx1900m
-Djava.security.egd=file:/dev/./urandom -jar <https://builds.apache.org/job/HBase-0.94-security/ws/target/surefire/surefirebooter5943968080599637853.jar>
<https://builds.apache.org/job/HBase-0.94-security/ws/target/surefire/surefire161264478596542691tmp>
<https://builds.apache.org/job/HBase-0.94-security/ws/target/surefire/surefire_1362475906014462982297tmp>
Running org.apache.hadoop.hbase.master.handler.TestCreateTableHandler
Tests run: 3, Failures: 0, Errors: 0, Skipped: 0, Time elapsed: 33.969 sec
Forking command line: /bin/sh -c cd <https://builds.apache.org/job/HBase-0.94-security/ws/>
&& /home/jenkins/tools/java/jdk1.6.0_45-32/jre/bin/java -enableassertions -Xmx1900m
-Djava.security.egd=file:/dev/./urandom -jar <https://builds.apache.org/job/HBase-0.94-security/ws/target/surefire/surefirebooter7787517019494337485.jar>
<https://builds.apache.org/job/HBase-0.94-security/ws/target/surefire/surefire5327228068235690555tmp>
<https://builds.apache.org/job/HBase-0.94-security/ws/target/surefire/surefire_1372116847994015496862tmp>
Running org.apache.hadoop.hbase.master.TestMaster
Tests run: 2, Failures: 0, Errors: 0, Skipped: 0, Time elapsed: 15.789 sec
Forking command line: /bin/sh -c cd <https://builds.apache.org/job/HBase-0.94-security/ws/>
&& /home/jenkins/tools/java/jdk1.6.0_45-32/jre/bin/java -enableassertions -Xmx1900m
-Djava.security.egd=file:/dev/./urandom -jar <https://builds.apache.org/job/HBase-0.94-security/ws/target/surefire/surefirebooter6752814462269093389.jar>
<https://builds.apache.org/job/HBase-0.94-security/ws/target/surefire/surefire1698543907548015557tmp>
<https://builds.apache.org/job/HBase-0.94-security/ws/target/surefire/surefire_1382887655422996286130tmp>
Running org.apache.hadoop.hbase.master.TestClockSkewDetection
Tests run: 1, Failures: 0, Errors: 0, Skipped: 0, Time elapsed: 0.315 sec
Forking command line: /bin/sh -c cd <https://builds.apache.org/job/HBase-0.94-security/ws/>
&& /home/jenkins/tools/java/jdk1.6.0_45-32/jre/bin/java -enableassertions -Xmx1900m
-Djava.security.egd=file:/dev/./urandom -jar <https://builds.apache.org/job/HBase-0.94-security/ws/target/surefire/surefirebooter8216741122754172754.jar>
<https://builds.apache.org/job/HBase-0.94-security/ws/target/surefire/surefire1558780530433499843tmp>
<https://builds.apache.org/job/HBase-0.94-security/ws/target/surefire/surefire_1397983984554460978928tmp>
Running org.apache.hadoop.hbase.master.snapshot.TestSnapshotFileCache
Tests run: 6, Failures: 0, Errors: 0, Skipped: 0, Time elapsed: 3.671 sec
Forking command line: /bin/sh -c cd <https://builds.apache.org/job/HBase-0.94-security/ws/>
&& /home/jenkins/tools/java/jdk1.6.0_45-32/jre/bin/java -enableassertions -Xmx1900m
-Djava.security.egd=file:/dev/./urandom -jar <https://builds.apache.org/job/HBase-0.94-security/ws/target/surefire/surefirebooter11510160434295433.jar>
<https://builds.apache.org/job/HBase-0.94-security/ws/target/surefire/surefire3741907674504689344tmp>
<https://builds.apache.org/job/HBase-0.94-security/ws/target/surefire/surefire_1403915808257471223768tmp>
Running org.apache.hadoop.hbase.master.TestAssignmentManager
Tests run: 15, Failures: 0, Errors: 0, Skipped: 0, Time elapsed: 3.244 sec
Forking command line: /bin/sh -c cd <https://builds.apache.org/job/HBase-0.94-security/ws/>
&& /home/jenkins/tools/java/jdk1.6.0_45-32/jre/bin/java -enableassertions -Xmx1900m
-Djava.security.egd=file:/dev/./urandom -jar <https://builds.apache.org/job/HBase-0.94-security/ws/target/surefire/surefirebooter3053394301392417324.jar>
<https://builds.apache.org/job/HBase-0.94-security/ws/target/surefire/surefire7181422090255363390tmp>
<https://builds.apache.org/job/HBase-0.94-security/ws/target/surefire/surefire_141943079375268401527tmp>
Running org.apache.hadoop.hbase.master.cleaner.TestLogsCleaner
Tests run: 1, Failures: 0, Errors: 0, Skipped: 0, Time elapsed: 2.978 sec
Forking command line: /bin/sh -c cd <https://builds.apache.org/job/HBase-0.94-security/ws/>
&& /home/jenkins/tools/java/jdk1.6.0_45-32/jre/bin/java -enableassertions -Xmx1900m
-Djava.security.egd=file:/dev/./urandom -jar <https://builds.apache.org/job/HBase-0.94-security/ws/target/surefire/surefirebooter2772660822920613420.jar>
<https://builds.apache.org/job/HBase-0.94-security/ws/target/surefire/surefire1704277239552051519tmp>
<https://builds.apache.org/job/HBase-0.94-security/ws/target/surefire/surefire_1424931120287324901308tmp>
Forking command line: /bin/sh -c cd <https://builds.apache.org/job/HBase-0.94-security/ws/>
&& /home/jenkins/tools/java/jdk1.6.0_45-32/jre/bin/java -enableassertions -Xmx1900m
-Djava.security.egd=file:/dev/./urandom -jar <https://builds.apache.org/job/HBase-0.94-security/ws/target/surefire/surefirebooter4963099130813643036.jar>
<https://builds.apache.org/job/HBase-0.94-security/ws/target/surefire/surefire1352585154822517736tmp>
<https://builds.apache.org/job/HBase-0.94-security/ws/target/surefire/surefire_1435775920061177989733tmp>
Running org.apache.hadoop.hbase.master.cleaner.TestHFileCleaner
Tests run: 3, Failures: 0, Errors: 0, Skipped: 0, Time elapsed: 3.643 sec
Forking command line: /bin/sh -c cd <https://builds.apache.org/job/HBase-0.94-security/ws/>
&& /home/jenkins/tools/java/jdk1.6.0_45-32/jre/bin/java -enableassertions -Xmx1900m
-Djava.security.egd=file:/dev/./urandom -jar <https://builds.apache.org/job/HBase-0.94-security/ws/target/surefire/surefirebooter219511784971622547.jar>
<https://builds.apache.org/job/HBase-0.94-security/ws/target/surefire/surefire8289741904403860834tmp>
<https://builds.apache.org/job/HBase-0.94-security/ws/target/surefire/surefire_1446800038942417949602tmp>
Running org.apache.hadoop.hbase.master.TestHMasterRPCException
Tests run: 1, Failures: 0, Errors: 0, Skipped: 0, Time elapsed: 1.394 sec
Forking command line: /bin/sh -c cd <https://builds.apache.org/job/HBase-0.94-security/ws/>
&& /home/jenkins/tools/java/jdk1.6.0_45-32/jre/bin/java -enableassertions -Xmx1900m
-Djava.security.egd=file:/dev/./urandom -jar <https://builds.apache.org/job/HBase-0.94-security/ws/target/surefire/surefirebooter3362285165445519442.jar>
<https://builds.apache.org/job/HBase-0.94-security/ws/target/surefire/surefire8545801235610213077tmp>
<https://builds.apache.org/job/HBase-0.94-security/ws/target/surefire/surefire_145737364567272267883tmp>
Running org.apache.hadoop.hbase.master.cleaner.TestSnapshotFromMaster
Tests run: 4, Failures: 0, Errors: 0, Skipped: 0, Time elapsed: 30.267 sec
Forking command line: /bin/sh -c cd <https://builds.apache.org/job/HBase-0.94-security/ws/>
&& /home/jenkins/tools/java/jdk1.6.0_45-32/jre/bin/java -enableassertions -Xmx1900m
-Djava.security.egd=file:/dev/./urandom -jar <https://builds.apache.org/job/HBase-0.94-security/ws/target/surefire/surefirebooter8652407737199810851.jar>
<https://builds.apache.org/job/HBase-0.94-security/ws/target/surefire/surefire2831474751073586503tmp>
<https://builds.apache.org/job/HBase-0.94-security/ws/target/surefire/surefire_1466649556494274306413tmp>
Running org.apache.hadoop.hbase.master.TestOpenedRegionHandler
Tests run: 2, Failures: 0, Errors: 0, Skipped: 0, Time elapsed: 15.24 sec
Forking command line: /bin/sh -c cd <https://builds.apache.org/job/HBase-0.94-security/ws/>
&& /home/jenkins/tools/java/jdk1.6.0_45-32/jre/bin/java -enableassertions -Xmx1900m
-Djava.security.egd=file:/dev/./urandom -jar <https://builds.apache.org/job/HBase-0.94-security/ws/target/surefire/surefirebooter4974579984661597306.jar>
<https://builds.apache.org/job/HBase-0.94-security/ws/target/surefire/surefire7126977891321746476tmp>
<https://builds.apache.org/job/HBase-0.94-security/ws/target/surefire/surefire_147907576305057765822tmp>
Running org.apache.hadoop.hbase.util.TestEnvironmentEdgeManager
Tests run: 2, Failures: 0, Errors: 0, Skipped: 0, Time elapsed: 0.391 sec
Forking command line: /bin/sh -c cd <https://builds.apache.org/job/HBase-0.94-security/ws/>
&& /home/jenkins/tools/java/jdk1.6.0_45-32/jre/bin/java -enableassertions -Xmx1900m
-Djava.security.egd=file:/dev/./urandom -jar <https://builds.apache.org/job/HBase-0.94-security/ws/target/surefire/surefirebooter6393528353778942538.jar>
<https://builds.apache.org/job/HBase-0.94-security/ws/target/surefire/surefire8967423474119026890tmp>
<https://builds.apache.org/job/HBase-0.94-security/ws/target/surefire/surefire_1489023569256742309455tmp>
Running org.apache.hadoop.hbase.util.TestFSHDFSUtils
Tests run: 3, Failures: 0, Errors: 0, Skipped: 0, Time elapsed: 3.721 sec
Forking command line: /bin/sh -c cd <https://builds.apache.org/job/HBase-0.94-security/ws/>
&& /home/jenkins/tools/java/jdk1.6.0_45-32/jre/bin/java -enableassertions -Xmx1900m
-Djava.security.egd=file:/dev/./urandom -jar <https://builds.apache.org/job/HBase-0.94-security/ws/target/surefire/surefirebooter2655590430223418668.jar>
<https://builds.apache.org/job/HBase-0.94-security/ws/target/surefire/surefire6409777463142721963tmp>
<https://builds.apache.org/job/HBase-0.94-security/ws/target/surefire/surefire_1496968707397155061044tmp>
Running org.apache.hadoop.hbase.util.TestFSVisitor
Tests run: 3, Failures: 0, Errors: 0, Skipped: 0, Time elapsed: 1.55 sec
Forking command line: /bin/sh -c cd <https://builds.apache.org/job/HBase-0.94-security/ws/>
&& /home/jenkins/tools/java/jdk1.6.0_45-32/jre/bin/java -enableassertions -Xmx1900m
-Djava.security.egd=file:/dev/./urandom -jar <https://builds.apache.org/job/HBase-0.94-security/ws/target/surefire/surefirebooter5332326373882168886.jar>
<https://builds.apache.org/job/HBase-0.94-security/ws/target/surefire/surefire3875969118298766284tmp>
<https://builds.apache.org/job/HBase-0.94-security/ws/target/surefire/surefire_1504348151126127998440tmp>
Running org.apache.hadoop.hbase.util.TestRegionSplitter
Tests run: 5, Failures: 0, Errors: 0, Skipped: 0, Time elapsed: 16.729 sec
Forking command line: /bin/sh -c cd <https://builds.apache.org/job/HBase-0.94-security/ws/>
&& /home/jenkins/tools/java/jdk1.6.0_45-32/jre/bin/java -enableassertions -Xmx1900m
-Djava.security.egd=file:/dev/./urandom -jar <https://builds.apache.org/job/HBase-0.94-security/ws/target/surefire/surefirebooter5537796776137342723.jar>
<https://builds.apache.org/job/HBase-0.94-security/ws/target/surefire/surefire211975770175019211tmp>
<https://builds.apache.org/job/HBase-0.94-security/ws/target/surefire/surefire_1516080003023978973448tmp>
Running org.apache.hadoop.hbase.util.hbck.TestOfflineMetaRebuildHole
Tests run: 1, Failures: 0, Errors: 0, Skipped: 0, Time elapsed: 26.057 sec
Forking command line: /bin/sh -c cd <https://builds.apache.org/job/HBase-0.94-security/ws/>
&& /home/jenkins/tools/java/jdk1.6.0_45-32/jre/bin/java -enableassertions -Xmx1900m
-Djava.security.egd=file:/dev/./urandom -jar <https://builds.apache.org/job/HBase-0.94-security/ws/target/surefire/surefirebooter5697790331758356738.jar>
<https://builds.apache.org/job/HBase-0.94-security/ws/target/surefire/surefire8115407003730556503tmp>
<https://builds.apache.org/job/HBase-0.94-security/ws/target/surefire/surefire_1527591125223059690225tmp>
Running org.apache.hadoop.hbase.util.hbck.TestOfflineMetaRebuildOverlap
Tests run: 1, Failures: 0, Errors: 0, Skipped: 0, Time elapsed: 27.076 sec
Forking command line: /bin/sh -c cd <https://builds.apache.org/job/HBase-0.94-security/ws/>
&& /home/jenkins/tools/java/jdk1.6.0_45-32/jre/bin/java -enableassertions -Xmx1900m
-Djava.security.egd=file:/dev/./urandom -jar <https://builds.apache.org/job/HBase-0.94-security/ws/target/surefire/surefirebooter1748766687050627774.jar>
<https://builds.apache.org/job/HBase-0.94-security/ws/target/surefire/surefire2721078308319309463tmp>
<https://builds.apache.org/job/HBase-0.94-security/ws/target/surefire/surefire_1534753983535687183774tmp>
Running org.apache.hadoop.hbase.util.TestFSTableDescriptors
Tests run: 11, Failures: 0, Errors: 0, Skipped: 0, Time elapsed: 0.997 sec
Forking command line: /bin/sh -c cd <https://builds.apache.org/job/HBase-0.94-security/ws/>
&& /home/jenkins/tools/java/jdk1.6.0_45-32/jre/bin/java -enableassertions -Xmx1900m
-Djava.security.egd=file:/dev/./urandom -jar <https://builds.apache.org/job/HBase-0.94-security/ws/target/surefire/surefirebooter971417862370872077.jar>
<https://builds.apache.org/job/HBase-0.94-security/ws/target/surefire/surefire3690102328565676439tmp>
<https://builds.apache.org/job/HBase-0.94-security/ws/target/surefire/surefire_154159582786969028644tmp>
Running org.apache.hadoop.hbase.util.TestDefaultEnvironmentEdge
Tests run: 1, Failures: 0, Errors: 0, Skipped: 0, Time elapsed: 0.214 sec
Forking command line: /bin/sh -c cd <https://builds.apache.org/job/HBase-0.94-security/ws/>
&& /home/jenkins/tools/java/jdk1.6.0_45-32/jre/bin/java -enableassertions -Xmx1900m
-Djava.security.egd=file:/dev/./urandom -jar <https://builds.apache.org/job/HBase-0.94-security/ws/target/surefire/surefirebooter7797876677649209932.jar>
<https://builds.apache.org/job/HBase-0.94-security/ws/target/surefire/surefire239503119701264175tmp>
<https://builds.apache.org/job/HBase-0.94-security/ws/target/surefire/surefire_155711919531365244154tmp>
Running org.apache.hadoop.hbase.util.TestIdLock
Tests run: 1, Failures: 0, Errors: 0, Skipped: 0, Time elapsed: 15.402 sec
Forking command line: /bin/sh -c cd <https://builds.apache.org/job/HBase-0.94-security/ws/>
&& /home/jenkins/tools/java/jdk1.6.0_45-32/jre/bin/java -enableassertions -Xmx1900m
-Djava.security.egd=file:/dev/./urandom -jar <https://builds.apache.org/job/HBase-0.94-security/ws/target/surefire/surefirebooter8476254949355854505.jar>
<https://builds.apache.org/job/HBase-0.94-security/ws/target/surefire/surefire5782631554042786286tmp>
<https://builds.apache.org/job/HBase-0.94-security/ws/target/surefire/surefire_1562780676076601918027tmp>
Running org.apache.hadoop.hbase.util.hbck.TestOfflineMetaRebuildBase
Tests run: 1, Failures: 0, Errors: 0, Skipped: 0, Time elapsed: 27.939 sec
Forking command line: /bin/sh -c cd <https://builds.apache.org/job/HBase-0.94-security/ws/>
&& /home/jenkins/tools/java/jdk1.6.0_45-32/jre/bin/java -enableassertions -Xmx1900m
-Djava.security.egd=file:/dev/./urandom -jar <https://builds.apache.org/job/HBase-0.94-security/ws/target/surefire/surefirebooter1003290746196700941.jar>
<https://builds.apache.org/job/HBase-0.94-security/ws/target/surefire/surefire6135537741890096483tmp>
<https://builds.apache.org/job/HBase-0.94-security/ws/target/surefire/surefire_157509740027776634489tmp>
Running org.apache.hadoop.hbase.util.TestCoprocessorScanPolicy
Tests run: 2, Failures: 0, Errors: 0, Skipped: 0, Time elapsed: 15.563 sec
Forking command line: /bin/sh -c cd <https://builds.apache.org/job/HBase-0.94-security/ws/>
&& /home/jenkins/tools/java/jdk1.6.0_45-32/jre/bin/java -enableassertions -Xmx1900m
-Djava.security.egd=file:/dev/./urandom -jar <https://builds.apache.org/job/HBase-0.94-security/ws/target/surefire/surefirebooter2957795438288799209.jar>
<https://builds.apache.org/job/HBase-0.94-security/ws/target/surefire/surefire2425550405903578846tmp>
<https://builds.apache.org/job/HBase-0.94-security/ws/target/surefire/surefire_1585090087795162963609tmp>
Running org.apache.hadoop.hbase.util.TestPoolMap$TestRoundRobinPoolType
Tests run: 3, Failures: 0, Errors: 0, Skipped: 0, Time elapsed: 0.012 sec
Running org.apache.hadoop.hbase.util.TestPoolMap$TestThreadLocalPoolType
Tests run: 3, Failures: 0, Errors: 0, Skipped: 0, Time elapsed: 0.008 sec
Running org.apache.hadoop.hbase.util.TestPoolMap$TestReusablePoolType
Tests run: 3, Failures: 0, Errors: 0, Skipped: 0, Time elapsed: 0.04 sec
Forking command line: /bin/sh -c cd <https://builds.apache.org/job/HBase-0.94-security/ws/>
&& /home/jenkins/tools/java/jdk1.6.0_45-32/jre/bin/java -enableassertions -Xmx1900m
-Djava.security.egd=file:/dev/./urandom -jar <https://builds.apache.org/job/HBase-0.94-security/ws/target/surefire/surefirebooter4444890589578980625.jar>
<https://builds.apache.org/job/HBase-0.94-security/ws/target/surefire/surefire2878090645590946023tmp>
<https://builds.apache.org/job/HBase-0.94-security/ws/target/surefire/surefire_1598298228186746800755tmp>
Running org.apache.hadoop.hbase.util.TestFSUtils
Tests run: 4, Failures: 0, Errors: 0, Skipped: 0, Time elapsed: 19.953 sec
Forking command line: /bin/sh -c cd <https://builds.apache.org/job/HBase-0.94-security/ws/>
&& /home/jenkins/tools/java/jdk1.6.0_45-32/jre/bin/java -enableassertions -Xmx1900m
-Djava.security.egd=file:/dev/./urandom -jar <https://builds.apache.org/job/HBase-0.94-security/ws/target/surefire/surefirebooter7299316443230231142.jar>
<https://builds.apache.org/job/HBase-0.94-security/ws/target/surefire/surefire4473713658615680177tmp>
<https://builds.apache.org/job/HBase-0.94-security/ws/target/surefire/surefire_1605483648766338807791tmp>
Running org.apache.hadoop.hbase.util.TestMergeTable
Tests run: 1, Failures: 0, Errors: 0, Skipped: 0, Time elapsed: 23.865 sec
Running org.apache.hadoop.hbase.util.TestSizeBasedThrottler
Tests run: 3, Failures: 0, Errors: 0, Skipped: 0, Time elapsed: 43.912 sec

Results :

Tests run: 921, Failures: 0, Errors: 0, Skipped: 2

[INFO] ------------------------------------------------------------------------
[INFO] BUILD FAILURE
[INFO] ------------------------------------------------------------------------
[INFO] Total time: 45:45.942s
[INFO] Finished at: Sun Aug 17 06:27:06 UTC 2014
[INFO] Final Memory: 71M/1008M
[INFO] ------------------------------------------------------------------------
[ERROR] Failed to execute goal org.apache.maven.plugins:maven-surefire-plugin:2.12-TRUNK-HBASE-2:test
(secondPartTestsExecution) on project hbase: Failure or timeout -> [Help 1]
org.apache.maven.lifecycle.LifecycleExecutionException: Failed to execute goal org.apache.maven.plugins:maven-surefire-plugin:2.12-TRUNK-HBASE-2:test
(secondPartTestsExecution) on project hbase: Failure or timeout
	at org.apache.maven.lifecycle.internal.MojoExecutor.execute(MojoExecutor.java:217)
	at org.apache.maven.lifecycle.internal.MojoExecutor.execute(MojoExecutor.java:153)
	at org.apache.maven.lifecycle.internal.MojoExecutor.execute(MojoExecutor.java:145)
	at org.apache.maven.lifecycle.internal.MojoExecutor.executeForkedExecutions(MojoExecutor.java:365)
	at org.apache.maven.lifecycle.internal.MojoExecutor.execute(MojoExecutor.java:199)
	at org.apache.maven.lifecycle.internal.MojoExecutor.execute(MojoExecutor.java:153)
	at org.apache.maven.lifecycle.internal.MojoExecutor.execute(MojoExecutor.java:145)
	at org.apache.maven.lifecycle.internal.LifecycleModuleBuilder.buildProject(LifecycleModuleBuilder.java:84)
	at org.apache.maven.lifecycle.internal.LifecycleModuleBuilder.buildProject(LifecycleModuleBuilder.java:59)
	at org.apache.maven.lifecycle.internal.LifecycleStarter.singleThreadedBuild(LifecycleStarter.java:183)
	at org.apache.maven.lifecycle.internal.LifecycleStarter.execute(LifecycleStarter.java:161)
	at org.apache.maven.DefaultMaven.doExecute(DefaultMaven.java:320)
	at org.apache.maven.DefaultMaven.execute(DefaultMaven.java:156)
	at org.apache.maven.cli.MavenCli.execute(MavenCli.java:537)
	at org.apache.maven.cli.MavenCli.doMain(MavenCli.java:196)
	at org.apache.maven.cli.MavenCli.main(MavenCli.java:141)
	at sun.reflect.NativeMethodAccessorImpl.invoke0(Native Method)
	at sun.reflect.NativeMethodAccessorImpl.invoke(NativeMethodAccessorImpl.java:39)
	at sun.reflect.DelegatingMethodAccessorImpl.invoke(DelegatingMethodAccessorImpl.java:25)
	at java.lang.reflect.Method.invoke(Method.java:597)
	at org.codehaus.plexus.classworlds.launcher.Launcher.launchEnhanced(Launcher.java:290)
	at org.codehaus.plexus.classworlds.launcher.Launcher.launch(Launcher.java:230)
	at org.codehaus.plexus.classworlds.launcher.Launcher.mainWithExitCode(Launcher.java:409)
	at org.codehaus.plexus.classworlds.launcher.Launcher.main(Launcher.java:352)
Caused by: org.apache.maven.plugin.MojoExecutionException: Failure or timeout
	at org.apache.maven.plugin.surefire.SurefirePlugin.assertNoFailureOrTimeout(SurefirePlugin.java:643)
	at org.apache.maven.plugin.surefire.SurefirePlugin.handleSummary(SurefirePlugin.java:624)
	at org.apache.maven.plugin.surefire.AbstractSurefireMojo.executeAfterPreconditionsChecked(AbstractSurefireMojo.java:137)
	at org.apache.maven.plugin.surefire.AbstractSurefireMojo.execute(AbstractSurefireMojo.java:98)
	at org.apache.maven.plugin.DefaultBuildPluginManager.executeMojo(DefaultBuildPluginManager.java:101)
	at org.apache.maven.lifecycle.internal.MojoExecutor.execute(MojoExecutor.java:209)
	... 23 more
[ERROR] 
[ERROR] 
[ERROR] For more information about the errors and possible solutions, please read the following
articles:
[ERROR] [Help 1] http://cwiki.apache.org/confluence/display/MAVEN/MojoExecutionException
Build step 'Invoke top-level Maven targets' marked build as failure
Archiving artifacts
Sending artifact delta relative to HBase-0.94-security #511
Archived 953 artifacts
Archive block size is 32768
Received 46 blocks and 139455427 bytes
Compression is 1.1%
Took 45 sec
Updating HBASE-11767
Recording test results

Mime
View raw message