hbase-builds mailing list archives

Site index · List index
Message view « Date » · « Thread »
Top « Date » · « Thread »
From Apache Jenkins Server <jenk...@builds.apache.org>
Subject Build failed in Jenkins: HBase-TRUNK #5447
Date Fri, 29 Aug 2014 19:39:27 GMT
See <https://builds.apache.org/job/HBase-TRUNK/5447/changes>

Changes:

[stack] HBASE-11726 Master should fail-safe if starting with a pre 0.96 layout (Esteban Guiterrez)

------------------------------------------
[...truncated 990 lines...]
Running org.apache.hadoop.hbase.mapreduce.hadoopbackport.TestJarFinder
Tests run: 4, Failures: 0, Errors: 0, Skipped: 0, Time elapsed: 3.201 sec - in org.apache.hadoop.hbase.mapreduce.hadoopbackport.TestJarFinder
Running org.apache.hadoop.hbase.mapreduce.TestTableSplit
Tests run: 3, Failures: 0, Errors: 0, Skipped: 0, Time elapsed: 1.13 sec - in org.apache.hadoop.hbase.mapreduce.TestTableSplit
Running org.apache.hadoop.hbase.TestSerialization
Tests run: 9, Failures: 0, Errors: 0, Skipped: 0, Time elapsed: 3.266 sec - in org.apache.hadoop.hbase.TestSerialization
Running org.apache.hadoop.hbase.util.TestCompressionTest
Tests run: 2, Failures: 0, Errors: 0, Skipped: 0, Time elapsed: 1.025 sec - in org.apache.hadoop.hbase.util.TestCompressionTest
Running org.apache.hadoop.hbase.util.TestSortedCopyOnWriteSet
Tests run: 2, Failures: 0, Errors: 0, Skipped: 0, Time elapsed: 0.662 sec - in org.apache.hadoop.hbase.util.TestSortedCopyOnWriteSet
Running org.apache.hadoop.hbase.util.TestRegionSizeCalculator
Tests run: 3, Failures: 0, Errors: 0, Skipped: 0, Time elapsed: 1.704 sec - in org.apache.hadoop.hbase.util.TestRegionSizeCalculator
Running org.apache.hadoop.hbase.util.TestRootPath
Tests run: 1, Failures: 0, Errors: 0, Skipped: 0, Time elapsed: 0.665 sec - in org.apache.hadoop.hbase.util.TestRootPath
Running org.apache.hadoop.hbase.util.TestIncrementingEnvironmentEdge
Tests run: 1, Failures: 0, Errors: 0, Skipped: 0, Time elapsed: 0.648 sec - in org.apache.hadoop.hbase.util.TestIncrementingEnvironmentEdge
Running org.apache.hadoop.hbase.util.TestTableName
Tests run: 4, Failures: 0, Errors: 0, Skipped: 0, Time elapsed: 1.145 sec - in org.apache.hadoop.hbase.util.TestTableName
Running org.apache.hadoop.hbase.util.TestByteBloomFilter
Tests run: 5, Failures: 0, Errors: 0, Skipped: 0, Time elapsed: 2.658 sec - in org.apache.hadoop.hbase.util.TestByteBloomFilter
Running org.apache.hadoop.hbase.util.TestHBaseFsckComparator
Tests run: 6, Failures: 0, Errors: 0, Skipped: 0, Time elapsed: 1.057 sec - in org.apache.hadoop.hbase.util.TestHBaseFsckComparator
Running org.apache.hadoop.hbase.util.TestRegionSplitCalculator
Tests run: 15, Failures: 0, Errors: 0, Skipped: 0, Time elapsed: 1.883 sec - in org.apache.hadoop.hbase.util.TestRegionSplitCalculator
Running org.apache.hadoop.hbase.util.TestPoolMap$TestRoundRobinPoolType
Tests run: 3, Failures: 0, Errors: 0, Skipped: 0, Time elapsed: 1.009 sec - in org.apache.hadoop.hbase.util.TestPoolMap$TestRoundRobinPoolType
Running org.apache.hadoop.hbase.util.TestPoolMap$TestThreadLocalPoolType
Tests run: 3, Failures: 0, Errors: 0, Skipped: 0, Time elapsed: 0.292 sec - in org.apache.hadoop.hbase.util.TestPoolMap$TestThreadLocalPoolType
Running org.apache.hadoop.hbase.util.TestPoolMap$TestReusablePoolType
Tests run: 3, Failures: 0, Errors: 0, Skipped: 0, Time elapsed: 0.463 sec - in org.apache.hadoop.hbase.util.TestPoolMap$TestReusablePoolType
Running org.apache.hadoop.hbase.util.TestHFileArchiveUtil
Tests run: 4, Failures: 0, Errors: 0, Skipped: 0, Time elapsed: 2.52 sec - in org.apache.hadoop.hbase.util.TestHFileArchiveUtil
Running org.apache.hadoop.hbase.util.TestBoundedPriorityBlockingQueue
Tests run: 7, Failures: 0, Errors: 0, Skipped: 0, Time elapsed: 2.405 sec - in org.apache.hadoop.hbase.util.TestBoundedPriorityBlockingQueue
Running org.apache.hadoop.hbase.util.TestByteBufferUtils
Tests run: 12, Failures: 0, Errors: 0, Skipped: 0, Time elapsed: 2.535 sec - in org.apache.hadoop.hbase.util.TestByteBufferUtils
Running org.apache.hadoop.hbase.filter.TestNullComparator
Tests run: 3, Failures: 0, Errors: 0, Skipped: 0, Time elapsed: 0.955 sec - in org.apache.hadoop.hbase.filter.TestNullComparator
Running org.apache.hadoop.hbase.filter.TestFilter
Tests run: 21, Failures: 0, Errors: 0, Skipped: 0, Time elapsed: 12.851 sec - in org.apache.hadoop.hbase.filter.TestFilter
Running org.apache.hadoop.hbase.filter.TestInclusiveStopFilter
Tests run: 2, Failures: 0, Errors: 0, Skipped: 0, Time elapsed: 0.711 sec - in org.apache.hadoop.hbase.filter.TestInclusiveStopFilter
Running org.apache.hadoop.hbase.filter.TestDependentColumnFilter
Tests run: 4, Failures: 0, Errors: 0, Skipped: 0, Time elapsed: 4.909 sec - in org.apache.hadoop.hbase.filter.TestDependentColumnFilter
Running org.apache.hadoop.hbase.filter.TestParseFilter
Tests run: 34, Failures: 0, Errors: 0, Skipped: 0, Time elapsed: 3.946 sec - in org.apache.hadoop.hbase.filter.TestParseFilter
Running org.apache.hadoop.hbase.filter.TestComparatorSerialization
Tests run: 6, Failures: 0, Errors: 0, Skipped: 0, Time elapsed: 2.747 sec - in org.apache.hadoop.hbase.filter.TestComparatorSerialization
Running org.apache.hadoop.hbase.filter.TestMultipleColumnPrefixFilter
Tests run: 3, Failures: 0, Errors: 0, Skipped: 0, Time elapsed: 11.296 sec - in org.apache.hadoop.hbase.filter.TestMultipleColumnPrefixFilter
Running org.apache.hadoop.hbase.filter.TestColumnPaginationFilter
Tests run: 1, Failures: 0, Errors: 0, Skipped: 0, Time elapsed: 1.808 sec - in org.apache.hadoop.hbase.filter.TestColumnPaginationFilter
Running org.apache.hadoop.hbase.filter.TestRandomRowFilter
Tests run: 2, Failures: 0, Errors: 0, Skipped: 0, Time elapsed: 1.319 sec - in org.apache.hadoop.hbase.filter.TestRandomRowFilter
Running org.apache.hadoop.hbase.filter.TestSingleColumnValueFilter
Tests run: 2, Failures: 0, Errors: 0, Skipped: 0, Time elapsed: 1.73 sec - in org.apache.hadoop.hbase.filter.TestSingleColumnValueFilter
Running org.apache.hadoop.hbase.filter.TestPageFilter
Tests run: 2, Failures: 0, Errors: 0, Skipped: 0, Time elapsed: 0.967 sec - in org.apache.hadoop.hbase.filter.TestPageFilter
Running org.apache.hadoop.hbase.filter.TestFilterSerialization
Tests run: 25, Failures: 0, Errors: 0, Skipped: 0, Time elapsed: 4.776 sec - in org.apache.hadoop.hbase.filter.TestFilterSerialization
Running org.apache.hadoop.hbase.filter.TestInvocationRecordFilter
Tests run: 1, Failures: 0, Errors: 0, Skipped: 0, Time elapsed: 3.46 sec - in org.apache.hadoop.hbase.filter.TestInvocationRecordFilter
Running org.apache.hadoop.hbase.filter.TestFilterList
Tests run: 7, Failures: 0, Errors: 0, Skipped: 0, Time elapsed: 2.347 sec - in org.apache.hadoop.hbase.filter.TestFilterList
Running org.apache.hadoop.hbase.filter.TestFirstKeyValueMatchingQualifiersFilter
Tests run: 1, Failures: 0, Errors: 0, Skipped: 0, Time elapsed: 0.471 sec - in org.apache.hadoop.hbase.filter.TestFirstKeyValueMatchingQualifiersFilter
Running org.apache.hadoop.hbase.filter.TestFuzzyRowFilter
Tests run: 2, Failures: 0, Errors: 0, Skipped: 0, Time elapsed: 0.84 sec - in org.apache.hadoop.hbase.filter.TestFuzzyRowFilter
Running org.apache.hadoop.hbase.filter.TestPrefixFilter
Tests run: 3, Failures: 0, Errors: 0, Skipped: 0, Time elapsed: 0.798 sec - in org.apache.hadoop.hbase.filter.TestPrefixFilter
Running org.apache.hadoop.hbase.filter.TestSingleColumnValueExcludeFilter
Tests run: 1, Failures: 0, Errors: 0, Skipped: 0, Time elapsed: 0.538 sec - in org.apache.hadoop.hbase.filter.TestSingleColumnValueExcludeFilter
Running org.apache.hadoop.hbase.filter.TestBitComparator
Tests run: 6, Failures: 0, Errors: 0, Skipped: 0, Time elapsed: 1.294 sec - in org.apache.hadoop.hbase.filter.TestBitComparator
Running org.apache.hadoop.hbase.filter.TestColumnPrefixFilter
Tests run: 2, Failures: 0, Errors: 0, Skipped: 0, Time elapsed: 9.081 sec - in org.apache.hadoop.hbase.filter.TestColumnPrefixFilter
Running org.apache.hadoop.hbase.TestServerName
Tests run: 6, Failures: 0, Errors: 0, Skipped: 0, Time elapsed: 1.223 sec - in org.apache.hadoop.hbase.TestServerName
Running org.apache.hadoop.hbase.TestPerformanceEvaluation
Tests run: 4, Failures: 0, Errors: 0, Skipped: 1, Time elapsed: 1.247 sec - in org.apache.hadoop.hbase.TestPerformanceEvaluation
Running org.apache.hadoop.hbase.TestServerLoad
Tests run: 2, Failures: 0, Errors: 0, Skipped: 0, Time elapsed: 0.746 sec - in org.apache.hadoop.hbase.TestServerLoad
Running org.apache.hadoop.hbase.client.TestPutDeleteEtcCellIteration
Tests run: 6, Failures: 0, Errors: 0, Skipped: 0, Time elapsed: 1.152 sec - in org.apache.hadoop.hbase.client.TestPutDeleteEtcCellIteration
Running org.apache.hadoop.hbase.client.TestConnectionUtils
Tests run: 1, Failures: 0, Errors: 0, Skipped: 0, Time elapsed: 0.772 sec - in org.apache.hadoop.hbase.client.TestConnectionUtils
Running org.apache.hadoop.hbase.client.TestIntraRowPagination
Tests run: 1, Failures: 0, Errors: 0, Skipped: 0, Time elapsed: 3.326 sec - in org.apache.hadoop.hbase.client.TestIntraRowPagination
Running org.apache.hadoop.hbase.client.TestResult
Tests run: 7, Failures: 0, Errors: 0, Skipped: 0, Time elapsed: 1.323 sec - in org.apache.hadoop.hbase.client.TestResult
Running org.apache.hadoop.hbase.client.TestHBaseAdminNoCluster
Tests run: 1, Failures: 0, Errors: 0, Skipped: 0, Time elapsed: 3.969 sec - in org.apache.hadoop.hbase.client.TestHBaseAdminNoCluster
Running org.apache.hadoop.hbase.protobuf.TestProtobufUtil
Tests run: 7, Failures: 0, Errors: 0, Skipped: 0, Time elapsed: 2.672 sec - in org.apache.hadoop.hbase.protobuf.TestProtobufUtil
Running org.apache.hadoop.hbase.protobuf.TestReplicationProtobuf
Tests run: 1, Failures: 0, Errors: 0, Skipped: 0, Time elapsed: 0.7 sec - in org.apache.hadoop.hbase.protobuf.TestReplicationProtobuf
Running org.apache.hadoop.hbase.procedure.TestProcedureMember
Tests run: 8, Failures: 0, Errors: 0, Skipped: 0, Time elapsed: 2.052 sec - in org.apache.hadoop.hbase.procedure.TestProcedureMember
Running org.apache.hadoop.hbase.procedure.TestProcedureManager
Tests run: 1, Failures: 0, Errors: 0, Skipped: 0, Time elapsed: 2.031 sec - in org.apache.hadoop.hbase.procedure.TestProcedureManager
Running org.apache.hadoop.hbase.procedure.TestProcedure
Tests run: 4, Failures: 0, Errors: 0, Skipped: 0, Time elapsed: 1.738 sec - in org.apache.hadoop.hbase.procedure.TestProcedure
Running org.apache.hadoop.hbase.procedure.TestProcedureCoordinator
Tests run: 7, Failures: 0, Errors: 0, Skipped: 0, Time elapsed: 1.387 sec - in org.apache.hadoop.hbase.procedure.TestProcedureCoordinator
Running org.apache.hadoop.hbase.constraint.TestConstraints
Tests run: 6, Failures: 0, Errors: 0, Skipped: 0, Time elapsed: 2.253 sec - in org.apache.hadoop.hbase.constraint.TestConstraints
Running org.apache.hadoop.hbase.rest.TestGZIPResponseWrapper
Tests run: 4, Failures: 0, Errors: 0, Skipped: 0, Time elapsed: 1.074 sec - in org.apache.hadoop.hbase.rest.TestGZIPResponseWrapper
Running org.apache.hadoop.hbase.rest.client.TestRemoteAdminRetries
Tests run: 7, Failures: 0, Errors: 0, Skipped: 0, Time elapsed: 2.481 sec - in org.apache.hadoop.hbase.rest.client.TestRemoteAdminRetries
Running org.apache.hadoop.hbase.rest.client.TestRemoteHTableRetries
Tests run: 7, Failures: 0, Errors: 0, Skipped: 0, Time elapsed: 2.651 sec - in org.apache.hadoop.hbase.rest.client.TestRemoteHTableRetries
Running org.apache.hadoop.hbase.rest.model.TestVersionModel
Tests run: 6, Failures: 0, Errors: 0, Skipped: 0, Time elapsed: 1.456 sec - in org.apache.hadoop.hbase.rest.model.TestVersionModel
Running org.apache.hadoop.hbase.rest.model.TestStorageClusterVersionModel
Tests run: 6, Failures: 0, Errors: 0, Skipped: 0, Time elapsed: 1.204 sec - in org.apache.hadoop.hbase.rest.model.TestStorageClusterVersionModel
Running org.apache.hadoop.hbase.rest.model.TestColumnSchemaModel
Tests run: 6, Failures: 0, Errors: 0, Skipped: 0, Time elapsed: 1.212 sec - in org.apache.hadoop.hbase.rest.model.TestColumnSchemaModel
Running org.apache.hadoop.hbase.rest.model.TestCellModel
Tests run: 6, Failures: 0, Errors: 0, Skipped: 0, Time elapsed: 1.324 sec - in org.apache.hadoop.hbase.rest.model.TestCellModel
Running org.apache.hadoop.hbase.rest.model.TestTableListModel
Tests run: 6, Failures: 0, Errors: 0, Skipped: 0, Time elapsed: 1.208 sec - in org.apache.hadoop.hbase.rest.model.TestTableListModel
Running org.apache.hadoop.hbase.rest.model.TestStorageClusterStatusModel
Tests run: 6, Failures: 0, Errors: 0, Skipped: 0, Time elapsed: 1.388 sec - in org.apache.hadoop.hbase.rest.model.TestStorageClusterStatusModel
Running org.apache.hadoop.hbase.rest.model.TestScannerModel
Tests run: 6, Failures: 0, Errors: 0, Skipped: 0, Time elapsed: 1.359 sec - in org.apache.hadoop.hbase.rest.model.TestScannerModel
Running org.apache.hadoop.hbase.rest.model.TestTableSchemaModel
Tests run: 6, Failures: 0, Errors: 0, Skipped: 0, Time elapsed: 1.379 sec - in org.apache.hadoop.hbase.rest.model.TestTableSchemaModel
Running org.apache.hadoop.hbase.rest.model.TestTableInfoModel
Tests run: 6, Failures: 0, Errors: 0, Skipped: 0, Time elapsed: 1.272 sec - in org.apache.hadoop.hbase.rest.model.TestTableInfoModel
Running org.apache.hadoop.hbase.rest.model.TestTableRegionModel
Tests run: 8, Failures: 0, Errors: 0, Skipped: 0, Time elapsed: 1.547 sec - in org.apache.hadoop.hbase.rest.model.TestTableRegionModel
Running org.apache.hadoop.hbase.rest.model.TestRowModel
Tests run: 6, Failures: 0, Errors: 0, Skipped: 0, Time elapsed: 1.333 sec - in org.apache.hadoop.hbase.rest.model.TestRowModel
Running org.apache.hadoop.hbase.rest.model.TestCellSetModel
Tests run: 6, Failures: 0, Errors: 0, Skipped: 0, Time elapsed: 1.379 sec - in org.apache.hadoop.hbase.rest.model.TestCellSetModel
Running org.apache.hadoop.hbase.TestHTableDescriptor
Tests run: 11, Failures: 0, Errors: 0, Skipped: 0, Time elapsed: 3.298 sec - in org.apache.hadoop.hbase.TestHTableDescriptor
Running org.apache.hadoop.hbase.snapshot.TestRestoreSnapshotHelper
Tests run: 1, Failures: 0, Errors: 0, Skipped: 0, Time elapsed: 4.756 sec - in org.apache.hadoop.hbase.snapshot.TestRestoreSnapshotHelper
Running org.apache.hadoop.hbase.coprocessor.TestRegionObserverStacking
Tests run: 1, Failures: 0, Errors: 0, Skipped: 0, Time elapsed: 2.876 sec - in org.apache.hadoop.hbase.coprocessor.TestRegionObserverStacking
Running org.apache.hadoop.hbase.coprocessor.TestCoprocessorInterface
Tests run: 2, Failures: 0, Errors: 0, Skipped: 0, Time elapsed: 17.881 sec - in org.apache.hadoop.hbase.coprocessor.TestCoprocessorInterface
Running org.apache.hadoop.hbase.executor.TestExecutorService
Tests run: 1, Failures: 0, Errors: 0, Skipped: 0, Time elapsed: 3.38 sec - in org.apache.hadoop.hbase.executor.TestExecutorService
Running org.apache.hadoop.hbase.zookeeper.TestZooKeeperMainServer
Tests run: 2, Failures: 0, Errors: 0, Skipped: 0, Time elapsed: 2.443 sec - in org.apache.hadoop.hbase.zookeeper.TestZooKeeperMainServer
Running org.apache.hadoop.hbase.zookeeper.TestZKConfig
Tests run: 1, Failures: 0, Errors: 0, Skipped: 0, Time elapsed: 0.808 sec - in org.apache.hadoop.hbase.zookeeper.TestZKConfig
Running org.apache.hadoop.hbase.metrics.TestMetricsHistogram
Tests run: 3, Failures: 0, Errors: 0, Skipped: 0, Time elapsed: 1.787 sec - in org.apache.hadoop.hbase.metrics.TestMetricsHistogram
Running org.apache.hadoop.hbase.TestHColumnDescriptor
Tests run: 3, Failures: 0, Errors: 0, Skipped: 0, Time elapsed: 2.835 sec - in org.apache.hadoop.hbase.TestHColumnDescriptor
Running org.apache.hadoop.hbase.monitoring.TestMemoryBoundedLogMessageBuffer
Tests run: 2, Failures: 0, Errors: 0, Skipped: 0, Time elapsed: 0.914 sec - in org.apache.hadoop.hbase.monitoring.TestMemoryBoundedLogMessageBuffer
Running org.apache.hadoop.hbase.monitoring.TestTaskMonitor
Tests run: 3, Failures: 0, Errors: 0, Skipped: 0, Time elapsed: 1.786 sec - in org.apache.hadoop.hbase.monitoring.TestTaskMonitor

Results :

Failed tests: 
  TestReplicationThrottler.testThrottling:69 null

Tests run: 916, Failures: 1, Errors: 0, Skipped: 7

[INFO] ------------------------------------------------------------------------
[INFO] Reactor Summary:
[INFO] 
[INFO] HBase ............................................. SUCCESS [7.072s]
[INFO] HBase - Common .................................... SUCCESS [1:59.785s]
[INFO] HBase - Protocol .................................. SUCCESS [18.350s]
[INFO] HBase - Client .................................... SUCCESS [1:24.127s]
[INFO] HBase - Hadoop Compatibility ...................... SUCCESS [10.238s]
[INFO] HBase - Hadoop Two Compatibility .................. SUCCESS [12.826s]
[INFO] HBase - Prefix Tree ............................... SUCCESS [17.615s]
[INFO] HBase - Server .................................... FAILURE [25:29.771s]
[INFO] HBase - Testing Util .............................. SKIPPED
[INFO] HBase - Thrift .................................... SKIPPED
[INFO] HBase - Shell ..................................... SKIPPED
[INFO] HBase - Integration Tests ......................... SKIPPED
[INFO] HBase - Examples .................................. SKIPPED
[INFO] HBase - Assembly .................................. SKIPPED
[INFO] ------------------------------------------------------------------------
[INFO] BUILD FAILURE
[INFO] ------------------------------------------------------------------------
[INFO] Total time: 30:01.343s
[INFO] Finished at: Fri Aug 29 19:34:45 UTC 2014
[INFO] Final Memory: 64M/911M
[INFO] ------------------------------------------------------------------------
[ERROR] Failed to execute goal org.apache.maven.plugins:maven-surefire-plugin:2.17:test (default-test)
on project hbase-server: There are test failures.
[ERROR] 
[ERROR] Please refer to <https://builds.apache.org/job/HBase-TRUNK/ws/hbase-server/target/surefire-reports>
for the individual test results.
[ERROR] -> [Help 1]
[ERROR] 
[ERROR] To see the full stack trace of the errors, re-run Maven with the -e switch.
[ERROR] Re-run Maven using the -X switch to enable full debug logging.
[ERROR] 
[ERROR] For more information about the errors and possible solutions, please read the following
articles:
[ERROR] [Help 1] http://cwiki.apache.org/confluence/display/MAVEN/MojoFailureException
[ERROR] 
[ERROR] After correcting the problems, you can resume the build with the command
[ERROR]   mvn <goals> -rf :hbase-server
Build step 'Invoke top-level Maven targets' marked build as failure
Performing Post build task...
Match found for :.* : True
Logical operation result is TRUE
Running script  :   ZOMBIE_TESTS_COUNT=`jps | grep surefirebooter | wc -l`
  if [[ $ZOMBIE_TESTS_COUNT != 0 ]] ; then
    #It seems sometimes the tests are not dying immediately. Let's give them 10s
    echo "Suspicious java process found - waiting 10s to see if there are just slow to stop"
    sleep 10   
    ZOMBIE_TESTS_COUNT=`jps | grep surefirebooter | wc -l`
    if [[ $ZOMBIE_TESTS_COUNT != 0 ]] ; then
      echo "There are $ZOMBIE_TESTS_COUNT zombie tests, they should have been killed by surefire
but survived"
      echo "************ BEGIN zombies jstack extract"
      ZB_STACK=`jps | grep surefirebooter | cut -d ' ' -f 1 | xargs -n 1 jstack | grep ".test"
| grep "\.java"`
      jps | grep surefirebooter | cut -d ' ' -f 1 | xargs -n 1 jstack
      echo "************ END  zombies jstack extract"
      JIRA_COMMENT="$JIRA_COMMENT

     {color:red}-1 core zombie tests{color}.  There are ${ZOMBIE_TESTS_COUNT} zombie test(s):
${ZB_STACK}"
      BAD=1
      jps | grep surefirebooter | cut -d ' ' -f 1 | xargs kill -9
    else
      echo "We're ok: there is no zombie test, but some tests took some time to stop"
    fi
  else
    echo "We're ok: there is no zombie test"
  fi
[HBase-TRUNK] $ /bin/bash -xe /tmp/hudson980608546984394541.sh
++ grep surefirebooter
++ jps
++ wc -l
+ ZOMBIE_TESTS_COUNT=0
+ [[ 0 != 0 ]]
+ echo 'We'\''re ok: there is no zombie test'
We're ok: there is no zombie test
POST BUILD TASK : SUCCESS
END OF POST BUILD TASK : 0
Archiving artifacts
Sending artifact delta relative to HBase-TRUNK #5442
Archived 892 artifacts
Archive block size is 32768
Received 8 blocks and 33650968 bytes
Compression is 0.8%
Took 48 sec
Recording test results
Updating HBASE-11726

Mime
View raw message